<?xml version="1.0" encoding="UTF-8" standalone="no"?>
<!DOCTYPE svg PUBLIC "-//W3C//DTD SVG 1.1//EN" "http://www.w3.org/Graphics/SVG/1.1/DTD/svg11.dtd">
<svg width="100%" height="100%" viewBox="0 0 261 70" version="1.1" xmlns="http://www.w3.org/2000/svg" xmlns:xlink="http://www.w3.org/1999/xlink" xml:space="preserve" xmlns:serif="http://www.serif.com/" style="fill-rule:evenodd;clip-rule:evenodd;">
    <path d="M62.4,65.2L62.4,42.4C62.4,37.6 60.4,35.2 56.5,35.2C52.6,35.2 50.6,37.6 50.6,42.4L50.6,65.2L38.9,65.2L38.9,42.4C38.9,37.6 37,35.2 33.1,35.2C29.2,35.2 27.2,37.6 27.2,42.4L27.2,65.2L15.6,65.2L15.6,41.1C15.6,36.1 17.3,32.4 20.8,29.8C23.8,27.5 28,26.4 33.1,26.4C38.4,26.4 42.2,27.7 44.7,30.4C46.8,27.7 50.7,26.4 56.4,26.4C61.6,26.4 65.7,27.5 68.7,29.8C72.2,32.4 73.9,36.1 73.9,41.1L73.9,65.3L62.4,65.3L62.4,65.2Z" style="fill:white;fill-rule:nonzero;"/>
    <path d="M96,66.2C90.1,66.2 85.3,64.3 81.4,60.6C77.6,56.9 75.6,52.1 75.6,46.2C75.6,40.3 77.5,35.5 81.4,31.8C85.2,28.1 90.1,26.2 96,26.2C101.9,26.2 106.8,28.1 110.6,31.8C114.5,35.5 116.4,40.3 116.4,46.2C116.4,52.1 114.5,56.9 110.6,60.6C106.7,64.3 101.8,66.2 96,66.2ZM96,35.5C93.2,35.5 91,36.6 89.5,38.7C88,40.8 87.2,43.3 87.2,46.3C87.2,49.2 87.9,51.7 89.3,53.7C90.9,56 93.1,57.1 95.9,57.1C98.7,57.1 100.9,56 102.5,53.7C104,51.7 104.7,49.2 104.7,46.3C104.7,43.4 104,40.9 102.6,38.9C101.1,36.6 98.8,35.5 96,35.5Z" style="fill:white;fill-rule:nonzero;"/>
    <path d="M138,66.2C132.1,66.2 127.3,64.3 123.4,60.6C119.6,56.9 117.6,52.1 117.6,46.2C117.6,40.3 119.5,35.5 123.4,31.8C127.2,28.1 132.1,26.2 138,26.2C143.9,26.2 148.8,28.1 152.6,31.8C156.5,35.5 158.4,40.3 158.4,46.2C158.4,52.1 156.5,56.9 152.6,60.6C148.7,64.3 143.8,66.2 138,66.2ZM138,35.5C135.2,35.5 133,36.6 131.5,38.7C130,40.8 129.2,43.3 129.2,46.3C129.2,49.2 129.9,51.7 131.3,53.7C132.9,56 135.1,57.1 137.9,57.1C140.7,57.1 142.9,56 144.5,53.7C146,51.7 146.7,49.2 146.7,46.3C146.7,43.4 146,40.9 144.6,38.9C143.1,36.6 140.8,35.5 138,35.5Z" style="fill:white;fill-rule:nonzero;"/>
    <path d="M189.8,65.1L189.8,61.3C188.8,62.7 187,63.8 184.5,64.6C182.3,65.4 180.2,65.7 178.2,65.7C172.7,65.7 168.2,63.8 164.9,60C161.5,56.2 159.9,51.5 159.9,45.9C159.9,40.4 161.5,35.7 164.8,32C168.1,28.3 172.5,26.4 177.9,26.4C184.1,26.4 188,28.1 189.8,31.4L189.8,0L201.1,0L201.1,65.1L189.8,65.1ZM189.8,43.5C189.8,41.4 188.8,39.4 186.8,37.5C184.8,35.6 182.8,34.6 180.7,34.6C177.7,34.6 175.4,35.8 173.6,38.2C172.1,40.3 171.3,43 171.3,46.1C171.3,49.1 172.1,51.7 173.6,53.9C175.3,56.4 177.7,57.6 180.7,57.6C182.5,57.6 184.4,56.8 186.6,55.1C188.7,53.4 189.8,51.7 189.8,49.9L189.8,43.5Z" style="fill:white;fill-rule:nonzero;"/>
    <rect x="205.2" y="0" width="11.6" height="65.1" style="fill:white;fill-rule:nonzero;"/>
    <path d="M230.7,49.7C231.2,52.1 232.4,54.1 234.2,55.8C236.1,57.5 238.1,58.4 240.4,58.4C242,58.4 243.7,58 245.6,57.2C247.9,56.2 249,55.1 249,53.8L261.2,53.7C259.5,57.8 256.5,61 252.4,63.2C248.5,65.3 244.3,66.4 239.6,66.4C233.7,66.4 228.7,64.5 224.8,60.9C220.9,57.2 218.9,52.4 218.9,46.4C218.9,40.2 220.9,35.4 224.8,31.7C228.7,28.1 233.8,26.3 240,26.3C246.8,26.3 252.1,28.5 255.9,33C259.4,37.1 261.2,42.7 261.2,49.7L230.7,49.7ZM249.7,42.5C249.2,40 248.2,38 246.6,36.4C244.8,34.7 242.7,33.8 240.4,33.8C238,33.8 236,34.6 234.3,36.3C232.7,38 231.6,40 231,42.5L249.7,42.5Z" style="fill:white;fill-rule:nonzero;"/>
    <path d="M16.7,32.2C16.3,34.2 15.9,36.2 15.5,38.2C26.5,41.9 36.9,38.3 42.4,28.7C34.3,23.1 26.8,28.8 16.7,32.2" style="fill:rgb(88,89,91);fill-rule:nonzero;"/>
    <path d="M16.7,30.7C16.3,33 16,35.2 15.6,37.5C26.1,41.1 36.4,38 41.9,28.6C34.9,20.5 27.1,27.2 16.7,30.7" style="fill:url(#_Linear1);fill-rule:nonzero;"/>
    <path d="M29.2,33.4C24.4,32.4 19.2,34.9 15.6,37.5C13.3,20.7 23.7,21.1 37.3,25.3C36.4,29.4 34.9,34.9 32.3,38.2C32.2,36 31.2,34.5 29.2,33.4" style="fill:url(#_Linear2);fill-rule:nonzero;"/>
    <path d="M1.2,30.7C18.8,20.1 28.7,18.1 49.2,16C25.4,34.8 24.8,30.7 1.2,30.7" style="fill:url(#_Linear3);fill-rule:nonzero;"/>
    <path d="M49.2,16.1L30.3,29.8" style="fill:rgb(56,55,56);fill-rule:nonzero;stroke:rgb(74,74,76);stroke-width:0.5px;"/>
    <path d="M26.7,23.4C26.9,25.6 26.4,21.3 26.7,23.4" style="fill:rgb(35,31,32);fill-opacity:0.23;fill-rule:nonzero;"/>
    <path d="M1.2,30.7L30.3,29.8" style="fill:white;fill-rule:nonzero;stroke:rgb(168,171,173);stroke-width:0.5px;"/>
    <path d="M24.9,23.6C19.9,25 3.5,28.6 3.3,30.7C2.8,34.6 3.2,40.8 3.2,40.8" style="fill:none;stroke:rgb(241,105,34);stroke-width:0.5px;"/>
    <path d="M4.7,55.7C2.9,51.2 0.7,46.2 3.3,40C5,45.8 4.7,50.2 4.7,55.7" style="fill:rgb(241,105,34);fill-rule:nonzero;"/>
    <g transform="matrix(0.942,-0.3356,0.3356,0.942,-6.4098,9.4684)">
        <ellipse cx="24.2" cy="23.3" rx="0.8" ry="0.4" style="fill:rgb(109,110,112);"/>
    </g>
    <defs>
        <linearGradient id="_Linear1" x1="0" y1="0" x2="1" y2="0" gradientUnits="userSpaceOnUse" gradientTransform="matrix(26.2607,0,0,26.2607,15.5879,31.877)"><stop offset="0" style="stop-color:rgb(146,148,151);stop-opacity:1"/><stop offset="0.12" style="stop-color:rgb(117,117,120);stop-opacity:1"/><stop offset="0.28" style="stop-color:rgb(87,86,88);stop-opacity:1"/><stop offset="0.44" style="stop-color:rgb(64,62,63);stop-opacity:1"/><stop offset="0.61" style="stop-color:rgb(48,45,46);stop-opacity:1"/><stop offset="0.79" style="stop-color:rgb(38,34,35);stop-opacity:1"/><stop offset="1" style="stop-color:rgb(35,31,32);stop-opacity:1"/></linearGradient>
        <linearGradient id="_Linear2" x1="0" y1="0" x2="1" y2="0" gradientUnits="userSpaceOnUse" gradientTransform="matrix(10.9035,15.5719,-15.5719,10.9035,20.6187,23.1113)"><stop offset="0" style="stop-color:rgb(35,31,32);stop-opacity:1"/><stop offset="1" style="stop-color:rgb(35,31,32);stop-opacity:0"/></linearGradient>
        <linearGradient id="_Linear3" x1="0" y1="0" x2="1" y2="0" gradientUnits="userSpaceOnUse" gradientTransform="matrix(47.999,0,0,47.999,1.167,23.5879)"><stop offset="0" style="stop-color:rgb(146,148,151);stop-opacity:1"/><stop offset="0.12" style="stop-color:rgb(117,117,120);stop-opacity:1"/><stop offset="0.28" style="stop-color:rgb(87,86,88);stop-opacity:1"/><stop offset="0.44" style="stop-color:rgb(64,62,63);stop-opacity:1"/><stop offset="0.61" style="stop-color:rgb(48,45,46);stop-opacity:1"/><stop offset="0.79" style="stop-color:rgb(38,34,35);stop-opacity:1"/><stop offset="1" style="stop-color:rgb(35,31,32);stop-opacity:1"/></linearGradient>
    </defs>
</svg>
