Commuters0;21.825003911259124;6.12247615974;46.1949621284
Commuters3;23.61365629109655;6.11663969357;46.2218845306
Commuters4;22.77543826170111;6.11940592844;46.214719393
Commuters11;19.36740850055401;6.10952431705;46.1948102678
Commuters18;23.504872109523593;6.13788942644;46.2005390146
Commuters19;23.472321487299716;6.05703242426;46.2211705856
Commuters24;20.11743805364583;6.15050190507;46.2150786389
Commuters30;25.08177433576857;6.10250433715;46.1641378846
Commuters34;22.058153850440906;6.19504890465;46.1939861975
Commuters39;22.320373180747712;6.11022714505;46.1660285207
Commuters57;22.66598362036005;6.05434925032;46.2247365135
Commuters58;25.8159944123627;6.10956826544;46.1930114074
Commuters70;22.763278163507987;6.08554005464;46.2215159618
Commuters72;21.42830571048753;6.13067981143;46.1770638553
Commuters74;21.68621733055556;6.09327041657;46.2234077633
Commuters78;23.445811578357475;6.13309671325;46.1842893335
Commuters89;21.21162158118122;6.22565216118;46.2159114706
Commuters90;21.0862328898926;6.14341340915;46.1862076503
Commuters94;21.63203159181216;6.13037708305;46.189655927
Commuters98;21.552592143998158;6.13037708305;46.189655927
Commuters99;22.840262025367718;6.10390224577;46.2127376997
Commuters106;22.468976613563388;6.15101304375;46.1934921155
Commuters110;19.934253456461942;6.13784640785;46.2023378864
Commuters115;24.212607703896815;6.11022714505;46.1660285207
Commuters119;23.946835540854174;6.11923134896;46.2219148581
Commuters120;24.0512129466387;6.10768214103;46.1641991296
Commuters121;22.264439511668098;6.14850804561;46.1898647671
Commuters123;24.655231523269276;6.00374898242;46.177319615
Commuters125;22.253490664515333;6.11470504551;46.1948711904
Commuters130;19.13732879079165;6.09840950932;46.22526829
Commuters140;20.379233245266594;6.14095215435;46.1807812634
Commuters141;21.0510761162745;6.15356087247;46.1953205317
Commuters144;21.5310609981235;6.1484227239;46.193462517
Commuters145;23.32381814843246;6.1560240416;46.2007466475
Commuters146;23.411494010426264;6.13551425676;46.1915147627
Commuters169;23.022543218468197;6.14587515465;46.191633985
Commuters178;24.50432927030341;6.1428993244;46.2077941316
Commuters200;25.35951333277047;6.07821527106;46.2034339842
Commuters212;24.294646821255355;6.15080011827;46.2024864977
Commuters216;22.80798705108338;6.03940056821;46.2011598796
Commuters226;22.13091009571176;6.097503834;46.1568809929
Commuters227;20.39834973592835;6.15356087247;46.1953205317
Commuters231;26.24958621787221;6.14531921403;46.2150193591
Commuters236;22.12278829754748;6.14850804561;46.1898647671
Commuters237;21.972508613858952;6.06994511424;46.2231273141
Commuters238;25.16828716172135;6.10609676237;46.2289580729
Commuters239;26.298586916040584;6.14048007732;46.2005688547
Commuters240;25.850767175343236;6.10622902052;46.2235614873
Commuters250;22.22492522503681;6.14604611781;46.1844384903
Commuters251;21.373102712300838;6.15080011827;46.2024864977
Commuters253;24.397480667875996;6.14587515465;46.191633985
Commuters265;26.14056884702524;6.13309671325;46.1842893335
Commuters266;20.916186749308306;6.13042033848;46.1878570591
Commuters268;21.218872265475202;6.11220240262;46.1912430362
Commuters270;20.118506336328856;6.20771584203;46.2067205289
Commuters274;23.635703216229164;6.08267928668;46.2322779782
Commuters277;23.423694657740157;6.1484227239;46.193462517
Commuters279;26.01230273358126;6.13042033848;46.1878570591
Commuters280;26.103065035778023;6.14820937057;46.2024568943
Commuters281;25.79794494947198;6.13214644506;46.2238644756
Commuters283;21.02584425639377;6.14583240684;46.193432859
Commuters288;21.859087039862633;6.13236253574;46.2148701192
Commuters294;26.202910742513136;6.08607700986;46.1999297296
Commuters296;21.49556794325912;6.15334836087;46.2043149195
Commuters297;21.997167339838587;6.15853004142;46.204373831
Commuters298;21.207962110287614;6.14833739097;46.1970602675
Commuters302;26.278333427931898;6.05953276558;46.2247999674
Commuters310;19.224328947498357;6.15219959073;46.2528846701
Commuters332;19.655679859940754;6.11022714505;46.1660285207
Commuters333;19.98598912304826;6.15853004142;46.204373831
Commuters335;23.242999809630753;6.14786785944;46.2168479056
Commuters338;26.229596475435983;6.06280730041;46.1978489525
Commuters341;20.34822431299922;6.16901941071;46.1990942902
Commuters342;20.442738426846372;6.13538497823;46.1969113736
Commuters344;21.39955801919354;6.15356087247;46.1953205317
Commuters346;26.35706022302082;6.10755016925;46.1695957003
Commuters351;22.20062703429455;6.05434925032;46.2247365135
Commuters368;24.13745267865966;6.1484227239;46.193462517
Commuters382;20.196877537818896;6.16461711388;46.2764171581
Commuters408;19.474405254715123;6.13763127251;46.211332248
Commuters430;24.099737875736853;6.19665358351;46.2371882032
Commuters431;20.653873463387914;6.14022243694;46.211362094
Commuters441;29.627301978346253;6.08035682242;46.2214537013
Commuters466;26.861780760054607;6.16107863195;46.2062020785
Commuters477;25.80818868239439;6.14786785944;46.2168479056
Commuters478;21.476745519724425;6.1009570584;46.2270978957
Commuters481;21.83767455145884;6.14544755017;46.2096227322
Commuters483;24.606789437624585;6.14294218028;46.2059952574
Commuters486;21.113483404801208;6.10372562281;46.2199331403
Commuters494;21.281421119334123;6.09987119547;46.1659060267
Commuters504;25.295914808251943;6.14315641743;46.1970008882
Commuters525;20.84931692117453;6.21544833647;46.2086039656
Commuters527;21.56140622072473;6.13741606646;46.2203266129
Commuters530;23.994567393129472;6.14829472031;46.1988591429
Commuters537;26.65088376656606;6.05703242426;46.2211705856
Commuters549;21.02524668031908;6.13534187973;46.1987102442
Commuters550;24.5712228316978;6.13288086379;46.1932836778
Commuters552;26.078598164174153;6.13313987464;46.1824904651
Commuters553;21.686589110534207;6.10509323764;46.1641685368
Commuters556;22.90192376134365;6.14048007732;46.2005688547
Commuters557;22.565150602124003;6.14570414657;46.1988294821
Commuters569;21.93489651047259;6.18197243204;46.1992393255
Commuters572;21.534312044327187;6.1122462597;46.1894441751
Commuters632;22.86298526415397;6.14803863745;46.2096523989
Commuters645;22.875065531423417;6.11013933192;46.1696262367
Commuters649;20.710494677852914;6.12212789185;46.2093530567
Commuters655;26.129551107949364;6.10148795478;46.2055115858
Commuters657;23.259181917104428;6.13020403291;46.1968514
Commuters662;21.05511588367059;6.14803863745;46.2096523989
Commuters683;24.446696576465992;6.21544833647;46.2086039656
Commuters686;21.807421195383707;6.1484227239;46.193462517
Commuters691;25.102487165300115;6.10399053985;46.2091399801
Commuters694;22.539820237714963;6.21711008963;46.2500068008
Commuters698;22.06835284336409;6.05453241645;46.2175411491
Commuters699;21.49228235912584;6.14255637598;46.2221851306
Commuters702;23.237861444323322;6.20277915246;46.1958705006
Commuters707;22.36544025662932;6.05439504637;46.2229376722
Commuters708;21.141815416921546;6.13581580763;46.1789226762
Commuters722;22.753641577863057;6.10438771963;46.1929502492
Commuters738;23.116273149397152;6.14341340915;46.1862076503
Commuters747;22.883094593165104;6.13551425676;46.1915147627
Commuters753;22.175077334403838;6.15062972753;46.2096820061
Commuters775;21.268133002064616;6.14557586101;46.2042261065
Commuters787;20.439936130628634;6.13020403291;46.1968514
Commuters790;19.613367530188597;6.14549032326;46.2078238568
Commuters805;27.264536374770927;6.13270813318;46.2004791559
Commuters821;22.207937270532202;6.17674948315;46.2009803759
Commuters832;19.462072465961274;6.1433277565;46.1898053956
Commuters837;22.581905067793866;6.12147439585;46.2363360703
Commuters845;20.448257155251163;6.1481666915;46.2042557703
Commuters850;23.533465004838714;6.14056593488;46.1969711095
Commuters883;23.401236088650034;6.1560240416;46.2007466475
Commuters887;22.11153093404309;6.15339086878;46.2025160417
Commuters897;20.799996672108417;6.14298503334;46.2041963832
Commuters903;25.559131186037803;6.10882075003;46.2235920537
Commuters910;23.636489903436498;6.13292403935;46.1914848086
Commuters911;23.842112944703914;6.15598162207;46.2025455262
Commuters913;30.52936215034687;6.07821527106;46.2034339842
Commuters920;24.55155875836892;6.14578965622;46.1952317332
Commuters922;19.809230254762415;6.14820937057;46.2024568943
Commuters924;24.54872849389917;6.13516945739;46.2059057281
Commuters928;20.568116854430343;6.11013933192;46.1696262367
Commuters929;23.17842097776017;6.0620789856;46.2266304497
Commuters930;23.544284510203685;6.09590655435;46.2216397694
Commuters934;23.1887905851296;6.10148795478;46.2055115858
Commuters940;21.248790067080193;6.14341340915;46.1862076503
Commuters947;22.421625410180003;6.12783029783;46.1878269881
Commuters954;23.208500416234905;6.07571466615;46.1998050197
Commuters957;22.074184089506286;6.15339086878;46.2025160417
Commuters961;20.603574342929374;6.14557586101;46.2042261065
Commuters972;21.473313272951845;6.14043714431;46.2023677276
Commuters984;22.885492485367813;6.15598162207;46.2025455262
Commuters992;21.110866662486675;6.15088529686;46.1988887444
Commuters997;22.60433970727422;6.15343337389;46.2007171639
Commuters1008;22.180367914271574;6.10693395715;46.1947797174
Commuters1009;22.30041722839852;6.10864474265;46.2307875054
Commuters1016;21.140911439504066;6.14319925642;46.1952020148
Commuters1023;21.009835380363082;6.12778695686;46.189625855
Commuters1045;22.375576205139915;6.14557586101;46.2042261065
Commuters1048;22.99673833859676;6.10600857577;46.2325557972
Commuters1067;19.040707144679292;6.11119289427;46.2326168805
Commuters1077;26.460606355787707;6.05944150705;46.2283976545
Commuters1100;25.988244848076718;6.10755016925;46.1695957003
Commuters1108;25.73692014255004;6.1428993244;46.2077941316
Commuters1151;22.453061736384367;6.13313987464;46.1824904651
Commuters1164;23.2482979009519;6.14315641743;46.1970008882
Commuters1184;24.9221011461043;6.10860073357;46.2325863686
Commuters1189;29.165332646618356;6.16120538538;46.2008054362
Commuters1193;21.308267157584933;6.18197243204;46.1992393255
Commuters1204;21.865751248840443;6.21978383316;46.2464370123
Commuters1218;21.696223106326965;6.14082343989;46.1861778773
Commuters1221;21.061585515863058;6.10456416863;46.1857548171
Commuters1222;20.93933817786875;6.12476241153;46.2075843909
Commuters1238;21.64835838965835;6.14294218028;46.2059952574
Commuters1240;23.40484634621107;6.10763815332;46.1659979863
Commuters1250;21.35234835725709;6.13309671325;46.1842893335
Commuters1266;25.387044208593007;6.14557586101;46.2042261065
Commuters1315;21.657800905357618;6.17152620016;46.2027211849
Commuters1317;22.277240412599898;6.16396468488;46.1936392167
Commuters1338;21.558940923427798;6.13270813318;46.2004791559
Commuters1341;21.716721714298945;6.13538497823;46.1969113736
Commuters1342;27.1941085240248;6.09885277917;46.2072797085
Commuters1365;21.87375172873158;6.10600857577;46.2325557972
Commuters1381;20.982710242393104;6.1481666915;46.2042557703
Commuters1383;21.22343700066238;6.10241601699;46.1677355942
Commuters1393;19.925737425370446;6.14850804561;46.1898647671
Commuters1394;18.92270583035012;6.13072304698;46.1752649886
Commuters1396;21.388346840084743;6.14549032326;46.2078238568
Commuters1400;20.821441110675636;6.15593919975;46.204344405
Commuters1402;21.10619698880147;6.14319925642;46.1952020148
Commuters1414;25.703010873955677;6.10860073357;46.2325863686
Commuters1424;21.858626837917452;6.19916397094;46.2408144898
Commuters1430;21.397710623641395;6.14095215435;46.1807812634
Commuters1437;23.045570007490245;6.16150104625;46.1882132762
Commuters1447;20.849078564842248;6.14311357563;46.1987997618
Commuters1452;21.41603576627566;6.12476241153;46.2075843909
Commuters1474;20.86991104138414;6.15080011827;46.2024864977
Commuters1525;22.57227653910884;6.13288086379;46.1932836778
Commuters1526;23.71256129214475;6.1428993244;46.2077941316
Commuters1543;20.490633075870655;6.1484227239;46.193462517
