<mxfile host="app.diagrams.net" modified="2023-07-13T18:38:07.050Z" agent="Mozilla/5.0 (Windows NT 10.0; Win64; x64; rv:109.0) Gecko/20100101 Firefox/115.0" etag="jr4QdbztGvfJmpcn-V_k" version="21.6.2" type="device">
  <diagram name="Page-1" id="oi6kN0kyAx9UfaX32Alo">
    <mxGraphModel dx="880" dy="442" grid="1" gridSize="10" guides="1" tooltips="1" connect="1" arrows="0" fold="1" page="1" pageScale="1" pageWidth="827" pageHeight="1169" math="0" shadow="0">
      <root>
        <mxCell id="0" />
        <mxCell id="1" parent="0" />
        <mxCell id="SEwabkKMf9jXg1j8-Y_7-1" value="" style="ellipse;html=1;shape=startState;fillColor=#000000;strokeColor=#ff0000;" vertex="1" parent="1">
          <mxGeometry x="425" y="40" width="30" height="30" as="geometry" />
        </mxCell>
        <mxCell id="SEwabkKMf9jXg1j8-Y_7-2" value="" style="edgeStyle=orthogonalEdgeStyle;html=1;verticalAlign=bottom;endArrow=open;endSize=8;strokeColor=#ff0000;rounded=0;entryX=0.5;entryY=0.6;entryDx=0;entryDy=0;entryPerimeter=0;" edge="1" source="SEwabkKMf9jXg1j8-Y_7-1" parent="1" target="SEwabkKMf9jXg1j8-Y_7-3">
          <mxGeometry relative="1" as="geometry">
            <mxPoint x="435" y="130" as="targetPoint" />
          </mxGeometry>
        </mxCell>
        <mxCell id="SEwabkKMf9jXg1j8-Y_7-6" style="edgeStyle=orthogonalEdgeStyle;rounded=0;orthogonalLoop=1;jettySize=auto;html=1;exitX=0.25;exitY=0.5;exitDx=0;exitDy=0;exitPerimeter=0;entryX=0.5;entryY=0;entryDx=0;entryDy=0;" edge="1" parent="1" source="SEwabkKMf9jXg1j8-Y_7-3" target="SEwabkKMf9jXg1j8-Y_7-5">
          <mxGeometry relative="1" as="geometry" />
        </mxCell>
        <mxCell id="SEwabkKMf9jXg1j8-Y_7-9" style="edgeStyle=orthogonalEdgeStyle;rounded=0;orthogonalLoop=1;jettySize=auto;html=1;exitX=0.75;exitY=0.5;exitDx=0;exitDy=0;exitPerimeter=0;entryX=0.5;entryY=0;entryDx=0;entryDy=0;" edge="1" parent="1" source="SEwabkKMf9jXg1j8-Y_7-3" target="SEwabkKMf9jXg1j8-Y_7-8">
          <mxGeometry relative="1" as="geometry" />
        </mxCell>
        <mxCell id="SEwabkKMf9jXg1j8-Y_7-3" value="Called 50 per second by physics engine" style="shape=line;html=1;strokeWidth=6;strokeColor=#ff0000;labelPosition=center;verticalLabelPosition=bottom;align=center;verticalAlign=top;" vertex="1" parent="1">
          <mxGeometry x="340" y="100" width="200" height="10" as="geometry" />
        </mxCell>
        <mxCell id="SEwabkKMf9jXg1j8-Y_7-4" value="" style="edgeStyle=orthogonalEdgeStyle;html=1;verticalAlign=bottom;endArrow=classic;endSize=6;rounded=0;endFill=1;entryX=0.5;entryY=0;entryDx=0;entryDy=0;" edge="1" source="SEwabkKMf9jXg1j8-Y_7-3" parent="1" target="SEwabkKMf9jXg1j8-Y_7-7">
          <mxGeometry relative="1" as="geometry">
            <mxPoint x="435" y="160" as="targetPoint" />
          </mxGeometry>
        </mxCell>
        <mxCell id="SEwabkKMf9jXg1j8-Y_7-11" style="edgeStyle=orthogonalEdgeStyle;rounded=0;orthogonalLoop=1;jettySize=auto;html=1;exitX=0.5;exitY=1;exitDx=0;exitDy=0;entryX=0.5;entryY=0;entryDx=0;entryDy=0;" edge="1" parent="1" source="SEwabkKMf9jXg1j8-Y_7-5" target="SEwabkKMf9jXg1j8-Y_7-10">
          <mxGeometry relative="1" as="geometry" />
        </mxCell>
        <mxCell id="SEwabkKMf9jXg1j8-Y_7-5" value="Init" style="rounded=1;whiteSpace=wrap;html=1;" vertex="1" parent="1">
          <mxGeometry x="160" y="160" width="120" height="40" as="geometry" />
        </mxCell>
        <mxCell id="SEwabkKMf9jXg1j8-Y_7-22" style="edgeStyle=orthogonalEdgeStyle;rounded=0;orthogonalLoop=1;jettySize=auto;html=1;exitX=0.5;exitY=1;exitDx=0;exitDy=0;entryX=0.5;entryY=0;entryDx=0;entryDy=0;" edge="1" parent="1" source="SEwabkKMf9jXg1j8-Y_7-7" target="SEwabkKMf9jXg1j8-Y_7-21">
          <mxGeometry relative="1" as="geometry" />
        </mxCell>
        <mxCell id="SEwabkKMf9jXg1j8-Y_7-7" value="&lt;div&gt;Actuation&lt;/div&gt;(Execution loop)" style="rounded=1;whiteSpace=wrap;html=1;" vertex="1" parent="1">
          <mxGeometry x="380" y="160" width="120" height="40" as="geometry" />
        </mxCell>
        <mxCell id="SEwabkKMf9jXg1j8-Y_7-15" style="edgeStyle=orthogonalEdgeStyle;rounded=0;orthogonalLoop=1;jettySize=auto;html=1;exitX=0.5;exitY=1;exitDx=0;exitDy=0;entryX=0.5;entryY=0;entryDx=0;entryDy=0;" edge="1" parent="1" source="SEwabkKMf9jXg1j8-Y_7-8" target="SEwabkKMf9jXg1j8-Y_7-12">
          <mxGeometry relative="1" as="geometry" />
        </mxCell>
        <mxCell id="SEwabkKMf9jXg1j8-Y_7-8" value="Resume" style="rounded=1;whiteSpace=wrap;html=1;" vertex="1" parent="1">
          <mxGeometry x="600" y="160" width="120" height="40" as="geometry" />
        </mxCell>
        <mxCell id="SEwabkKMf9jXg1j8-Y_7-19" style="edgeStyle=orthogonalEdgeStyle;rounded=0;orthogonalLoop=1;jettySize=auto;html=1;exitX=0.5;exitY=1;exitDx=0;exitDy=0;entryX=0.5;entryY=0;entryDx=0;entryDy=0;" edge="1" parent="1" source="SEwabkKMf9jXg1j8-Y_7-10" target="SEwabkKMf9jXg1j8-Y_7-17">
          <mxGeometry relative="1" as="geometry" />
        </mxCell>
        <mxCell id="SEwabkKMf9jXg1j8-Y_7-10" value="Get joint handles" style="rounded=1;whiteSpace=wrap;html=1;" vertex="1" parent="1">
          <mxGeometry x="160" y="220" width="120" height="40" as="geometry" />
        </mxCell>
        <mxCell id="SEwabkKMf9jXg1j8-Y_7-16" style="edgeStyle=orthogonalEdgeStyle;rounded=0;orthogonalLoop=1;jettySize=auto;html=1;exitX=0.5;exitY=1;exitDx=0;exitDy=0;entryX=0.5;entryY=0;entryDx=0;entryDy=0;" edge="1" parent="1" source="SEwabkKMf9jXg1j8-Y_7-12" target="SEwabkKMf9jXg1j8-Y_7-14">
          <mxGeometry relative="1" as="geometry" />
        </mxCell>
        <mxCell id="SEwabkKMf9jXg1j8-Y_7-12" value="Reset counter" style="rounded=1;whiteSpace=wrap;html=1;" vertex="1" parent="1">
          <mxGeometry x="600" y="220" width="120" height="40" as="geometry" />
        </mxCell>
        <mxCell id="SEwabkKMf9jXg1j8-Y_7-20" style="edgeStyle=orthogonalEdgeStyle;rounded=0;orthogonalLoop=1;jettySize=auto;html=1;exitX=0.5;exitY=1;exitDx=0;exitDy=0;entryX=0.5;entryY=0;entryDx=0;entryDy=0;" edge="1" parent="1" source="SEwabkKMf9jXg1j8-Y_7-14" target="SEwabkKMf9jXg1j8-Y_7-18">
          <mxGeometry relative="1" as="geometry" />
        </mxCell>
        <mxCell id="SEwabkKMf9jXg1j8-Y_7-14" value="Set joint target configuration" style="rounded=1;whiteSpace=wrap;html=1;" vertex="1" parent="1">
          <mxGeometry x="600" y="280" width="120" height="40" as="geometry" />
        </mxCell>
        <mxCell id="SEwabkKMf9jXg1j8-Y_7-17" value="" style="ellipse;html=1;shape=endState;fillColor=#000000;strokeColor=#ff0000;" vertex="1" parent="1">
          <mxGeometry x="205" y="290" width="30" height="30" as="geometry" />
        </mxCell>
        <mxCell id="SEwabkKMf9jXg1j8-Y_7-18" value="" style="ellipse;html=1;shape=endState;fillColor=#000000;strokeColor=#ff0000;" vertex="1" parent="1">
          <mxGeometry x="645" y="360" width="30" height="30" as="geometry" />
        </mxCell>
        <mxCell id="SEwabkKMf9jXg1j8-Y_7-24" value="Yes" style="edgeStyle=orthogonalEdgeStyle;rounded=0;orthogonalLoop=1;jettySize=auto;html=1;exitX=0.5;exitY=1;exitDx=0;exitDy=0;entryX=0.5;entryY=0;entryDx=0;entryDy=0;" edge="1" parent="1" source="SEwabkKMf9jXg1j8-Y_7-21" target="SEwabkKMf9jXg1j8-Y_7-23">
          <mxGeometry relative="1" as="geometry" />
        </mxCell>
        <mxCell id="SEwabkKMf9jXg1j8-Y_7-30" value="No" style="edgeStyle=orthogonalEdgeStyle;rounded=0;orthogonalLoop=1;jettySize=auto;html=1;exitX=1;exitY=0.5;exitDx=0;exitDy=0;entryX=0.5;entryY=0;entryDx=0;entryDy=0;" edge="1" parent="1" source="SEwabkKMf9jXg1j8-Y_7-21" target="SEwabkKMf9jXg1j8-Y_7-28">
          <mxGeometry relative="1" as="geometry">
            <Array as="points">
              <mxPoint x="520" y="260" />
              <mxPoint x="520" y="460" />
            </Array>
          </mxGeometry>
        </mxCell>
        <mxCell id="SEwabkKMf9jXg1j8-Y_7-21" value="&lt;div&gt;Has&lt;/div&gt;&lt;div&gt;trajectory to&lt;/div&gt;&lt;div&gt;downoad ?&lt;/div&gt;" style="rhombus;whiteSpace=wrap;html=1;" vertex="1" parent="1">
          <mxGeometry x="380" y="220" width="120" height="80" as="geometry" />
        </mxCell>
        <mxCell id="SEwabkKMf9jXg1j8-Y_7-27" style="edgeStyle=orthogonalEdgeStyle;rounded=0;orthogonalLoop=1;jettySize=auto;html=1;exitX=0.5;exitY=1;exitDx=0;exitDy=0;entryX=0.5;entryY=0;entryDx=0;entryDy=0;" edge="1" parent="1" source="SEwabkKMf9jXg1j8-Y_7-23" target="SEwabkKMf9jXg1j8-Y_7-26">
          <mxGeometry relative="1" as="geometry" />
        </mxCell>
        <mxCell id="SEwabkKMf9jXg1j8-Y_7-23" value="Download trajectory" style="rounded=1;whiteSpace=wrap;html=1;" vertex="1" parent="1">
          <mxGeometry x="380" y="340" width="120" height="40" as="geometry" />
        </mxCell>
        <mxCell id="SEwabkKMf9jXg1j8-Y_7-29" style="edgeStyle=orthogonalEdgeStyle;rounded=0;orthogonalLoop=1;jettySize=auto;html=1;exitX=0.5;exitY=1;exitDx=0;exitDy=0;entryX=0.5;entryY=0;entryDx=0;entryDy=0;" edge="1" parent="1" source="SEwabkKMf9jXg1j8-Y_7-26" target="SEwabkKMf9jXg1j8-Y_7-28">
          <mxGeometry relative="1" as="geometry" />
        </mxCell>
        <mxCell id="SEwabkKMf9jXg1j8-Y_7-26" value="Reset counter" style="rounded=1;whiteSpace=wrap;html=1;" vertex="1" parent="1">
          <mxGeometry x="380" y="400" width="120" height="40" as="geometry" />
        </mxCell>
        <mxCell id="SEwabkKMf9jXg1j8-Y_7-36" value="Yes" style="edgeStyle=orthogonalEdgeStyle;rounded=0;orthogonalLoop=1;jettySize=auto;html=1;exitX=0.5;exitY=1;exitDx=0;exitDy=0;entryX=0.5;entryY=0;entryDx=0;entryDy=0;" edge="1" parent="1" source="SEwabkKMf9jXg1j8-Y_7-28" target="SEwabkKMf9jXg1j8-Y_7-35">
          <mxGeometry relative="1" as="geometry" />
        </mxCell>
        <mxCell id="SEwabkKMf9jXg1j8-Y_7-42" value="No" style="edgeStyle=orthogonalEdgeStyle;rounded=0;orthogonalLoop=1;jettySize=auto;html=1;exitX=1;exitY=0.5;exitDx=0;exitDy=0;entryX=0;entryY=0.5;entryDx=0;entryDy=0;" edge="1" parent="1" source="SEwabkKMf9jXg1j8-Y_7-28" target="SEwabkKMf9jXg1j8-Y_7-41">
          <mxGeometry relative="1" as="geometry" />
        </mxCell>
        <mxCell id="SEwabkKMf9jXg1j8-Y_7-28" value="&lt;div&gt;Still more&lt;/div&gt;&lt;div&gt;point in&lt;/div&gt;&lt;div&gt;trajectory ?&lt;/div&gt;" style="rhombus;whiteSpace=wrap;html=1;" vertex="1" parent="1">
          <mxGeometry x="380" y="460" width="120" height="80" as="geometry" />
        </mxCell>
        <mxCell id="SEwabkKMf9jXg1j8-Y_7-50" style="edgeStyle=orthogonalEdgeStyle;rounded=0;orthogonalLoop=1;jettySize=auto;html=1;exitX=0.5;exitY=1;exitDx=0;exitDy=0;entryX=0.5;entryY=0;entryDx=0;entryDy=0;" edge="1" parent="1" source="SEwabkKMf9jXg1j8-Y_7-31" target="SEwabkKMf9jXg1j8-Y_7-49">
          <mxGeometry relative="1" as="geometry" />
        </mxCell>
        <mxCell id="SEwabkKMf9jXg1j8-Y_7-31" value="&lt;div&gt;Set joint target configuration&lt;/div&gt;(physics engine make the joint move)" style="rounded=1;whiteSpace=wrap;html=1;" vertex="1" parent="1">
          <mxGeometry x="380" y="880" width="120" height="80" as="geometry" />
        </mxCell>
        <mxCell id="SEwabkKMf9jXg1j8-Y_7-44" style="edgeStyle=orthogonalEdgeStyle;rounded=0;orthogonalLoop=1;jettySize=auto;html=1;exitX=0.5;exitY=1;exitDx=0;exitDy=0;entryX=0.5;entryY=0;entryDx=0;entryDy=0;" edge="1" parent="1" source="SEwabkKMf9jXg1j8-Y_7-33" target="SEwabkKMf9jXg1j8-Y_7-43">
          <mxGeometry relative="1" as="geometry" />
        </mxCell>
        <mxCell id="SEwabkKMf9jXg1j8-Y_7-33" value="Increase counter" style="rounded=1;whiteSpace=wrap;html=1;" vertex="1" parent="1">
          <mxGeometry x="380" y="700" width="120" height="40" as="geometry" />
        </mxCell>
        <mxCell id="SEwabkKMf9jXg1j8-Y_7-37" value="Yes" style="edgeStyle=orthogonalEdgeStyle;rounded=0;orthogonalLoop=1;jettySize=auto;html=1;exitX=0.5;exitY=1;exitDx=0;exitDy=0;entryX=0.5;entryY=0;entryDx=0;entryDy=0;" edge="1" parent="1" source="SEwabkKMf9jXg1j8-Y_7-35" target="SEwabkKMf9jXg1j8-Y_7-33">
          <mxGeometry relative="1" as="geometry" />
        </mxCell>
        <mxCell id="SEwabkKMf9jXg1j8-Y_7-39" value="No" style="edgeStyle=orthogonalEdgeStyle;rounded=0;orthogonalLoop=1;jettySize=auto;html=1;exitX=1;exitY=0.5;exitDx=0;exitDy=0;entryX=0;entryY=0.5;entryDx=0;entryDy=0;" edge="1" parent="1" source="SEwabkKMf9jXg1j8-Y_7-35" target="SEwabkKMf9jXg1j8-Y_7-38">
          <mxGeometry relative="1" as="geometry" />
        </mxCell>
        <mxCell id="SEwabkKMf9jXg1j8-Y_7-35" value="&lt;div&gt;Is target&amp;nbsp;&lt;/div&gt;&lt;div&gt;reached ?&lt;/div&gt;" style="rhombus;whiteSpace=wrap;html=1;" vertex="1" parent="1">
          <mxGeometry x="380" y="580" width="120" height="80" as="geometry" />
        </mxCell>
        <mxCell id="SEwabkKMf9jXg1j8-Y_7-38" value="" style="ellipse;html=1;shape=endState;fillColor=#000000;strokeColor=#ff0000;" vertex="1" parent="1">
          <mxGeometry x="550" y="605" width="30" height="30" as="geometry" />
        </mxCell>
        <mxCell id="SEwabkKMf9jXg1j8-Y_7-41" value="" style="ellipse;html=1;shape=endState;fillColor=#000000;strokeColor=#ff0000;" vertex="1" parent="1">
          <mxGeometry x="550" y="485" width="30" height="30" as="geometry" />
        </mxCell>
        <mxCell id="SEwabkKMf9jXg1j8-Y_7-45" value="Yes" style="edgeStyle=orthogonalEdgeStyle;rounded=0;orthogonalLoop=1;jettySize=auto;html=1;exitX=0.5;exitY=1;exitDx=0;exitDy=0;entryX=0.5;entryY=0;entryDx=0;entryDy=0;" edge="1" parent="1" source="SEwabkKMf9jXg1j8-Y_7-43" target="SEwabkKMf9jXg1j8-Y_7-31">
          <mxGeometry relative="1" as="geometry" />
        </mxCell>
        <mxCell id="SEwabkKMf9jXg1j8-Y_7-47" value="No" style="edgeStyle=orthogonalEdgeStyle;rounded=0;orthogonalLoop=1;jettySize=auto;html=1;exitX=1;exitY=0.5;exitDx=0;exitDy=0;entryX=0;entryY=0.5;entryDx=0;entryDy=0;" edge="1" parent="1" source="SEwabkKMf9jXg1j8-Y_7-43" target="SEwabkKMf9jXg1j8-Y_7-46">
          <mxGeometry relative="1" as="geometry" />
        </mxCell>
        <mxCell id="SEwabkKMf9jXg1j8-Y_7-43" value="&lt;div&gt;Still more&lt;/div&gt;&lt;div&gt;point in&lt;/div&gt;&lt;div&gt;trajectory ?&lt;/div&gt;" style="rhombus;whiteSpace=wrap;html=1;" vertex="1" parent="1">
          <mxGeometry x="380" y="760" width="120" height="80" as="geometry" />
        </mxCell>
        <mxCell id="SEwabkKMf9jXg1j8-Y_7-51" style="edgeStyle=orthogonalEdgeStyle;rounded=0;orthogonalLoop=1;jettySize=auto;html=1;exitX=1;exitY=0.5;exitDx=0;exitDy=0;entryX=0;entryY=0.5;entryDx=0;entryDy=0;" edge="1" parent="1" source="SEwabkKMf9jXg1j8-Y_7-46" target="SEwabkKMf9jXg1j8-Y_7-48">
          <mxGeometry relative="1" as="geometry" />
        </mxCell>
        <mxCell id="SEwabkKMf9jXg1j8-Y_7-46" value="Pause simulation" style="rounded=1;whiteSpace=wrap;html=1;" vertex="1" parent="1">
          <mxGeometry x="550" y="780" width="120" height="40" as="geometry" />
        </mxCell>
        <mxCell id="SEwabkKMf9jXg1j8-Y_7-48" value="" style="ellipse;html=1;shape=endState;fillColor=#000000;strokeColor=#ff0000;" vertex="1" parent="1">
          <mxGeometry x="710" y="785" width="30" height="30" as="geometry" />
        </mxCell>
        <mxCell id="SEwabkKMf9jXg1j8-Y_7-49" value="" style="ellipse;html=1;shape=endState;fillColor=#000000;strokeColor=#ff0000;" vertex="1" parent="1">
          <mxGeometry x="425" y="990" width="30" height="30" as="geometry" />
        </mxCell>
      </root>
    </mxGraphModel>
  </diagram>
</mxfile>
