\relax 
\citation{Wilson1974}
\citation{Kogut1983,Levin2005,Wiese2013}
\citation{Cirac2010,Zohar2011,Kapit2011,Zohar2012,Banerjee2012,Zohar2013,Banerjee2013,Zohar2013b,Tagliacozzo2013,Stannigel2014,Kasper2016,Cardarelli2017,Zache2018,barbiero2018}
\citation{Martinez2016}
\citation{Bernien2017}
\citation{Clark2018,Goerg2019,schweizer2019}
\citation{Mil2019}
\citation{Chandrasekharan1997}
\citation{dai2017four}
\citation{Celi2019,Bohrdt2019}
\citation{rokhsar1988}
\citation{Shastry1981,Anderson1987,Moessner2002,Ralko2005}
\citation{Bernien2017,Brenes2018,feldmeier2019emergent}
\citation{turner2018scars}
\citation{Banerjee2012,Zohar2012,Banerjee2013,Stannigel2014,Kasper2016,Zache2018,Mil2019}
\citation{Cardarelli2017}
\citation{Wirth2011}
\newlabel{FirstPage}{{}{1}{}{}{}}
\@writefile{toc}{\contentsline {title}{Deconfining disordered phase in two-dimensional quantum link models}{1}{}}
\@writefile{toc}{\contentsline {abstract}{Abstract}{1}{}}
\@writefile{lof}{\contentsline {figure}{\numberline {1}{\ignorespaces (a) Sketch of the QLM model on a square ladder\nobreakspace  {}(gray spins depict staggered boundary conditions) or on a torus (associating opposite gray spins at the two edges). (b-f) Sketches of the phases discussed in the text: for $\mu =0.8$ striped phases (b) $J_y=2.4 J_x$\nobreakspace  {}(Sy), (c) $J_y=0.2 J_x$\nobreakspace  {}(Sx); for $\mu =-0.8$ vortex-antivortex phases (d) $J_y=2.4 J_x$\nobreakspace  {}(VA) (e) $J_y=0.2 J_x$\nobreakspace  {}(VA$'$), and the (f) disordered/deconfined D phase for $\mu =0$ and $J_x=J_y$. The size of the bullets depicts $\delimiter "426830A n_{\mathbf  {r}}\delimiter "526930B $, the arrow size $\delimiter "426830A S_{\mathbf  {r},\mathbf  {r'}}^z\delimiter "526930B $, and the plaquette colors the vorticity $\delimiter "426830A Q_{\mathbf  {r}}\delimiter "526930B $. The arrow sizes of (f) has been scaled up by a factor of $2$ for clarity.}}{1}{}}
\newlabel{fig:sketch}{{1}{1}{}{}{}}
\@writefile{toc}{\contentsline {paragraph}{\numberline {}2D QLM.--}{1}{}}
\newlabel{eq:QLM}{{1}{1}{}{}{}}
\citation{Schollwock2011}
\citation{Dalmonte2016cont,Tschirsich2019,Chepiga2019dmrg,DMRGnote}
\citation{Arrows}
\citation{supmat}
\citation{Cardarelli2017}
\citation{supmat}
\citation{supmat}
\@writefile{lof}{\contentsline {figure}{\numberline {2}{\ignorespaces Four-leg cylinder at $\mu =0$: (a) Nearest and next-nearest neighbor flippability correlations, staggered flippability $O(Sy) = \DOTSB \sum@ \slimits@ _\mathbf  {r}(-)^x \delimiter "426830A Q_{\mathbf  {r}}^2 \delimiter "526930B $, as well as the expectation value of the ring-exchange $\delimiter "426830A R^+_{\mathbf  {r}} \delimiter "526930B $. (b) Fidelity susceptibility with $L=12$, $24$ and $36$ rungs. (c) Local Hilbert space distribution $\nu _k$ of the central rung\nobreakspace  {}(see text). (d) Sketched phase diagram of the QLM. Color codes depict the von-Neumann bipartite entanglement entropy $S_{vN}$ of the central rung. Points depicts the estimated phase transition points, by extrapolating the peak positions of the fidelity susceptibility evaluated along the cuts indicated by the dotted lines (DMRG data).}}{2}{}}
\newlabel{fig:4t_cuts_mu0}{{2}{2}{}{}{}}
\citation{supmat}
\citation{Cardarelli2017}
\citation{aklt}
\citation{supmat}
\citation{Cardarelli2017}
\citation{Tschirsich2019}
\@writefile{lof}{\contentsline {figure}{\numberline {3}{\ignorespaces (a) Parity and string order along the boundary legs of a four-leg ladder, obtained using DMRG for $L_x=100$ rungs and $\mu =0$; (b) largest eigenvalues of the entanglement spectrum, obtained after dividing the system into two parts along the central rung.}}{3}{}}
\newlabel{fig:entanglement_SO}{{3}{3}{}{}{}}
\@writefile{toc}{\contentsline {paragraph}{\numberline {}Edge Haldane order.--}{3}{}}
\newlabel{eq:QLM1D}{{2}{3}{}{}{}}
\@writefile{toc}{\contentsline {paragraph}{\numberline {}String tension.--}{3}{}}
\citation{turner2018scars,feldmeier2019emergent}
\bibdata{lgt2_paperNotes,references}
\bibcite{Wilson1974}{{1}{1974}{{Wilson}}{{}}}
\bibcite{Kogut1983}{{2}{1983}{{Kogut}}{{}}}
\bibcite{Levin2005}{{3}{2005}{{Levin\ and\ Wen}}{{}}}
\bibcite{Wiese2013}{{4}{2013}{{Wiese}}{{}}}
\bibcite{Cirac2010}{{5}{2010}{{Cirac\ \emph  {et~al.}}}{{Cirac, Maraner,\ and\ Pachos}}}
\bibcite{Zohar2011}{{6}{2011}{{Zohar\ and\ Reznik}}{{}}}
\bibcite{Kapit2011}{{7}{2011}{{Kapit\ and\ Mueller}}{{}}}
\bibcite{Zohar2012}{{8}{2012}{{Zohar\ \emph  {et~al.}}}{{Zohar, Cirac,\ and\ Reznik}}}
\bibcite{Banerjee2012}{{9}{2012}{{Banerjee\ \emph  {et~al.}}}{{Banerjee, Dalmonte, M{\"u}ller, Rico, Stebler, Wiese,\ and\ Zoller}}}
\bibcite{Zohar2013}{{10}{2013{}}{{Zohar\ \emph  {et~al.}}}{{Zohar, Cirac,\ and\ Reznik}}}
\bibcite{Banerjee2013}{{11}{2013}{{Banerjee\ \emph  {et~al.}}}{{Banerjee, B{\"o}gli, Dalmonte, Rico, Stebler, Wiese,\ and\ Zoller}}}
\bibcite{Zohar2013b}{{12}{2013{}}{{Zohar\ \emph  {et~al.}}}{{Zohar, Cirac,\ and\ Reznik}}}
\bibcite{Tagliacozzo2013}{{13}{2013}{{Tagliacozzo\ \emph  {et~al.}}}{{Tagliacozzo, Celi, Orland, Mitchell,\ and\ Lewenstein}}}
\bibcite{Stannigel2014}{{14}{2014}{{Stannigel\ \emph  {et~al.}}}{{Stannigel, Hauke, Marcos, Hafezi, Diehl, Dalmonte,\ and\ Zoller}}}
\bibcite{Kasper2016}{{15}{2016}{{Kasper\ \emph  {et~al.}}}{{Kasper, Hebenstreit, Oberthaler,\ and\ Berges}}}
\bibcite{Cardarelli2017}{{16}{2017}{{Cardarelli\ \emph  {et~al.}}}{{Cardarelli, Greschner,\ and\ Santos}}}
\bibcite{Zache2018}{{17}{2018}{{Zache\ \emph  {et~al.}}}{{Zache, Hebenstreit, Jendrzejewski, Oberthaler, Berges,\ and\ Hauke}}}
\bibcite{barbiero2018}{{18}{2019}{{Barbiero\ \emph  {et~al.}}}{{Barbiero, Schweizer, Aidelsburger, Demler, Goldman,\ and\ Grusdt}}}
\bibcite{Martinez2016}{{19}{2016}{{Martinez\ \emph  {et~al.}}}{{Martinez, Muschik, Schindler, Nigg, Erhard, Heyl, Hauke, Dalmonte, Monz, Zoller,\ and\ Blatt}}}
\bibcite{Bernien2017}{{20}{2017}{{Bernien\ \emph  {et~al.}}}{{Bernien, Schwartz, Keesling, Levine, Omran, Pichler, Choi, Zibrov, Endres, Greiner, Vuletic,\ and\ Lukin}}}
\bibcite{Clark2018}{{21}{2018}{{Clark\ \emph  {et~al.}}}{{Clark, Anderson, Feng, Gaj, Levin,\ and\ Chin}}}
\@writefile{lof}{\contentsline {figure}{\numberline {4}{\ignorespaces (a) Average fermionic density and bond configuration of two charges at a distance of $L_D=12$ sites, after substracting the charge-free configuration. We employ DMRG for a cylinder with $L_y=4$ legs and $L=36$ rungs and $\mu =0.4 J_x$. (a) Sy phase\nobreakspace  {}($J_y=1.8 J_x$), (b) Sx phase\nobreakspace  {}($J_y=0.4 J_x$), (c) D phase\nobreakspace  {}($J_y=J_x$). (d) String tension $S_T$ as a function of the distance between the defects $L_D$.}}{4}{}}
\newlabel{fig:config_4T_ST}{{4}{4}{}{}{}}
\@writefile{toc}{\contentsline {paragraph}{\numberline {}Conclusions.--}{4}{}}
\@writefile{toc}{\contentsline {section}{\numberline {}Acknowledgments}{4}{}}
\@writefile{toc}{\contentsline {section}{\numberline {}References}{4}{}}
\bibcite{Goerg2019}{{22}{2019}{{G{\"o}rg\ \emph  {et~al.}}}{{G{\"o}rg, Sandholzer, Minguzzi, Desbuquois, Messer,\ and\ Esslinger}}}
\bibcite{schweizer2019}{{23}{2019}{{Schweizer\ \emph  {et~al.}}}{{Schweizer, Grusdt, Berngruber, Barbiero, Demler, Goldman, Bloch,\ and\ Aidelsburger}}}
\bibcite{Mil2019}{{24}{2019}{{Mil\ \emph  {et~al.}}}{{Mil, Zache, Hegde, Xia, Bhatt, Oberthaler, Hauke, Berges,\ and\ Jendrzejewski}}}
\bibcite{Chandrasekharan1997}{{25}{1997}{{Chandrasekharan\ and\ Wiese}}{{}}}
\bibcite{dai2017four}{{26}{2017}{{Dai\ \emph  {et~al.}}}{{Dai, Yang, Reingruber, Sun, Xu, Chen, Yuan,\ and\ Pan}}}
\bibcite{Celi2019}{{27}{2019}{{Celi\ \emph  {et~al.}}}{{Celi, Vermersch, Viyuela, Pichler, Lukin,\ and\ Zoller}}}
\bibcite{Bohrdt2019}{{28}{2019}{{Bohrdt\ \emph  {et~al.}}}{{Bohrdt, Omran, Demler, Gazit,\ and\ Grusdt}}}
\bibcite{rokhsar1988}{{29}{1988}{{Rokhsar\ and\ Kivelson}}{{}}}
\bibcite{Shastry1981}{{30}{1981}{{Shastry\ and\ Sutherland}}{{}}}
\bibcite{Anderson1987}{{31}{1987}{{Anderson}}{{}}}
\bibcite{Moessner2002}{{32}{2002}{{Moessner\ and\ Sondhi}}{{}}}
\bibcite{Ralko2005}{{33}{2005}{{Ralko\ \emph  {et~al.}}}{{Ralko, Ferrero, Becca, Ivanov,\ and\ Mila}}}
\bibcite{Brenes2018}{{34}{2018}{{Brenes\ \emph  {et~al.}}}{{Brenes, Dalmonte, Heyl,\ and\ Scardicchio}}}
\bibcite{feldmeier2019emergent}{{35}{2019}{{Feldmeier\ \emph  {et~al.}}}{{Feldmeier, Pollmann,\ and\ Knap}}}
\bibcite{turner2018scars}{{36}{2018}{{Turner\ \emph  {et~al.}}}{{Turner, Michailidis, Abanin, Serbyn,\ and\ Papi{\'c}}}}
\bibcite{Wirth2011}{{37}{2011}{{Wirth\ \emph  {et~al.}}}{{Wirth, {\"O}lschl{\"a}ger,\ and\ Hemmerich}}}
\bibcite{Schollwock2011}{{38}{2011}{{Schollw{\"o}ck}}{{}}}
\bibcite{Dalmonte2016cont}{{39}{2016}{{Dalmonte\ and\ Montangero}}{{}}}
\bibcite{Tschirsich2019}{{40}{2019}{{Tschirsich\ \emph  {et~al.}}}{{Tschirsich, Montangero,\ and\ Dalmonte}}}
\bibcite{Chepiga2019dmrg}{{41}{2019}{{Chepiga\ and\ Mila}}{{}}}
\bibcite{DMRGnote}{{42}{}{{DMR}}{{}}}
\bibcite{Arrows}{{43}{}{{Arr}}{{}}}
\bibcite{supmat}{{44}{}{{sup}}{{}}}
\citation{aklt,Pollmann2010,Pollmann2012,Pollmann2012A}
\bibcite{aklt}{{45}{1987}{{Affleck\ \emph  {et~al.}}}{{Affleck, Kennedy, Lieb,\ and\ Tasaki}}}
\bibcite{Pollmann2010}{{46}{2010}{{Pollmann\ \emph  {et~al.}}}{{Pollmann, Turner, Berg,\ and\ Oshikawa}}}
\bibcite{Pollmann2012}{{47}{2012}{{Pollmann\ and\ Turner}}{{}}}
\bibcite{Pollmann2012A}{{48}{2012}{{Pollmann\ \emph  {et~al.}}}{{Pollmann, Berg, Turner,\ and\ Oshikawa}}}
\bibstyle{apsrev4-1}
\citation{REVTEX41Control}
\citation{apsrev41Control}
\newlabel{LastBibItem}{{48}{5}{}{}{}}
\newlabel{LastPage}{{}{5}{}{}{}}
