\relax 
\citation{Ralko2005}
\citation{Shastry1981,Anderson1987,Moessner2002,Ralko2005}
\citation{Tschirsich2019}
\citation{aklt}
\newlabel{FirstPage}{{}{1}{}{}{}}
\@writefile{toc}{\contentsline {title}{Supplementary material to "Deconfining disordered phase in two-dimensional quantum link models"}{1}{}}
\@writefile{toc}{\contentsline {abstract}{Abstract}{1}{}}
\@writefile{toc}{\contentsline {section}{\numberline {I}Relation to quantum dimer models}{1}{}}
\@writefile{toc}{\contentsline {section}{\numberline {II}Simplified 1D model}{1}{}}
\@writefile{lof}{\contentsline {figure}{\numberline {S1}{\ignorespaces Ground-state energy per site $E / L$ and average entanglement entropy $S_{vN}$ of the simplified 1D model\nobreakspace  {}(infinite DMRG simulation, $\chi =80$). The lighter colored curves depict the $\chi =2$ ansatz described in the main text and Eq.\nobreakspace  {}\textup  {\hbox {\mathsurround \z@ \normalfont  (\ignorespaces 3{}{}{}\hbox {}\unskip \@@italiccorr )}}.}}{1}{}}
\newlabel{fig:S_1d_m0}{{S1}{1}{}{}{}}
\newlabel{eq:lgt1dMPS}{{3}{1}{}{}{}}
\citation{pollmann2012symmetry}
\citation{Cardarelli2017}
\citation{Cardarelli2017}
\citation{Pollmann2010,Pollmann2012,Pollmann2012A}
\@writefile{lof}{\contentsline {figure}{\numberline {S2}{\ignorespaces Mid-system entanglement spectrum of the QLM Eq.\nobreakspace  {}(1) of the main text at $\mu =0$ for (a) two-leg ladder, $L=200$ (b) three-leg ladder, $L=100$ (c) four-leg ladder, $L=100$ (DMRG data).}}{2}{}}
\newlabel{fig:S_entanglement}{{S2}{2}{}{}{}}
\@writefile{toc}{\contentsline {section}{\numberline {III}2-leg ladder}{2}{}}
\@writefile{lof}{\contentsline {figure}{\numberline {S3}{\ignorespaces Boundary-parity- and string-order of the QLM Eq.\nobreakspace  {}(1) of the main text at $\mu =0$ for (a) two-leg ladder, $L=200$ (b) three-leg ladder, $L=100$ (c) four-leg ladder, $L=100$ (DMRG data).}}{2}{}}
\newlabel{fig:S_stringorder}{{S3}{2}{}{}{}}
\@writefile{lof}{\contentsline {figure}{\numberline {S4}{\ignorespaces  Schematic phase diagram of the two-leg cylinder model. Color codes depict the von-Neumann bipartite entanglement entropy $S_{vN}$ of the central rung (infinite DMRG simulation, $\chi =80$).  }}{3}{}}
\newlabel{fig:S_pd_2torus}{{S4}{3}{}{}{}}
\@writefile{toc}{\contentsline {section}{\numberline {IV}Two-leg cylinder}{3}{}}
\@writefile{toc}{\contentsline {section}{\numberline {V}Three- and four-leg ladder}{3}{}}
\@writefile{lof}{\contentsline {figure}{\numberline {S5}{\ignorespaces Comparison of charge and spin configurations obtained from DMRG results for the intermediate phase ($J_x=J_y$, $\mu =0$) (plots (a),(c), and (e)) to the RK state obtained by an equal amplitude overlap of all connected configurations (plots (b), (d), and (f)) for the four-leg cylinder (a) and (b), the four-leg ladder (c) and (d), and the three-leg ladder (e) and (f)}}{3}{}}
\newlabel{fig:S_class_plt}{{S5}{3}{}{}{}}
\@writefile{lot}{\contentsline {table}{\numberline {I}{\ignorespaces Estimated critical values of the exchange $J_y$ (in units of $J_x=1$) for the phase transition to the intermediate D phase for $\mu =0$.}}{3}{}}
\newlabel{tab:S_transitions}{{I}{3}{}{}{}}
\@writefile{toc}{\contentsline {section}{\numberline {VI}RK states}{3}{}}
\@writefile{toc}{\contentsline {section}{\numberline {VII}Phase diagram}{3}{}}
\bibdata{supmatNotes,references}
\bibcite{Ralko2005}{{1}{2005}{{Ralko\ \emph  {et~al.}}}{{Ralko, Ferrero, Becca, Ivanov,\ and\ Mila}}}
\@writefile{lof}{\contentsline {figure}{\numberline {S6}{\ignorespaces  Energy error $E_{\rm  {err}} = E(\chi ) - E_0$ as a function of the bond dimension $\chi $, for different values of $J_y$ in the disordered region and close to the phase transitions (four-leg cylinder, $\mu =0$, L=40, DMRG results). $E_0$ is an estimate of the ground-state energy for a fixed chain length obtained by fitting the data with an exponential curve. }}{4}{}}
\newlabel{fig:energy_vs_chi}{{S6}{4}{}{}{}}
\@writefile{lof}{\contentsline {figure}{\numberline {S7}{\ignorespaces Excitation gap $\Delta \epsilon $ (in units of $J_x$) for the (a) 1D toy model, (b) 2-leg (c) 4-leg ladder model within the vacuum gauge-sector at $\mu =0$ for different system sized $L=12$ (crosses), $L=24$ (circle), $L=36$ (plus-symbols). The dotted lines indicate the estimated phase-transition position from Tab.\nobreakspace  {}I{}{}{}\hbox {}. (d) Excitation gap as a function of the number of legs for $J_y / J_x=1$ (center of the D-phase) and $J_y/J_x=1.8$ (Sy-phase).}}{4}{}}
\newlabel{fig:gap_legs}{{S7}{4}{}{}{}}
\@writefile{toc}{\contentsline {section}{\numberline {VIII}Extended data on the string tension}{4}{}}
\bibcite{Shastry1981}{{2}{1981}{{Shastry\ and\ Sutherland}}{{}}}
\bibcite{Anderson1987}{{3}{1987}{{Anderson}}{{}}}
\bibcite{Moessner2002}{{4}{2002}{{Moessner\ and\ Sondhi}}{{}}}
\bibcite{Tschirsich2019}{{5}{2019}{{Tschirsich\ \emph  {et~al.}}}{{Tschirsich, Montangero,\ and\ Dalmonte}}}
\bibcite{aklt}{{6}{1987}{{Affleck\ \emph  {et~al.}}}{{Affleck, Kennedy, Lieb,\ and\ Tasaki}}}
\bibcite{pollmann2012symmetry}{{7}{2012{}}{{Pollmann\ \emph  {et~al.}}}{{Pollmann, Berg, Turner,\ and\ Oshikawa}}}
\bibcite{Cardarelli2017}{{8}{2017}{{Cardarelli\ \emph  {et~al.}}}{{Cardarelli, Greschner,\ and\ Santos}}}
\bibcite{Pollmann2010}{{9}{2010}{{Pollmann\ \emph  {et~al.}}}{{Pollmann, Turner, Berg,\ and\ Oshikawa}}}
\bibcite{Pollmann2012}{{10}{2012}{{Pollmann\ and\ Turner}}{{}}}
\bibcite{Pollmann2012A}{{11}{2012{}}{{Pollmann\ \emph  {et~al.}}}{{Pollmann, Berg, Turner,\ and\ Oshikawa}}}
\bibstyle{apsrev4-1}
\citation{REVTEX41Control}
\citation{apsrev41Control}
\@writefile{lof}{\contentsline {figure}{\numberline {S8}{\ignorespaces (a) Charge and bond average configurations of two defects with distance $L_D=2$,$4$,$6$,$8$,$12$,$16$ sites. DMRG-data, $L=36$ rungs, $\mu =0.4 J_x$, $J_y / J_x = 0.4$ (b) Same as (a) but after substracting background without charges.}}{5}{}}
\newlabel{fig:S_pltST_jy0.4}{{S8}{5}{}{}{}}
\@writefile{toc}{\contentsline {section}{\numberline {}References}{5}{}}
\newlabel{LastBibItem}{{11}{5}{}{}{}}
\@writefile{lof}{\contentsline {figure}{\numberline {S9}{\ignorespaces (a) Charge and bond average configurations of two defects with distance $L_D=2$,$4$,$6$,$8$,$12$,$16$ sites. DMRG-data, $L=36$ rungs, $\mu =0.4 J_x$, $J_y / J_x = 1.0$ (b) Same as (a) but after substracting background without charges.}}{6}{}}
\newlabel{fig:S_pltST_jy1.0}{{S9}{6}{}{}{}}
\@writefile{lof}{\contentsline {figure}{\numberline {S10}{\ignorespaces (a) Charge and bond average configurations of two defects with distance $L_D=2$,$4$,$6$,$8$,$12$,$16$ sites. DMRG-data, $L=36$ rungs, $\mu =0.4 J_x$, $J_y / J_x = 1.8$ (b) Same as (a) but after substracting background without charges.}}{6}{}}
\newlabel{fig:S_pltST_jy1.8}{{S10}{6}{}{}{}}
\newlabel{LastPage}{{}{6}{}{}{}}
