# Fdb version 3
["pdflatex"] 1642695528 "0.tex" "0.pdf" "0" 1642695529
  "0.aux" 1641754092 9 a94a2480d3289e625eea47cd1b285758 ""
  "0.tex" 1642695528 5297 40381ba1611837a62a7347af2535dfd2 ""
  "C:/Users/juraj/AppData/Local/MiKTeX/miktex/data/le/pdftex/pdflatex.fmt" 1618909369 9397587 7e522b7a474a3b3021dcb2fced63f5a2 ""
  (generated)
  "0.pdf"
  "0.log"
