PWD C:\Users\juraj\Desktop\Juraj\Unige\Cours\Master\Intelligence Artificielle\group-b-projet-ia\Rapport\rapport_partie_nn
INPUT C:\Users\juraj\AppData\Local\MiKTeX\miktex\data\le\pdftex\pdflatex.fmt
INPUT 11.tex
OUTPUT 11.log
