\BOOKMARK [1][-]{section.0.1}{\376\377\000I\000n\000t\000r\000o\000d\000u\000c\000t\000i\000o\000n}{}% 1
\BOOKMARK [1][-]{section.0.2}{\376\377\000T\000h\000\351\000o\000r\000i\000e\000\040\000d\000e\000s\000\040\000R\000\351\000s\000e\000a\000u\000x\000\040\000d\000e\000\040\000N\000e\000u\000r\000o\000n\000e\000s}{}% 2
\BOOKMARK [2][-]{subsection.0.2.1}{\376\377\000D\000\351\000f\000i\000n\000i\000t\000i\000o\000n\000s\000\040\000e\000t\000\040\000n\000o\000t\000a\000t\000i\000o\000n\000s}{section.0.2}% 3
\BOOKMARK [2][-]{subsection.0.2.2}{\376\377\000A\000l\000g\000o\000r\000i\000t\000h\000m\000e\000s}{section.0.2}% 4
\BOOKMARK [2][-]{subsection.0.2.3}{\376\377\000E\000x\000p\000l\000i\000c\000a\000t\000i\000o\000n\000\040\000d\000e\000\040\000l\000'\000a\000l\000g\000o\000r\000i\000t\000h\000m\000e\000\040\000d\000e\000\040\000r\000\351\000t\000r\000o\000p\000r\000o\000p\000a\000g\000a\000t\000i\000o\000n}{section.0.2}% 5
\BOOKMARK [1][-]{section.0.3}{\376\377\000I\000m\000p\000l\000\351\000m\000e\000n\000t\000a\000t\000i\000o\000n}{}% 6
\BOOKMARK [1][-]{section.0.4}{\376\377\000V\000i\000s\000u\000a\000l\000i\000s\000a\000t\000i\000o\000n\000\040\000d\000e\000s\000\040\000p\000o\000i\000d\000s\000\040\000d\000u\000\040\000r\000\351\000s\000e\000a\000u\000\040\000s\000o\000u\000s\000\040\000f\000o\000r\000m\000e\000\040\000d\000e\000\040\000m\000a\000t\000r\000i\000c\000e\000s}{}% 7
\BOOKMARK [1][-]{section.0.5}{\376\377\000P\000e\000r\000c\000e\000p\000t\000r\000o\000n}{}% 8
\BOOKMARK [2][-]{subsection.0.5.1}{\376\377\000I\000m\000p\000l\000\351\000m\000e\000n\000t\000a\000t\000i\000o\000n}{section.0.5}% 9
\BOOKMARK [2][-]{subsection.0.5.2}{\376\377\000V\000\351\000r\000i\000f\000i\000c\000a\000t\000i\000o\000n\000\040\000d\000e\000\040\000l\040\031\000i\000m\000p\000l\000\351\000m\000e\000n\000t\000a\000t\000i\000o\000n}{section.0.5}% 10
\BOOKMARK [1][-]{section.0.6}{\376\377\000E\000v\000o\000l\000u\000t\000i\000o\000n\000\040\000d\000e\000s\000\040\000m\000e\000s\000u\000r\000e\000s\000\040\000d\000'\000\351\000v\000a\000l\000u\000a\000t\000i\000o\000n\000s}{}% 11
\BOOKMARK [2][-]{subsection.0.6.1}{\376\377\000V\000o\000l\000u\000m\000e\000\040\000d\000e\000\040\000d\000o\000n\000n\000\351\000e\000s\000\040\000u\000t\000i\000l\000i\000s\000\351\000e\000s\000\040\000p\000o\000u\000r\000\040\000l\000'\000a\000p\000p\000r\000e\000n\000t\000i\000s\000s\000a\000g\000e}{section.0.6}% 12
\BOOKMARK [2][-]{subsection.0.6.2}{\376\377\000B\000r\000u\000i\000t\000\040\000d\000a\000n\000s\000\040\000l\000e\000s\000\040\000d\000o\000n\000n\000\351\000e\000s\000\040\000d\000'\000a\000p\000p\000r\000e\000n\000t\000i\000s\000s\000a\000g\000e}{section.0.6}% 13
\BOOKMARK [2][-]{subsection.0.6.3}{\376\377\000B\000r\000u\000i\000t\000\040\000d\000a\000n\000s\000\040\000l\000e\000s\000\040\000d\000o\000n\000n\000\351\000e\000s\000\040\000d\000e\000\040\000T\000e\000s\000t}{section.0.6}% 14
\BOOKMARK [1][-]{section.0.7}{\376\377\000I\000m\000p\000a\000c\000t\000\040\000d\000e\000\040\000l\000a\000\040\000c\000o\000m\000p\000l\000e\000x\000i\000t\000\351\000\040\000d\000u\000\040\000r\000\351\000s\000e\000a\000u\000\040\000s\000u\000r\000\040\000l\000'\000a\000p\000p\000r\000e\000n\000t\000i\000s\000s\000a\000g\000e}{}% 15
\BOOKMARK [1][-]{section.0.8}{\376\377\000P\000h\000\351\000n\000o\000m\000\350\000n\000e\000\040\000d\000e\000\040\000s\000u\000r\000-\000a\000p\000p\000r\000e\000n\000t\000i\000s\000s\000a\000g\000e}{}% 16
\BOOKMARK [1][-]{section.0.9}{\376\377\000C\000o\000m\000p\000a\000r\000a\000i\000s\000o\000n\000\040\000a\000v\000e\000c\000\040\000s\000k\000l\000e\000a\000r\000n}{}% 17
\BOOKMARK [1][-]{section.0.10}{\376\377\000C\000o\000n\000t\000r\000i\000b\000u\000t\000i\000o\000n\000s}{}% 18
\BOOKMARK [1][-]{section.0.11}{\376\377\000C\000i\000t\000a\000t\000i\000o\000n\000s\000\040\000a\000n\000d\000\040\000B\000i\000b\000l\000i\000o\000g\000r\000a\000p\000h\000y}{}% 19
