# Fdb version 3
["pdflatex"] 1642689403 "Rapport.tex" "Rapport.pdf" "Rapport" 1642695567
  "0.tex" 1642695528 5297 40381ba1611837a62a7347af2535dfd2 ""
  "C:/Program Files/MiKTeX/fonts/tfm/jknappen/ec/ecbx1200.tfm" 993058358 3200 b8d69bc738e5ef3e08cefeef3109ff56 ""
  "C:/Program Files/MiKTeX/fonts/tfm/jknappen/ec/ecbx1440.tfm" 993058360 3196 0b37fa3083e15c57cfa8c4ff52f2807a ""
  "C:/Program Files/MiKTeX/fonts/tfm/jknappen/ec/ecbx2488.tfm" 993058366 3192 b0a07ba84fb3fb36d088c4f796e254b9 ""
  "C:/Program Files/MiKTeX/fonts/tfm/jknappen/ec/ecrm1000.tfm" 993058522 3148 7e594c8240c71e432203f65ab5f95a51 ""
  "C:/Program Files/MiKTeX/fonts/tfm/jknappen/ec/ecrm1200.tfm" 993058526 3152 4850ff0163852b7fab34bd55e1197f28 ""
  "C:/Program Files/MiKTeX/fonts/tfm/jknappen/ec/ecrm1440.tfm" 993058528 3168 3bd7b08ba4330af81521911744311212 ""
  "C:/Program Files/MiKTeX/fonts/tfm/jknappen/ec/ecrm2488.tfm" 993058532 3184 93c67f4c0884ba9e31b75d469978f63b ""
  "C:/Program Files/MiKTeX/fonts/tfm/jknappen/ec/ecsl1200.tfm" 993058594 3380 9020be658781595c61e159c66a595769 ""
  "C:/Program Files/MiKTeX/fonts/tfm/jknappen/ec/tcrm1200.tfm" 993058908 1444 95ffe0f19b974d50849790c8225c7ef7 ""
  "C:/Program Files/MiKTeX/fonts/tfm/public/amsfonts/cmextra/cmex7.tfm" 1233951848 1004 54797486969f23fa377b128694d548df ""
  "C:/Program Files/MiKTeX/fonts/tfm/public/amsfonts/cmextra/cmex8.tfm" 1233951848 988 bdf658c3bfc2d96d3c8b02cfc1c94c20 ""
  "C:/Program Files/MiKTeX/fonts/tfm/public/amsfonts/symbols/msam10.tfm" 1233951854 916 f87d7c45f9c908e672703b83b72241a3 ""
  "C:/Program Files/MiKTeX/fonts/tfm/public/amsfonts/symbols/msam5.tfm" 1233951854 924 9904cf1d39e9767e7a3622f2a125a565 ""
  "C:/Program Files/MiKTeX/fonts/tfm/public/amsfonts/symbols/msam7.tfm" 1233951854 928 2dc8d444221b7a635bb58038579b861a ""
  "C:/Program Files/MiKTeX/fonts/tfm/public/amsfonts/symbols/msbm10.tfm" 1233951854 908 2921f8a10601f252058503cc6570e581 ""
  "C:/Program Files/MiKTeX/fonts/tfm/public/amsfonts/symbols/msbm5.tfm" 1233951854 940 75ac932a52f80982a9f8ea75d03a34cf ""
  "C:/Program Files/MiKTeX/fonts/tfm/public/amsfonts/symbols/msbm7.tfm" 1233951854 940 228d6584342e91276bf566bcf9716b83 ""
  "C:/Program Files/MiKTeX/fonts/tfm/public/cm/cmex10.tfm" 1136765053 992 662f679a0b3d2d53c1b94050fdaa3f50 ""
  "C:/Program Files/MiKTeX/fonts/tfm/public/cm/cmmi12.tfm" 1136765053 1524 4414a8315f39513458b80dfc63bff03a ""
  "C:/Program Files/MiKTeX/fonts/tfm/public/cm/cmmi6.tfm" 1136765053 1512 f21f83efb36853c0b70002322c1ab3ad ""
  "C:/Program Files/MiKTeX/fonts/tfm/public/cm/cmmi8.tfm" 1136765053 1520 eccf95517727cb11801f4f1aee3a21b4 ""
  "C:/Program Files/MiKTeX/fonts/tfm/public/cm/cmr12.tfm" 1136765053 1288 655e228510b4c2a1abe905c368440826 ""
  "C:/Program Files/MiKTeX/fonts/tfm/public/cm/cmr6.tfm" 1136765053 1300 b62933e007d01cfd073f79b963c01526 ""
  "C:/Program Files/MiKTeX/fonts/tfm/public/cm/cmr8.tfm" 1136765053 1292 21c1c5bfeaebccffdb478fd231a0997d ""
  "C:/Program Files/MiKTeX/fonts/tfm/public/cm/cmsy10.tfm" 1136765053 1124 6c73e740cf17375f03eec0ee63599741 ""
  "C:/Program Files/MiKTeX/fonts/tfm/public/cm/cmsy6.tfm" 1136765053 1116 933a60c408fc0a863a92debe84b2d294 ""
  "C:/Program Files/MiKTeX/fonts/tfm/public/cm/cmsy8.tfm" 1136765053 1120 8b7d695260f3cff42e636090a8002094 ""
  "C:/Program Files/MiKTeX/fonts/type1/public/amsfonts/cm/cmmi10.pfb" 1247593067 36299 5f9df58c2139e7edcf37c8fca4bd384d ""
  "C:/Program Files/MiKTeX/fonts/type1/public/amsfonts/cm/cmmi12.pfb" 1247593067 36741 0ee9e374ec3e30da87cdfb0ea3575226 ""
  "C:/Program Files/MiKTeX/fonts/type1/public/amsfonts/cm/cmmi7.pfb" 1247593067 36281 c355509802a035cadc5f15869451dcee ""
  "C:/Program Files/MiKTeX/fonts/type1/public/amsfonts/cm/cmmi8.pfb" 1247593066 35469 dcf3a5f2fc1862f5952e3ee5eb1d98c4 ""
  "C:/Program Files/MiKTeX/fonts/type1/public/amsfonts/cm/cmr10.pfb" 1247593067 35752 024fb6c41858982481f6968b5fc26508 ""
  "C:/Program Files/MiKTeX/fonts/type1/public/amsfonts/cm/cmr12.pfb" 1247593067 32722 d7379af29a190c3f453aba36302ff5a9 ""
  "C:/Program Files/MiKTeX/fonts/type1/public/amsfonts/cm/cmr8.pfb" 1247593067 32726 39f0f9e62e84beb801509898a605dbd5 ""
  "C:/Program Files/MiKTeX/fonts/type1/public/amsfonts/cm/cmsy10.pfb" 1247593067 32569 5e5ddc8df908dea60932f3c484a54c0d ""
  "C:/Program Files/MiKTeX/fonts/type1/public/amsfonts/cm/cmsy7.pfb" 1247593066 32716 08e384dc442464e7285e891af9f45947 ""
  "C:/Program Files/MiKTeX/fonts/type1/public/amsfonts/cm/cmsy8.pfb" 1247593067 32626 5abc8bb2f28aa647d4c70f8ea38cc0d3 ""
  "C:/Program Files/MiKTeX/tex/context/base/mkii/supp-pdf.mkii" 1580390158 71627 94eb9990bed73c364d7f53f960cc8c5b ""
  "C:/Program Files/MiKTeX/tex/generic/atbegshi/atbegshi.sty" 1575571100 24708 5584a51a7101caf7e6bbf1fc27d8f7b1 ""
  "C:/Program Files/MiKTeX/tex/generic/babel/babel.def" 1611678525 117888 66b7eb0f9cd7bd253f76713fb2e2ee4a ""
  "C:/Program Files/MiKTeX/tex/generic/babel/babel.sty" 1611678525 37868 ba045e7d3943071ea1a8258e20cd3f09 ""
  "C:/Program Files/MiKTeX/tex/generic/babel/txtbabel.def" 1611678525 5230 84624d139fa443f96294434bccf82f8c ""
  "C:/Program Files/MiKTeX/tex/generic/iftex/iftex.sty" 1583523400 6501 4011d89d9621e0b0901138815ba5ff29 ""
  "C:/Program Files/MiKTeX/tex/generic/iftex/ifvtex.sty" 1583523400 1057 525c2192b5febbd8c1f662c9468335bb ""
  "C:/Program Files/MiKTeX/tex/generic/pdftexcmds/pdftexcmds.sty" 1593439940 20835 80423eac55aa175305d35b49e04fe23b ""
  "C:/Program Files/MiKTeX/tex/generic/pgf/basiclayer/pgfcore.code.tex" 1609095199 992 855ff26741653ab54814101ca36e153c ""
  "C:/Program Files/MiKTeX/tex/generic/pgf/basiclayer/pgfcorearrows.code.tex" 1609095199 43820 1fef971b75380574ab35a0d37fd92608 ""
  "C:/Program Files/MiKTeX/tex/generic/pgf/basiclayer/pgfcoreexternal.code.tex" 1609095199 19324 f4e4c6403dd0f1605fd20ed22fa79dea ""
  "C:/Program Files/MiKTeX/tex/generic/pgf/basiclayer/pgfcoregraphicstate.code.tex" 1609095199 6038 ccb406740cc3f03bbfb58ad504fe8c27 ""
  "C:/Program Files/MiKTeX/tex/generic/pgf/basiclayer/pgfcoreimage.code.tex" 1609095199 6944 e12f8f7a7364ddf66f93ba30fb3a3742 ""
  "C:/Program Files/MiKTeX/tex/generic/pgf/basiclayer/pgfcorelayers.code.tex" 1609095199 4883 42daaf41e27c3735286e23e48d2d7af9 ""
  "C:/Program Files/MiKTeX/tex/generic/pgf/basiclayer/pgfcoreobjects.code.tex" 1609095199 2544 8c06d2a7f0f469616ac9e13db6d2f842 ""
  "C:/Program Files/MiKTeX/tex/generic/pgf/basiclayer/pgfcorepathconstruct.code.tex" 1609095199 44195 5e390c414de027626ca5e2df888fa68d ""
  "C:/Program Files/MiKTeX/tex/generic/pgf/basiclayer/pgfcorepathprocessing.code.tex" 1609095199 17311 2ef6b2e29e2fc6a2fc8d6d652176e257 ""
  "C:/Program Files/MiKTeX/tex/generic/pgf/basiclayer/pgfcorepathusage.code.tex" 1609095199 21302 788a79944eb22192a4929e46963a3067 ""
  "C:/Program Files/MiKTeX/tex/generic/pgf/basiclayer/pgfcorepatterns.code.tex" 1609095199 9690 01feb7cde25d4293ef36eef45123eb80 ""
  "C:/Program Files/MiKTeX/tex/generic/pgf/basiclayer/pgfcorepoints.code.tex" 1609095199 33335 dd1fa4814d4e51f18be97d88bf0da60c ""
  "C:/Program Files/MiKTeX/tex/generic/pgf/basiclayer/pgfcorequick.code.tex" 1609095199 2965 4c2b1f4e0826925746439038172e5d6f ""
  "C:/Program Files/MiKTeX/tex/generic/pgf/basiclayer/pgfcorerdf.code.tex" 1609095199 5196 2cc249e0ee7e03da5f5f6589257b1e5b ""
  "C:/Program Files/MiKTeX/tex/generic/pgf/basiclayer/pgfcorescopes.code.tex" 1609095199 20726 d4c8db1e2e53b72721d29916314a22ea ""
  "C:/Program Files/MiKTeX/tex/generic/pgf/basiclayer/pgfcoreshade.code.tex" 1609095199 35249 abd4adf948f960299a4b3d27c5dddf46 ""
  "C:/Program Files/MiKTeX/tex/generic/pgf/basiclayer/pgfcoretransformations.code.tex" 1609095199 21989 fdc867d05d228316de137a9fc5ec3bbe ""
  "C:/Program Files/MiKTeX/tex/generic/pgf/basiclayer/pgfcoretransparency.code.tex" 1609095199 8893 e851de2175338fdf7c17f3e091d94618 ""
  "C:/Program Files/MiKTeX/tex/generic/pgf/frontendlayer/tikz/libraries/tikzlibraryarrows.code.tex" 1609095199 319 225dfe354ba678ff3c194968db39d447 ""
  "C:/Program Files/MiKTeX/tex/generic/pgf/frontendlayer/tikz/libraries/tikzlibrarypatterns.code.tex" 1609095199 770 82e332cc9cc48e06b8070d74393a185a ""
  "C:/Program Files/MiKTeX/tex/generic/pgf/frontendlayer/tikz/libraries/tikzlibrarytopaths.code.tex" 1609095199 11518 738408f795261b70ce8dd47459171309 ""
  "C:/Program Files/MiKTeX/tex/generic/pgf/frontendlayer/tikz/tikz.code.tex" 1609095199 188275 555994923a0cb0c4aff9710e303272bb ""
  "C:/Program Files/MiKTeX/tex/generic/pgf/libraries/pgflibraryarrows.code.tex" 1609095199 31874 89148c383c49d4c72114a76fd0062299 ""
  "C:/Program Files/MiKTeX/tex/generic/pgf/libraries/pgflibrarypatterns.code.tex" 1609095199 7936 49e55444d57eb69a380c6baa35094828 ""
  "C:/Program Files/MiKTeX/tex/generic/pgf/libraries/pgflibraryplothandlers.code.tex" 1609095199 32995 ac577023e12c0e4bd8aa420b2e852d1a ""
  "C:/Program Files/MiKTeX/tex/generic/pgf/math/pgfint.code.tex" 1609095199 3063 8c415c68a0f3394e45cfeca0b65f6ee6 ""
  "C:/Program Files/MiKTeX/tex/generic/pgf/math/pgfmath.code.tex" 1609095199 521 8e224a7af69b7fee4451d1bf76b46654 ""
  "C:/Program Files/MiKTeX/tex/generic/pgf/math/pgfmathcalc.code.tex" 1609095199 13391 84d29568c13bdce4133ab4a214711112 ""
  "C:/Program Files/MiKTeX/tex/generic/pgf/math/pgfmathfloat.code.tex" 1609095199 104935 184ed87524e76d4957860df4ce0cd1c3 ""
  "C:/Program Files/MiKTeX/tex/generic/pgf/math/pgfmathfunctions.base.code.tex" 1609095199 10165 cec5fa73d49da442e56efc2d605ef154 ""
  "C:/Program Files/MiKTeX/tex/generic/pgf/math/pgfmathfunctions.basic.code.tex" 1609095199 28178 41c17713108e0795aac6fef3d275fbca ""
  "C:/Program Files/MiKTeX/tex/generic/pgf/math/pgfmathfunctions.code.tex" 1609095199 9989 c55967bf45126ff9b061fa2ca0c4694f ""
  "C:/Program Files/MiKTeX/tex/generic/pgf/math/pgfmathfunctions.comparison.code.tex" 1609095199 3865 ac538ab80c5cf82b345016e474786549 ""
  "C:/Program Files/MiKTeX/tex/generic/pgf/math/pgfmathfunctions.integerarithmetics.code.tex" 1609095199 3177 27d85c44fbfe09ff3b2cf2879e3ea434 ""
  "C:/Program Files/MiKTeX/tex/generic/pgf/math/pgfmathfunctions.misc.code.tex" 1609095199 10925 139ac69ce3e9a1892add56d0b818cf97 ""
  "C:/Program Files/MiKTeX/tex/generic/pgf/math/pgfmathfunctions.random.code.tex" 1609095199 7854 4176998eeefd8745ac6d2d4bd9c98451 ""
  "C:/Program Files/MiKTeX/tex/generic/pgf/math/pgfmathfunctions.round.code.tex" 1609095199 3379 781797a101f647bab82741a99944a229 ""
  "C:/Program Files/MiKTeX/tex/generic/pgf/math/pgfmathfunctions.trigonometric.code.tex" 1609095199 92405 f515f31275db273f97b9d8f52e1b0736 ""
  "C:/Program Files/MiKTeX/tex/generic/pgf/math/pgfmathparser.code.tex" 1609095199 37376 11cd75aac3da1c1b152b2848f30adc14 ""
  "C:/Program Files/MiKTeX/tex/generic/pgf/math/pgfmathutil.code.tex" 1609095199 8471 c2883569d03f69e8e1cabfef4999cfd7 ""
  "C:/Program Files/MiKTeX/tex/generic/pgf/modules/pgfmodulematrix.code.tex" 1609095199 21201 08d231a2386e2b61d64641c50dc15abd ""
  "C:/Program Files/MiKTeX/tex/generic/pgf/modules/pgfmoduleplot.code.tex" 1609095199 16121 346f9013d34804439f7436ff6786cef7 ""
  "C:/Program Files/MiKTeX/tex/generic/pgf/modules/pgfmoduleshapes.code.tex" 1609095199 43260 c5ced91ac9ecf66ab0674d57bda14c1f ""
  "C:/Program Files/MiKTeX/tex/generic/pgf/pgf.revision.tex" 1609095229 465 311958b39a263956b78fd69c4bc8a85c ""
  "C:/Program Files/MiKTeX/tex/generic/pgf/systemlayer/pgf.cfg" 1609095199 926 2963ea0dcf6cc6c0a770b69ec46a477b ""
  "C:/Program Files/MiKTeX/tex/generic/pgf/systemlayer/pgfsys-common-pdf.def" 1609095199 5546 f3f24d7898386cb7daac70bdd2c4d6dc ""
  "C:/Program Files/MiKTeX/tex/generic/pgf/systemlayer/pgfsys-pdftex.def" 1609095199 12601 4786e597516eddd82097506db7cfa098 ""
  "C:/Program Files/MiKTeX/tex/generic/pgf/systemlayer/pgfsys.code.tex" 1609095199 60544 7aef020a49f066dc86a26e7719af2a98 ""
  "C:/Program Files/MiKTeX/tex/generic/pgf/systemlayer/pgfsysprotocol.code.tex" 1609095199 1896 b8e0ca0ac371d74c0ca05583f6313c91 ""
  "C:/Program Files/MiKTeX/tex/generic/pgf/systemlayer/pgfsyssoftpath.code.tex" 1609095199 7778 53c8b5623d80238f6a20aa1df1868e63 ""
  "C:/Program Files/MiKTeX/tex/generic/pgf/utilities/pgffor.code.tex" 1609095199 23997 a4bed72405fa644418bea7eac2887006 ""
  "C:/Program Files/MiKTeX/tex/generic/pgf/utilities/pgfkeys.code.tex" 1609095199 36938 2b5b0039ae51cc081ebb25d84b8a3408 ""
  "C:/Program Files/MiKTeX/tex/generic/pgf/utilities/pgfkeysfiltered.code.tex" 1609095199 37431 9abe862035de1b29c7a677f3205e3d9f ""
  "C:/Program Files/MiKTeX/tex/generic/pgf/utilities/pgfrcs.code.tex" 1609095199 4494 af17fb7efeafe423710479858e42fa7e ""
  "C:/Program Files/MiKTeX/tex/generic/pgf/utilities/pgfutil-common-lists.tex" 1609095199 7251 fb18c67117e09c64de82267e12cd8aa4 ""
  "C:/Program Files/MiKTeX/tex/generic/pgf/utilities/pgfutil-common.tex" 1609095199 28579 1cdb9cf41947e1e5889d97a41f9bb448 ""
  "C:/Program Files/MiKTeX/tex/generic/pgf/utilities/pgfutil-latex.def" 1609095199 6860 2503857fc7e280acd60acdfa6c8c90c4 ""
  "C:/Program Files/MiKTeX/tex/latex/amsfonts/amsfonts.sty" 1358197772 5949 3f3fd50a8cc94c3d4cbf4fc66cd3df1c ""
  "C:/Program Files/MiKTeX/tex/latex/amsfonts/amssymb.sty" 1358197772 13829 94730e64147574077f8ecfea9bb69af4 ""
  "C:/Program Files/MiKTeX/tex/latex/amsfonts/umsa.fd" 1358197772 961 6518c6525a34feb5e8250ffa91731cff ""
  "C:/Program Files/MiKTeX/tex/latex/amsfonts/umsb.fd" 1358197772 961 d02606146ba5601b5645f987c92e6193 ""
  "C:/Program Files/MiKTeX/tex/latex/amsmath/amsbsy.sty" 1601804949 2283 ca7ce284ab93c8eecdc6029dc5ccbd73 ""
  "C:/Program Files/MiKTeX/tex/latex/amsmath/amsgen.sty" 1601804951 4297 7f6eb9092061a11f87d08ed13515b48d ""
  "C:/Program Files/MiKTeX/tex/latex/amsmath/amsmath.sty" 1601804952 90280 2c21ff5f2e32e1bf714e600924d810db ""
  "C:/Program Files/MiKTeX/tex/latex/amsmath/amsopn.sty" 1601804953 4233 32e6abd27229755a83a8b7f18e583890 ""
  "C:/Program Files/MiKTeX/tex/latex/amsmath/amstext.sty" 1601804953 2508 8ff93b1137020e8f21930562a874ae66 ""
  "C:/Program Files/MiKTeX/tex/latex/arabi/bblopts.cfg" 1139961600 902 c30e5c373bc58bde21f8f63a3091626f ""
  "C:/Program Files/MiKTeX/tex/latex/atveryend/atveryend.sty" 1576101110 19336 ce7ae9438967282886b3b036cfad1e4d ""
  "C:/Program Files/MiKTeX/tex/latex/base/atbegshi-ltx.sty" 1610120746 2973 00085839f5881178c538db5970d3c38e ""
  "C:/Program Files/MiKTeX/tex/latex/base/atveryend-ltx.sty" 1610120746 2596 b3a02e33035865e9f0457e064d436fb8 ""
  "C:/Program Files/MiKTeX/tex/latex/base/everyshi-ltx.sty" 1610120746 2591 72e18a6b9972c5f1da2a52bd5a4f860c ""
  "C:/Program Files/MiKTeX/tex/latex/base/fontenc.sty" 1610120746 4947 8cb7717f0cc771eca0fda15160c7fee9 ""
  "C:/Program Files/MiKTeX/tex/latex/base/ifthen.sty" 1610120746 5159 892429808d9e0e2b3548aaefd9a06ed0 ""
  "C:/Program Files/MiKTeX/tex/latex/base/inputenc.sty" 1610120746 5050 0d3b77275060ca09a40635b830c3c904 ""
  "C:/Program Files/MiKTeX/tex/latex/base/report.cls" 1610120746 23204 74c91ecbcc47161218f25d9d0651c0f7 ""
  "C:/Program Files/MiKTeX/tex/latex/base/size12.clo" 1610120746 8450 6fd3588c0e9d06f6f56c6cf4f7246466 ""
  "C:/Program Files/MiKTeX/tex/latex/base/textcomp.sty" 1610120746 2821 2c0928feafd5527387e29a1af774d030 ""
  "C:/Program Files/MiKTeX/tex/latex/epstopdf-pkg/epstopdf-base.sty" 1580041542 14411 d1306dcf79a944f6988e688c1785f9ce ""
  "C:/Program Files/MiKTeX/tex/latex/etoolbox/etoolbox.sty" 1601894156 46845 3b58f70c6e861a13d927bff09d35ecbc ""
  "C:/Program Files/MiKTeX/tex/latex/everyshi/everyshi.sty" 1607182244 2368 ef01f98551a0f54407358b67f8a6c5e1 ""
  "C:/Program Files/MiKTeX/tex/latex/graphics-cfg/color.cfg" 1465890692 1213 620bba36b25224fa9b7e1ccb4ecb76fd ""
  "C:/Program Files/MiKTeX/tex/latex/graphics-cfg/graphics.cfg" 1465890692 1224 978390e9c2234eab29404bc21b268d1e ""
  "C:/Program Files/MiKTeX/tex/latex/graphics-def/pdftex.def" 1601874598 19103 48d29b6e2a64cb717117ef65f107b404 ""
  "C:/Program Files/MiKTeX/tex/latex/graphics/color.sty" 1601741526 7300 5b27b7e61091c6128cd6300e21704e4b ""
  "C:/Program Files/MiKTeX/tex/latex/graphics/graphics.sty" 1601741526 18881 a8c6a275b34ab6717ceeb8fa04b104e2 ""
  "C:/Program Files/MiKTeX/tex/latex/graphics/graphicx.sty" 1601741526 8167 20fdfdd783821971c55bc8ee918cbe63 ""
  "C:/Program Files/MiKTeX/tex/latex/graphics/keyval.sty" 1601741526 2677 e3b24ff953e5b58d924f163d25380312 ""
  "C:/Program Files/MiKTeX/tex/latex/graphics/lscape.sty" 1601741526 1818 1eb057df64f13cee0efe9d12f933a1e9 ""
  "C:/Program Files/MiKTeX/tex/latex/graphics/trig.sty" 1601741526 4093 d7fa7d81d2870d509d25b17d0245e735 ""
  "C:/Program Files/MiKTeX/tex/latex/hyperref/hpdftex.def" 1613040996 49890 b908259c66be9b657ff90938ccfa48e2 ""
  "C:/Program Files/MiKTeX/tex/latex/hyperref/hyperref-langpatches.def" 1613040996 1777 d5bc248f36a3eb933dd555cdae114c00 ""
  "C:/Program Files/MiKTeX/tex/latex/hyperref/hyperref.sty" 1613040996 230829 ee909406455458f49b99376d681f801d ""
  "C:/Program Files/MiKTeX/tex/latex/hyperref/nameref.sty" 1613040996 13242 133e617c5eebffdd05e421624022b267 ""
  "C:/Program Files/MiKTeX/tex/latex/hyperref/pd1enc.def" 1613040996 14132 d91326c83d15189737a52fd5ebf68728 ""
  "C:/Program Files/MiKTeX/tex/latex/hyperref/puenc.def" 1613040996 116999 edbdb70039f0909b8ceabb75a0585775 ""
  "C:/Program Files/MiKTeX/tex/latex/l3backend/l3backend-pdftex.def" 1613658612 27164 09c696e2ed5c5986662c62a27622e9cd ""
  "C:/Program Files/MiKTeX/tex/latex/l3kernel/expl3.sty" 1613659236 6208 7497703c7e95fb22a69d3ed6f9024046 ""
  "C:/Program Files/MiKTeX/tex/latex/l3packages/xparse/xparse-generic.tex" 1603804298 80141 edbf9289c99ff37db17116af7a3a423f ""
  "C:/Program Files/MiKTeX/tex/latex/l3packages/xparse/xparse.sty" 1603804298 5905 c6eb253894f4e808af476e034b49df36 ""
  "C:/Program Files/MiKTeX/tex/latex/latex-tools/calc.sty" 1602844018 10505 5efd55f2010055e7b7875afd6a75be82 ""
  "C:/Program Files/MiKTeX/tex/latex/pgf/basiclayer/pgf.sty" 1609095199 1090 bae35ef70b3168089ef166db3e66f5b2 ""
  "C:/Program Files/MiKTeX/tex/latex/pgf/basiclayer/pgfcore.sty" 1609095199 410 615550c46f918fcbee37641b02a862d9 ""
  "C:/Program Files/MiKTeX/tex/latex/pgf/compatibility/pgfcomp-version-0-65.sty" 1609095199 21013 f4ff83d25bb56552493b030f27c075ae ""
  "C:/Program Files/MiKTeX/tex/latex/pgf/compatibility/pgfcomp-version-1-18.sty" 1609095199 989 c49c8ae06d96f8b15869da7428047b1e ""
  "C:/Program Files/MiKTeX/tex/latex/pgf/frontendlayer/tikz.sty" 1609095199 339 c2e180022e3afdb99c7d0ea5ce469b7d ""
  "C:/Program Files/MiKTeX/tex/latex/pgf/math/pgfmath.sty" 1609095199 306 c56a323ca5bf9242f54474ced10fca71 ""
  "C:/Program Files/MiKTeX/tex/latex/pgf/systemlayer/pgfsys.sty" 1609095199 443 8c872229db56122037e86bcda49e14f3 ""
  "C:/Program Files/MiKTeX/tex/latex/pgf/utilities/pgffor.sty" 1609095199 348 ee405e64380c11319f0e249fed57e6c5 ""
  "C:/Program Files/MiKTeX/tex/latex/pgf/utilities/pgfkeys.sty" 1609095199 274 5ae372b7df79135d240456a1c6f2cf9a ""
  "C:/Program Files/MiKTeX/tex/latex/pgf/utilities/pgfrcs.sty" 1609095199 325 f9f16d12354225b7dd52a3321f085955 ""
  "C:/Program Files/MiKTeX/tex/latex/url/url.sty" 1388490452 12796 8edb7d69a20b857904dd0ea757c14ec9 ""
  "C:/Program Files/MiKTeX/tex/latex/xcolor/xcolor.sty" 1463131981 57049 34128738f682d033422ca125f82e5d62 ""
  "C:/Users/juraj/AppData/Local/MiKTeX/fonts/pk/ljfour/jknappen/ec/dpi600/ecbx1200.pk" 1618915788 31952 89c16e817d6d37ffd702e0e6cb34182d ""
  "C:/Users/juraj/AppData/Local/MiKTeX/fonts/pk/ljfour/jknappen/ec/dpi600/ecbx1440.pk" 1618915784 40136 350c93052bccd2bf41a608908f40bae5 ""
  "C:/Users/juraj/AppData/Local/MiKTeX/fonts/pk/ljfour/jknappen/ec/dpi600/ecbx2488.pk" 1618915791 72288 741e599ea756ca41dc5ea08dd84fa437 ""
  "C:/Users/juraj/AppData/Local/MiKTeX/fonts/pk/ljfour/jknappen/ec/dpi600/ecrm1200.pk" 1618915790 28440 a7c572df3d0cfba0c131a853b614b9c7 ""
  "C:/Users/juraj/AppData/Local/MiKTeX/fonts/pk/ljfour/jknappen/ec/dpi600/tcrm1200.pk" 1618915785 14064 7e1450ac91cf7bfa79327211ab36adf5 ""
  "C:/Users/juraj/AppData/Local/MiKTeX/fonts/tfm/public/stmaryrd/stmary10.tfm" 1621235065 848 f478e0761563bbc369eca609a1741348 ""
  "C:/Users/juraj/AppData/Local/MiKTeX/fonts/tfm/public/stmaryrd/stmary5.tfm" 1634396190 848 e1bc58a31b9ed9c3729ffea165acfaac ""
  "C:/Users/juraj/AppData/Local/MiKTeX/fonts/tfm/public/stmaryrd/stmary6.tfm" 1621235068 848 068dd119e13b75777e62821af7d4f2a6 ""
  "C:/Users/juraj/AppData/Local/MiKTeX/fonts/tfm/public/stmaryrd/stmary7.tfm" 1632756347 848 26631fcb3e4cb6757598b9cda7967b63 ""
  "C:/Users/juraj/AppData/Local/MiKTeX/fonts/tfm/public/stmaryrd/stmary8.tfm" 1621235066 848 6125cdd3627e68d3db8013b98e587508 ""
  "C:/Users/juraj/AppData/Local/MiKTeX/miktex/data/le/pdftex/pdflatex.fmt" 1618909369 9397587 7e522b7a474a3b3021dcb2fced63f5a2 ""
  "C:/Users/juraj/AppData/Local/MiKTeX/pdftex/config/pdftex.map" 1636705546 81086 6fddea6b023469843de28035c851ec71 ""
  "C:/Users/juraj/AppData/Roaming/MiKTeX/tex/generic/babel-french/french.ldf" 1602317029 69686 4c1daff3b397362294827ad011863ee0 ""
  "C:/Users/juraj/AppData/Roaming/MiKTeX/tex/generic/bigintcalc/bigintcalc.sty" 1576433602 40635 c40361e206be584d448876bba8a64a3b ""
  "C:/Users/juraj/AppData/Roaming/MiKTeX/tex/generic/bitset/bitset.sty" 1575926576 33961 6b5c75130e435b2bfdb9f480a09a39f9 ""
  "C:/Users/juraj/AppData/Roaming/MiKTeX/tex/generic/etexcmds/etexcmds.sty" 1576433638 7734 b98cbb34c81f667027c1e3ebdbfce34b ""
  "C:/Users/juraj/AppData/Roaming/MiKTeX/tex/generic/gettitlestring/gettitlestring.sty" 1576433666 8371 9d55b8bd010bc717624922fb3477d92e ""
  "C:/Users/juraj/AppData/Roaming/MiKTeX/tex/generic/infwarerr/infwarerr.sty" 1575399508 8356 7bbb2c2373aa810be568c29e333da8ed ""
  "C:/Users/juraj/AppData/Roaming/MiKTeX/tex/generic/intcalc/intcalc.sty" 1576433764 31769 002a487f55041f8e805cfbf6385ffd97 ""
  "C:/Users/juraj/AppData/Roaming/MiKTeX/tex/generic/kvdefinekeys/kvdefinekeys.sty" 1576763304 5412 d5a2436094cd7be85769db90f29250a6 ""
  "C:/Users/juraj/AppData/Roaming/MiKTeX/tex/generic/kvsetkeys/kvsetkeys.sty" 1576433820 13807 952b0226d4efca026f0e19dd266dcc22 ""
  "C:/Users/juraj/AppData/Roaming/MiKTeX/tex/generic/ltxcmds/ltxcmds.sty" 1601732009 18568 4409f8f50cd365c68e684407e5350b1b ""
  "C:/Users/juraj/AppData/Roaming/MiKTeX/tex/generic/pdfescape/pdfescape.sty" 1575926700 19007 15924f7228aca6c6d184b115f4baa231 ""
  "C:/Users/juraj/AppData/Roaming/MiKTeX/tex/generic/uniquecounter/uniquecounter.sty" 1576434012 7008 f92eaa0a3872ed622bbf538217cd2ab7 ""
  "C:/Users/juraj/AppData/Roaming/MiKTeX/tex/generic/xlop/xlop.tex" 1605117086 126743 8828898d2ac8f9067187bd8222704929 ""
  "C:/Users/juraj/AppData/Roaming/MiKTeX/tex/latex/algorithmicx/algorithmicx.sty" 1114628400 26750 ce139c05a983e19ddca355b43e29c395 ""
  "C:/Users/juraj/AppData/Roaming/MiKTeX/tex/latex/algorithmicx/algpseudocode.sty" 1114628520 3457 d9077efe6b74c5a094199256af8d7d9a ""
  "C:/Users/juraj/AppData/Roaming/MiKTeX/tex/latex/algorithms/algorithm.sty" 1251545464 3349 15763257e50278eef5db1952ccde229c ""
  "C:/Users/juraj/AppData/Roaming/MiKTeX/tex/latex/amscls/amsthm.sty" 1591020009 12594 0d51ac3a545aaaa555021326ff22a6cc ""
  "C:/Users/juraj/AppData/Roaming/MiKTeX/tex/latex/auxhook/auxhook.sty" 1576538732 3935 57aa3c3e203a5c2effb4d2bd2efbc323 ""
  "C:/Users/juraj/AppData/Roaming/MiKTeX/tex/latex/bbm/bbm.sty" 1227195129 1684 1e0d54b051369c3f457872824cac219f ""
  "C:/Users/juraj/AppData/Roaming/MiKTeX/tex/latex/carlisle/scalefnt.sty" 1522604221 1360 df2086bf924b14b72d6121fe9502fcdb ""
  "C:/Users/juraj/AppData/Roaming/MiKTeX/tex/latex/eso-pic/eso-pic.sty" 1607182970 11772 8d0db0794e6aeb45348f60bbe3a3e093 ""
  "C:/Users/juraj/AppData/Roaming/MiKTeX/tex/latex/fancyhdr/fancyhdr.sty" 1612001844 17086 7ed8cbc4d361ec87392817e0dd4f65ec ""
  "C:/Users/juraj/AppData/Roaming/MiKTeX/tex/latex/float/float.sty" 1469020353 6916 16d2656a1984957e674b149555f1ea1d ""
  "C:/Users/juraj/AppData/Roaming/MiKTeX/tex/latex/geometry/geometry.cfg" 1578053545 1104 7ac475a4e3466b0b43e138e9356bda83 ""
  "C:/Users/juraj/AppData/Roaming/MiKTeX/tex/latex/geometry/geometry.sty" 1578053545 42759 9cf6c5257b1bc7af01a58859749dd37a ""
  "C:/Users/juraj/AppData/Roaming/MiKTeX/tex/latex/hycolor/hycolor.sty" 1580380792 18571 4c28a13fc3d975e6e81c9bea1d697276 ""
  "C:/Users/juraj/AppData/Roaming/MiKTeX/tex/latex/kvoptions/kvoptions.sty" 1602224496 22521 d2fceb764a442a2001d257ef11db7618 ""
  "C:/Users/juraj/AppData/Roaming/MiKTeX/tex/latex/letltxmacro/letltxmacro.sty" 1575399536 5766 13a9e8766c47f30327caf893ece86ac8 ""
  "C:/Users/juraj/AppData/Roaming/MiKTeX/tex/latex/lipsum/lipsum.ltd.tex" 1615022496 98057 6c688c3093107a4b70d70f94e35c44e9 ""
  "C:/Users/juraj/AppData/Roaming/MiKTeX/tex/latex/lipsum/lipsum.sty" 1615022496 18004 97caa3416d49c368940cf5bdd8679717 ""
  "C:/Users/juraj/AppData/Roaming/MiKTeX/tex/latex/mathtools/mathtools.sty" 1618236928 58665 e757d1a5d2f651d761f187cea16ae3f3 ""
  "C:/Users/juraj/AppData/Roaming/MiKTeX/tex/latex/mathtools/mhsetup.sty" 1618236928 5582 a43dedf8e5ec418356f1e9dfe5d29fc3 ""
  "C:/Users/juraj/AppData/Roaming/MiKTeX/tex/latex/mdframed/md-frame-0.mdf" 1372704485 24831 326d9f019009ed0c076106fa6cb860fb ""
  "C:/Users/juraj/AppData/Roaming/MiKTeX/tex/latex/mdframed/mdframed.sty" 1372704485 53487 3e997243f47cb3ba8b4c7b8df9c82989 ""
  "C:/Users/juraj/AppData/Roaming/MiKTeX/tex/latex/needspace/needspace.sty" 1364792977 852 0e34dbb72efc69fa07602405ad95585e ""
  "C:/Users/juraj/AppData/Roaming/MiKTeX/tex/latex/pdflscape/pdflscape.sty" 1575571226 6575 25396d208d8f2b9395d06ef315d5886c ""
  "C:/Users/juraj/AppData/Roaming/MiKTeX/tex/latex/pdfpages/pdfpages.sty" 1615069272 54497 58ccf247b8e81d55ca6f10c5082d335f ""
  "C:/Users/juraj/AppData/Roaming/MiKTeX/tex/latex/pdfpages/pppdftex.def" 1615069272 6591 7d4f68a47a8f9dceeb2327354264a7a7 ""
  "C:/Users/juraj/AppData/Roaming/MiKTeX/tex/latex/pdfsync/pdfsync.sty" 1201427580 10768 173607d6fd65badaedd45e09a96c04be ""
  "C:/Users/juraj/AppData/Roaming/MiKTeX/tex/latex/refcount/refcount.sty" 1576433952 9878 9e94e8fa600d95f9c7731bb21dfb67a4 ""
  "C:/Users/juraj/AppData/Roaming/MiKTeX/tex/latex/rerunfilecheck/rerunfilecheck.sty" 1575571282 9715 b051d5b493d9fe5f4bc251462d039e5f ""
  "C:/Users/juraj/AppData/Roaming/MiKTeX/tex/latex/stmaryrd/stmaryrd.sty" 1303225468 11317 aa7f81da60ce104f0dbb8b827dd14383 ""
  "C:/Users/juraj/AppData/Roaming/MiKTeX/tex/latex/stmaryrd/ustmry.fd" 1303225468 1811 216b0f832c406513647608b5bb9bb8ff ""
  "C:/Users/juraj/AppData/Roaming/MiKTeX/tex/latex/totpages/totpages.sty" 1127588246 7911 b07e668265cf485332abe582e7ed306e ""
  "C:/Users/juraj/AppData/Roaming/MiKTeX/tex/latex/units/nicefrac.sty" 1469025550 4163 0462ee5ab265cf59dc15a41a3b883101 ""
  "C:/Users/juraj/AppData/Roaming/MiKTeX/tex/latex/units/units.sty" 1469025550 2206 65ad9fb19763b1681bea4cb389fe84f8 ""
  "C:/Users/juraj/AppData/Roaming/MiKTeX/tex/latex/xlop/xlop.sty" 1605117086 719 7d70c6e084ab7c584409d55c6a91522f ""
  "C:/Users/juraj/AppData/Roaming/MiKTeX/tex/latex/zref/zref-abspage.sty" 1602238298 2275 d29aca6fd67823551cb07584e3681d5d ""
  "C:/Users/juraj/AppData/Roaming/MiKTeX/tex/latex/zref/zref-base.sty" 1602238298 20688 beaddf14d96104d4bf016523be5395c5 ""
  "Rapport.aux" 1642689409 1302 d646c5894a792d35a31ebb782b3c3b24 "pdflatex"
  "Rapport.out" 1642689409 383 a56a6f2d9d4b05a3da4bc213bd4e03ce "pdflatex"
  "Rapport.tex" 1642695566 805 5162fab8130389256c84a5d438846573 ""
  "commands.tex" 1636705487 2492 ffa9d9b3645cfe3801e8694cb7a1636d ""
  "images/Mushroom1.png" 1642609253 7336 8179e130b88903da9a5b0e0fd1cb211c ""
  "images/Mushroom2.png" 1642609258 6025 713f78f53fc6103ee6ece46873208e71 ""
  "images/Mushroom3.png" 1642609272 7799 9450f4bdb07cd5a9b9ca2412625637f1 ""
  "images/Wine1.png" 1642608899 6587 193d5d2e4e8d389c4bc8a21c239c9d1d ""
  "images/Wine2.png" 1642608914 5462 2fa4d455c3b6e9a4c564a0b65be3d8df ""
  "images/Wine3.png" 1642608919 7038 54f217f41ba57e7d605356109032ed97 ""
  "images/plot1.png" 1642688981 21012 1fde126468aaa6b2354f12b5f1d98b54 ""
  "images/plot2.png" 1642689050 15529 8966083bc8129c6f186e6c84d4c84754 ""
  (generated)
  "Rapport.pdf"
  "Rapport.aux"
  "Rapport.out"
  "Rapport.pdfsync"
  "Rapport.log"
