\relax 
\providecommand\hyper@newdestlabel[2]{}
\providecommand\zref@newlabel[2]{}
\providecommand\HyperFirstAtBeginDocument{\AtBeginDocument}
\HyperFirstAtBeginDocument{\ifx\hyper@anchor\@undefined
\global\let\oldcontentsline\contentsline
\gdef\contentsline#1#2#3#4{\oldcontentsline{#1}{#2}{#3}}
\global\let\oldnewlabel\newlabel
\gdef\newlabel#1#2{\newlabelxx{#1}#2}
\gdef\newlabelxx#1#2#3#4#5#6{\oldnewlabel{#1}{{#2}{#3}}}
\AtEndDocument{\ifx\hyper@anchor\@undefined
\let\contentsline\oldcontentsline
\let\newlabel\oldnewlabel
\fi}
\fi}
\global\let\hyper@last\relax 
\gdef\HyperFirstAtBeginDocument#1{#1}
\providecommand\HyField@AuxAddToFields[1]{}
\providecommand\HyField@AuxAddToCoFields[2]{}
\bibstyle{plainnat}
\providecommand\babel@aux[2]{}
\@nameuse{bbl@beforestart}
\catcode `:\active 
\catcode `;\active 
\catcode `!\active 
\catcode `?\active 
\citation{Dua:2019}
\citation{scikit-learn}
\citation{scikit-learn}
\providecommand \oddpage@label [2]{}
\jmlr@title{Short Title}{Étude des réseaux de neurones}
\jmlr@title{Étude des réseaux de neurones comme outil d'apprentissage supervisé}{Étude des réseaux de neurones comme outil d'apprentissage supervisé}
\jmlr@author{\Name {Malik Algelly} \Email {Malik.Algelly@etu.unige.ch}\\ \Name {Luca Perone} \Email {Luca.Perone@etu.unige.ch}\\ \Name {Juraj Rosinsky} \Email {Juraj.Rosinsky@etu.unige.ch}\\ \Name {Samuel Simko} \Email {Samuel.Simko@etu.unige.ch} }{\Name {Malik Algelly} \Email {Malik.Algelly@etu.unige.ch}\\ \Name {Luca Perone} \Email {Luca.Perone@etu.unige.ch}\\ \Name {Juraj Rosinsky} \Email {Juraj.Rosinsky@etu.unige.ch}\\ \Name {Samuel Simko} \Email {Samuel.Simko@etu.unige.ch} }
\babel@aux{french}{}
\newlabel{jmlrstart}{{}{1}{}{Doc-Start}{}}
\@writefile{toc}{\contentsline {section}{\numberline {1}Introduction}{1}{section.0.1}\protected@file@percent }
\newlabel{sec:intro}{{1}{1}{Introduction}{section.0.1}{}}
\@writefile{toc}{\contentsline {section}{\numberline {2}Théorie des Réseaux de Neurones}{1}{section.0.2}\protected@file@percent }
\newlabel{sec:1}{{2}{1}{Théorie des Réseaux de Neurones}{section.0.2}{}}
\@writefile{toc}{\contentsline {subsection}{\numberline {2.1}Définitions et notations}{1}{subsection.0.2.1}\protected@file@percent }
\@writefile{toc}{\contentsline {subsection}{\numberline {2.2}Algorithmes}{1}{subsection.0.2.2}\protected@file@percent }
\citation{slides}
\@writefile{loa}{\contentsline {algorithm}{\numberline {1}{\ignorespaces Propagation}}{2}{algorithm.1}\protected@file@percent }
\newlabel{alg:prop}{{1}{2}{Algorithmes}{algorithm.1}{}}
\@writefile{loa}{\contentsline {algorithm}{\numberline {2}{\ignorespaces Rétropropagation}}{2}{algorithm.2}\protected@file@percent }
\newlabel{alg:back}{{2}{2}{Algorithmes}{algorithm.2}{}}
\@writefile{toc}{\contentsline {subsection}{\numberline {2.3}Explication de l'algorithme de rétropropagation}{2}{subsection.0.2.3}\protected@file@percent }
\newlabel{eq:b1}{{1}{2}{Explication de l'algorithme de rétropropagation}{equation.0.2.1}{}}
\citation{Chollet:2015}
\newlabel{eq:b2}{{2}{3}{Explication de l'algorithme de rétropropagation}{equation.0.2.2}{}}
\newlabel{eq:b3}{{3}{3}{Explication de l'algorithme de rétropropagation}{equation.0.2.3}{}}
\@writefile{toc}{\contentsline {section}{\numberline {3}Implémentation}{3}{section.0.3}\protected@file@percent }
\@writefile{toc}{\contentsline {section}{\numberline {4}Visualisation des poids du réseau sous forme de matrices}{3}{section.0.4}\protected@file@percent }
\newlabel{sec:4}{{4}{3}{Visualisation des poids du réseau sous forme de matrices}{section.0.4}{}}
\citation{slides}
\citation{2016:perceptron}
\@writefile{toc}{\contentsline {section}{\numberline {5}Perceptron}{5}{section.0.5}\protected@file@percent }
\newlabel{sec:5}{{5}{5}{Perceptron}{section.0.5}{}}
\@writefile{toc}{\contentsline {subsection}{\numberline {5.1}Implémentation}{5}{subsection.0.5.1}\protected@file@percent }
\@writefile{toc}{\contentsline {subsection}{\numberline {5.2}Vérification de l’implémentation}{5}{subsection.0.5.2}\protected@file@percent }
\@writefile{lof}{\contentsline {figure}{\numberline {1}{\ignorespaces Résultat du Perceptron sur un ensemble linéairement séparable}}{5}{figure.1}\protected@file@percent }
\newlabel{ens}{{1}{5}{Résultat du Perceptron sur un ensemble linéairement séparable}{figure.1}{}}
\@writefile{lof}{\contentsline {figure}{\numberline {2}{\ignorespaces Résultat du Perceptron sur l'ensemble AND}}{6}{figure.2}\protected@file@percent }
\newlabel{and}{{2}{6}{Résultat du Perceptron sur l'ensemble AND}{figure.2}{}}
\@writefile{lof}{\contentsline {figure}{\numberline {3}{\ignorespaces Dataset de l'ensemble XOR}}{6}{figure.3}\protected@file@percent }
\newlabel{xor_data}{{3}{6}{Dataset de l'ensemble XOR}{figure.3}{}}
\@writefile{lof}{\contentsline {figure}{\numberline {4}{\ignorespaces Résultat du Perceptron sur l'ensemble XOR}}{6}{figure.4}\protected@file@percent }
\newlabel{xor}{{4}{6}{Résultat du Perceptron sur l'ensemble XOR}{figure.4}{}}
\@writefile{toc}{\contentsline {section}{\numberline {6}Evolution des mesures d'évaluations}{7}{section.0.6}\protected@file@percent }
\newlabel{sec:6}{{6}{7}{Evolution des mesures d'évaluations}{section.0.6}{}}
\@writefile{toc}{\contentsline {subsection}{\numberline {6.1}Volume de données utilisées pour l'apprentissage}{7}{subsection.0.6.1}\protected@file@percent }
\@writefile{lof}{\contentsline {figure}{\numberline {5}{\ignorespaces Evolution des mesures en fonction du volume de données d'apprentissage}}{7}{figure.5}\protected@file@percent }
\newlabel{Vol}{{5}{7}{Evolution des mesures en fonction du volume de données d'apprentissage}{figure.5}{}}
\@writefile{lof}{\contentsline {figure}{\numberline {6}{\ignorespaces Evolution des mesures en fonction du volume de données d'apprentissage}}{7}{figure.6}\protected@file@percent }
\newlabel{Test}{{6}{7}{Evolution des mesures en fonction du volume de données d'apprentissage}{figure.6}{}}
\@writefile{toc}{\contentsline {subsection}{\numberline {6.2}Bruit dans les données d'apprentissage}{7}{subsection.0.6.2}\protected@file@percent }
\@writefile{lof}{\contentsline {figure}{\numberline {7}{\ignorespaces Evolution des mesures en fonction du bruit dans les données d'apprentissage}}{8}{figure.7}\protected@file@percent }
\newlabel{Data}{{7}{8}{Evolution des mesures en fonction du bruit dans les données d'apprentissage}{figure.7}{}}
\@writefile{lof}{\contentsline {figure}{\numberline {8}{\ignorespaces Evolution des mesures en fonction du bruit dans les données de Tests}}{8}{figure.8}\protected@file@percent }
\newlabel{Test}{{8}{8}{Evolution des mesures en fonction du bruit dans les données de Tests}{figure.8}{}}
\@writefile{toc}{\contentsline {subsection}{\numberline {6.3}Bruit dans les données de Test}{8}{subsection.0.6.3}\protected@file@percent }
\@writefile{lof}{\contentsline {figure}{\numberline {9}{\ignorespaces Evolution des mesures en fonction du bruit dans les données de Tests}}{8}{figure.9}\protected@file@percent }
\newlabel{Test1}{{9}{8}{Evolution des mesures en fonction du bruit dans les données de Tests}{figure.9}{}}
\@writefile{lof}{\contentsline {figure}{\numberline {10}{\ignorespaces Evolution des mesures en fonction du bruit dans les données de tests}}{9}{figure.10}\protected@file@percent }
\newlabel{Test}{{10}{9}{Evolution des mesures en fonction du bruit dans les données de tests}{figure.10}{}}
\@writefile{toc}{\contentsline {section}{\numberline {7}Impact de la complexité du réseau sur l'apprentissage}{9}{section.0.7}\protected@file@percent }
\newlabel{sec:7}{{7}{9}{Impact de la complexité du réseau sur l'apprentissage}{section.0.7}{}}
\@writefile{lof}{\contentsline {figure}{\numberline {11}{\ignorespaces Données d'entraînement}}{9}{figure.11}\protected@file@percent }
\newlabel{fig:7_data}{{11}{9}{Données d'entraînement}{figure.11}{}}
\citation{Cortez:2009}
\@writefile{lof}{\contentsline {figure}{\numberline {12}{\ignorespaces Évolution des mesures pour des réseaux de complexité variable}}{10}{figure.12}\protected@file@percent }
\newlabel{fig:comp}{{12}{10}{Évolution des mesures pour des réseaux de complexité variable}{figure.12}{}}
\@writefile{toc}{\contentsline {section}{\numberline {8}Phénomène de sur-apprentissage}{10}{section.0.8}\protected@file@percent }
\newlabel{sec:10}{{8}{10}{Phénomène de sur-apprentissage}{section.0.8}{}}
\@writefile{lof}{\contentsline {figure}{\numberline {13}{\ignorespaces Évolution des métriques avec 30\% de données d'entraînement}}{11}{figure.13}\protected@file@percent }
\newlabel{fig:surapp}{{13}{11}{Évolution des métriques avec 30\% de données d'entraînement}{figure.13}{}}
\@writefile{lof}{\contentsline {figure}{\numberline {14}{\ignorespaces Erreur finale dans les données tests pour le dataset Winequality}}{12}{figure.14}\protected@file@percent }
\newlabel{Surapprentissage}{{14}{12}{Erreur finale dans les données tests pour le dataset Winequality}{figure.14}{}}
\@writefile{toc}{\contentsline {section}{\numberline {9}Comparaison avec sklearn}{12}{section.0.9}\protected@file@percent }
\newlabel{sec:11}{{9}{12}{Comparaison avec sklearn}{section.0.9}{}}
\@writefile{toc}{\contentsline {section}{\numberline {10}Contributions}{13}{section.0.10}\protected@file@percent }
\@writefile{toc}{\contentsline {section}{\numberline {11}Citations and Bibliography}{13}{section.0.11}\protected@file@percent }
\newlabel{sec:cite}{{11}{13}{Citations and Bibliography}{section.0.11}{}}
\bibdata{jmlr-sample}
\bibcite{2016:perceptron}{{1}{2016}{{Brownlee}}{{}}}
\bibcite{Chollet:2015}{{2}{2015}{{Chollet et~al.}}{{}}}
\bibcite{Dua:2019}{{3}{2017}{{Dua and Graff}}{{}}}
\bibcite{slides}{{4}{2021}{{Marchand-Maillet}}{{}}}
\bibcite{Cortez:2009}{{5}{2009}{{P.~Cortez and Reis.}}{{}}}
\bibcite{scikit-learn}{{6}{2011}{{Pedregosa et~al.}}{{Pedregosa, Varoquaux, Gramfort, Michel, Thirion, Grisel, Blondel, Prettenhofer, Weiss, Dubourg, Vanderplas, Passos, Cournapeau, Brucher, Perrot, and Duchesnay}}}
\newlabel{jmlrend}{{11}{14}{end of Étude des réseaux de neurones comme outil d'apprentissage supervisé}{section*.3}{}}
\newlabel{TotPages}{{14}{14}{}{page.14}{}}
\gdef \@abspage@last{14}
