# Fdb version 3
["pdflatex"] 1642970362 "10.tex" "10.pdf" "10" 1642970363
  "10.aux" 1642868570 9 a94a2480d3289e625eea47cd1b285758 ""
  "10.tex" 1642970361 3053 e023244cbad148f29deb48615a06d08c ""
  "C:/Program Files/MiKTeX/fonts/tfm/public/cm/cmbx10.tfm" 1136765053 1328 c834bbb027764024c09d3d2bf908b5f0 ""
  "C:/Users/juraj/AppData/Local/MiKTeX/miktex/data/le/pdftex/pdflatex.fmt" 1618909369 9397587 7e522b7a474a3b3021dcb2fced63f5a2 ""
  (generated)
  "10.pdf"
  "10.log"
