^C:\USERS\ROMAN\DOCUMENTS\PRINTEMPS 2024\PROJET NTIC\DEMOCRATIC\DEMOCRATIC\BUILD\WINDOWS\X64\RUNNER\DEMOCRATIC.DIR\DEBUG\FLUTTER_WINDOW.OBJ|C:\USERS\ROMAN\DOCUMENTS\PRINTEMPS 2024\PROJET NTIC\DEMOCRATIC\DEMOCRATIC\BUILD\WINDOWS\X64\RUNNER\DEMOCRATIC.DIR\DEBUG\GENERATED_PLUGIN_REGISTRANT.OBJ|C:\USERS\ROMAN\DOCUMENTS\PRINTEMPS 2024\PROJET NTIC\DEMOCRATIC\DEMOCRATIC\BUILD\WINDOWS\X64\RUNNER\DEMOCRATIC.DIR\DEBUG\MAIN.OBJ|C:\USERS\ROMAN\DOCUMENTS\PRINTEMPS 2024\PROJET NTIC\DEMOCRATIC\DEMOCRATIC\BUILD\WINDOWS\X64\RUNNER\DEMOCRATIC.DIR\DEBUG\RUNNER.RES|C:\USERS\ROMAN\DOCUMENTS\PRINTEMPS 2024\PROJET NTIC\DEMOCRATIC\DEMOCRATIC\BUILD\WINDOWS\X64\RUNNER\DEMOCRATIC.DIR\DEBUG\UTILS.OBJ|C:\USERS\ROMAN\DOCUMENTS\PRINTEMPS 2024\PROJET NTIC\DEMOCRATIC\DEMOCRATIC\BUILD\WINDOWS\X64\RUNNER\DEMOCRATIC.DIR\DEBUG\WIN32_WINDOW.OBJ
C:\USERS\ROMAN\DOCUMENTS\PRINTEMPS 2024\PROJET NTIC\DEMOCRATIC\DEMOCRATIC\BUILD\WINDOWS\X64\RUNNER\DEBUG\DEMOCRATIC.EXE
C:\USERS\ROMAN\DOCUMENTS\PRINTEMPS 2024\PROJET NTIC\DEMOCRATIC\DEMOCRATIC\BUILD\WINDOWS\X64\RUNNER\DEBUG\DEMOCRATIC.PDB
