^C:\USERS\ROMAN\DOCUMENTS\PRINTEMPS 2024\PROJET NTIC\DEMOCRATIC\DEMOCRATIC\WINDOWS\RUNNER\FLUTTER_WINDOW.CPP
/c /I"C:\USERS\ROMAN\DOCUMENTS\PRINTEMPS 2024\PROJET NTIC\DEMOCRATIC\DEMOCRATIC\WINDOWS" /I"C:\USERS\ROMAN\DOCUMENTS\PRINTEMPS 2024\PROJET NTIC\DEMOCRATIC\DEMOCRATIC\WINDOWS\FLUTTER\EPHEMERAL" /I"C:\USERS\ROMAN\DOCUMENTS\PRINTEMPS 2024\PROJET NTIC\DEMOCRATIC\DEMOCRATIC\WINDOWS\FLUTTER\EPHEMERAL\CPP_CLIENT_WRAPPER\INCLUDE" /Zi /nologo /W4 /WX /diagnostics:column /Od /Ob0 /D _UNICODE /D UNICODE /D WIN32 /D _WINDOWS /D _HAS_EXCEPTIONS=0 /D _DEBUG /D "FLUTTER_VERSION=\"1.0.0+1\"" /D FLUTTER_VERSION_MAJOR=1 /D FLUTTER_VERSION_MINOR=0 /D FLUTTER_VERSION_PATCH=0 /D FLUTTER_VERSION_BUILD=1 /D NOMINMAX /D UNICODE /D _UNICODE /D "CMAKE_INTDIR=\"Debug\"" /Gm- /EHsc /RTC1 /MDd /GS /fp:precise /Zc:wchar_t /Zc:forScope /Zc:inline /GR /std:c++17 /Fo"DEMOCRATIC.DIR\DEBUG\\" /Fd"DEMOCRATIC.DIR\DEBUG\VC143.PDB" /external:W4 /Gd /TP /wd4100 C:\USERS\ROMAN\DOCUMENTS\PRINTEMPS 2024\PROJET NTIC\DEMOCRATIC\DEMOCRATIC\WINDOWS\RUNNER\FLUTTER_WINDOW.CPP
^C:\USERS\ROMAN\DOCUMENTS\PRINTEMPS 2024\PROJET NTIC\DEMOCRATIC\DEMOCRATIC\WINDOWS\RUNNER\MAIN.CPP
/c /I"C:\USERS\ROMAN\DOCUMENTS\PRINTEMPS 2024\PROJET NTIC\DEMOCRATIC\DEMOCRATIC\WINDOWS" /I"C:\USERS\ROMAN\DOCUMENTS\PRINTEMPS 2024\PROJET NTIC\DEMOCRATIC\DEMOCRATIC\WINDOWS\FLUTTER\EPHEMERAL" /I"C:\USERS\ROMAN\DOCUMENTS\PRINTEMPS 2024\PROJET NTIC\DEMOCRATIC\DEMOCRATIC\WINDOWS\FLUTTER\EPHEMERAL\CPP_CLIENT_WRAPPER\INCLUDE" /Zi /nologo /W4 /WX /diagnostics:column /Od /Ob0 /D _UNICODE /D UNICODE /D WIN32 /D _WINDOWS /D _HAS_EXCEPTIONS=0 /D _DEBUG /D "FLUTTER_VERSION=\"1.0.0+1\"" /D FLUTTER_VERSION_MAJOR=1 /D FLUTTER_VERSION_MINOR=0 /D FLUTTER_VERSION_PATCH=0 /D FLUTTER_VERSION_BUILD=1 /D NOMINMAX /D UNICODE /D _UNICODE /D "CMAKE_INTDIR=\"Debug\"" /Gm- /EHsc /RTC1 /MDd /GS /fp:precise /Zc:wchar_t /Zc:forScope /Zc:inline /GR /std:c++17 /Fo"DEMOCRATIC.DIR\DEBUG\\" /Fd"DEMOCRATIC.DIR\DEBUG\VC143.PDB" /external:W4 /Gd /TP /wd4100 C:\USERS\ROMAN\DOCUMENTS\PRINTEMPS 2024\PROJET NTIC\DEMOCRATIC\DEMOCRATIC\WINDOWS\RUNNER\MAIN.CPP
^C:\USERS\ROMAN\DOCUMENTS\PRINTEMPS 2024\PROJET NTIC\DEMOCRATIC\DEMOCRATIC\WINDOWS\RUNNER\UTILS.CPP
/c /I"C:\USERS\ROMAN\DOCUMENTS\PRINTEMPS 2024\PROJET NTIC\DEMOCRATIC\DEMOCRATIC\WINDOWS" /I"C:\USERS\ROMAN\DOCUMENTS\PRINTEMPS 2024\PROJET NTIC\DEMOCRATIC\DEMOCRATIC\WINDOWS\FLUTTER\EPHEMERAL" /I"C:\USERS\ROMAN\DOCUMENTS\PRINTEMPS 2024\PROJET NTIC\DEMOCRATIC\DEMOCRATIC\WINDOWS\FLUTTER\EPHEMERAL\CPP_CLIENT_WRAPPER\INCLUDE" /Zi /nologo /W4 /WX /diagnostics:column /Od /Ob0 /D _UNICODE /D UNICODE /D WIN32 /D _WINDOWS /D _HAS_EXCEPTIONS=0 /D _DEBUG /D "FLUTTER_VERSION=\"1.0.0+1\"" /D FLUTTER_VERSION_MAJOR=1 /D FLUTTER_VERSION_MINOR=0 /D FLUTTER_VERSION_PATCH=0 /D FLUTTER_VERSION_BUILD=1 /D NOMINMAX /D UNICODE /D _UNICODE /D "CMAKE_INTDIR=\"Debug\"" /Gm- /EHsc /RTC1 /MDd /GS /fp:precise /Zc:wchar_t /Zc:forScope /Zc:inline /GR /std:c++17 /Fo"DEMOCRATIC.DIR\DEBUG\\" /Fd"DEMOCRATIC.DIR\DEBUG\VC143.PDB" /external:W4 /Gd /TP /wd4100 C:\USERS\ROMAN\DOCUMENTS\PRINTEMPS 2024\PROJET NTIC\DEMOCRATIC\DEMOCRATIC\WINDOWS\RUNNER\UTILS.CPP
^C:\USERS\ROMAN\DOCUMENTS\PRINTEMPS 2024\PROJET NTIC\DEMOCRATIC\DEMOCRATIC\WINDOWS\RUNNER\WIN32_WINDOW.CPP
/c /I"C:\USERS\ROMAN\DOCUMENTS\PRINTEMPS 2024\PROJET NTIC\DEMOCRATIC\DEMOCRATIC\WINDOWS" /I"C:\USERS\ROMAN\DOCUMENTS\PRINTEMPS 2024\PROJET NTIC\DEMOCRATIC\DEMOCRATIC\WINDOWS\FLUTTER\EPHEMERAL" /I"C:\USERS\ROMAN\DOCUMENTS\PRINTEMPS 2024\PROJET NTIC\DEMOCRATIC\DEMOCRATIC\WINDOWS\FLUTTER\EPHEMERAL\CPP_CLIENT_WRAPPER\INCLUDE" /Zi /nologo /W4 /WX /diagnostics:column /Od /Ob0 /D _UNICODE /D UNICODE /D WIN32 /D _WINDOWS /D _HAS_EXCEPTIONS=0 /D _DEBUG /D "FLUTTER_VERSION=\"1.0.0+1\"" /D FLUTTER_VERSION_MAJOR=1 /D FLUTTER_VERSION_MINOR=0 /D FLUTTER_VERSION_PATCH=0 /D FLUTTER_VERSION_BUILD=1 /D NOMINMAX /D UNICODE /D _UNICODE /D "CMAKE_INTDIR=\"Debug\"" /Gm- /EHsc /RTC1 /MDd /GS /fp:precise /Zc:wchar_t /Zc:forScope /Zc:inline /GR /std:c++17 /Fo"DEMOCRATIC.DIR\DEBUG\\" /Fd"DEMOCRATIC.DIR\DEBUG\VC143.PDB" /external:W4 /Gd /TP /wd4100 C:\USERS\ROMAN\DOCUMENTS\PRINTEMPS 2024\PROJET NTIC\DEMOCRATIC\DEMOCRATIC\WINDOWS\RUNNER\WIN32_WINDOW.CPP
^C:\USERS\ROMAN\DOCUMENTS\PRINTEMPS 2024\PROJET NTIC\DEMOCRATIC\DEMOCRATIC\WINDOWS\FLUTTER\GENERATED_PLUGIN_REGISTRANT.CC
/c /I"C:\USERS\ROMAN\DOCUMENTS\PRINTEMPS 2024\PROJET NTIC\DEMOCRATIC\DEMOCRATIC\WINDOWS" /I"C:\USERS\ROMAN\DOCUMENTS\PRINTEMPS 2024\PROJET NTIC\DEMOCRATIC\DEMOCRATIC\WINDOWS\FLUTTER\EPHEMERAL" /I"C:\USERS\ROMAN\DOCUMENTS\PRINTEMPS 2024\PROJET NTIC\DEMOCRATIC\DEMOCRATIC\WINDOWS\FLUTTER\EPHEMERAL\CPP_CLIENT_WRAPPER\INCLUDE" /Zi /nologo /W4 /WX /diagnostics:column /Od /Ob0 /D _UNICODE /D UNICODE /D WIN32 /D _WINDOWS /D _HAS_EXCEPTIONS=0 /D _DEBUG /D "FLUTTER_VERSION=\"1.0.0+1\"" /D FLUTTER_VERSION_MAJOR=1 /D FLUTTER_VERSION_MINOR=0 /D FLUTTER_VERSION_PATCH=0 /D FLUTTER_VERSION_BUILD=1 /D NOMINMAX /D UNICODE /D _UNICODE /D "CMAKE_INTDIR=\"Debug\"" /Gm- /EHsc /RTC1 /MDd /GS /fp:precise /Zc:wchar_t /Zc:forScope /Zc:inline /GR /std:c++17 /Fo"DEMOCRATIC.DIR\DEBUG\\" /Fd"DEMOCRATIC.DIR\DEBUG\VC143.PDB" /external:W4 /Gd /TP /wd4100 C:\USERS\ROMAN\DOCUMENTS\PRINTEMPS 2024\PROJET NTIC\DEMOCRATIC\DEMOCRATIC\WINDOWS\FLUTTER\GENERATED_PLUGIN_REGISTRANT.CC
