^C:\USERS\ROMAN\DOCUMENTS\PRINTEMPS 2024\PROJET NTIC\DEMOCRATIC\DEMOCRATIC\BUILD\WINDOWS\X64\FLUTTER\FLUTTER_WRAPPER_APP.DIR\DEBUG\CORE_IMPLEMENTATIONS.OBJ|C:\USERS\ROMAN\DOCUMENTS\PRINTEMPS 2024\PROJET NTIC\DEMOCRATIC\DEMOCRATIC\BUILD\WINDOWS\X64\FLUTTER\FLUTTER_WRAPPER_APP.DIR\DEBUG\FLUTTER_ENGINE.OBJ|C:\USERS\ROMAN\DOCUMENTS\PRINTEMPS 2024\PROJET NTIC\DEMOCRATIC\DEMOCRATIC\BUILD\WINDOWS\X64\FLUTTER\FLUTTER_WRAPPER_APP.DIR\DEBUG\FLUTTER_VIEW_CONTROLLER.OBJ|C:\USERS\ROMAN\DOCUMENTS\PRINTEMPS 2024\PROJET NTIC\DEMOCRATIC\DEMOCRATIC\BUILD\WINDOWS\X64\FLUTTER\FLUTTER_WRAPPER_APP.DIR\DEBUG\STANDARD_CODEC.OBJ
C:\USERS\ROMAN\DOCUMENTS\PRINTEMPS 2024\PROJET NTIC\DEMOCRATIC\DEMOCRATIC\BUILD\WINDOWS\X64\FLUTTER\FLUTTER_WRAPPER_APP.DIR\DEBUG\CORE_IMPLEMENTATIONS.OBJ
C:\WINDOWS\SYSTEM32\TZRES.DLL
C:\USERS\ROMAN\DOCUMENTS\PRINTEMPS 2024\PROJET NTIC\DEMOCRATIC\DEMOCRATIC\BUILD\WINDOWS\X64\FLUTTER\FLUTTER_WRAPPER_APP.DIR\DEBUG\STANDARD_CODEC.OBJ
C:\USERS\ROMAN\DOCUMENTS\PRINTEMPS 2024\PROJET NTIC\DEMOCRATIC\DEMOCRATIC\BUILD\WINDOWS\X64\FLUTTER\FLUTTER_WRAPPER_APP.DIR\DEBUG\FLUTTER_ENGINE.OBJ
C:\USERS\ROMAN\DOCUMENTS\PRINTEMPS 2024\PROJET NTIC\DEMOCRATIC\DEMOCRATIC\BUILD\WINDOWS\X64\FLUTTER\FLUTTER_WRAPPER_APP.DIR\DEBUG\FLUTTER_VIEW_CONTROLLER.OBJ
C:\WINDOWS\GLOBALIZATION\SORTING\SORTDEFAULT.NLS
