,IK,bio_lowertaxon,original_ref,query_link,top1_link,ref,extracted_title,extracted_journal,extracted_year,extracted_firstauthor_year
0,NGFSMHKFTZROKJ-MMSZMYIBSA-N,Micromonas pusilla,,https://patents.google.com/?q=NGFSMHKFTZROKJ-MMSZMYIBSA-N&q=TI%3d%22Micromonas+pusilla%22&patents=false&scholar&sort=old,NaN,NaN,NaN,NaN,NaN,NaN
1,LLEJIEBFSOEYIV-UHFFFAOYSA-N,Chelidonium majus,,https://patents.google.com/?q=LLEJIEBFSOEYIV-UHFFFAOYSA-N&q=TI%3d%22Chelidonium+majus%22&patents=false&scholar&sort=old,https://patents.google.com/scholar/14187720447791632537,NaN,NaN,NaN,NaN,NaN
2,PMFGJJMKPXGSBK-UHFFFAOYSA-N,Abies recurvata,,https://patents.google.com/?q=PMFGJJMKPXGSBK-UHFFFAOYSA-N&q=TI%3d%22Abies+recurvata%22&patents=false&scholar&sort=old,NaN,NaN,NaN,NaN,NaN,NaN
3,AZCFLHZUFANAOR-UPHRSURJSA-N,Capsella grandiflora,,https://patents.google.com/?q=AZCFLHZUFANAOR-UPHRSURJSA-N&q=TI%3d%22Capsella+grandiflora%22&patents=false&scholar&sort=old,NaN,NaN,NaN,NaN,NaN,NaN
4,WSLYCILIEOFQPK-UHFFFAOYSA-N,Theobroma,,https://patents.google.com/?q=WSLYCILIEOFQPK-UHFFFAOYSA-N&q=TI%3d%22Theobroma%22&patents=false&scholar&sort=old,NaN,NaN,NaN,NaN,NaN,NaN
5,GACTWZZMVMUKNG-KVTDHHQDSA-N,Phaseolus vulgaris,,https://patents.google.com/?q=GACTWZZMVMUKNG-KVTDHHQDSA-N&q=TI%3d%22Phaseolus+vulgaris%22&patents=false&scholar&sort=old,https://patents.google.com/scholar/14508944689366833526,https://bmcmicrobiol.biomedcentral.com/articles/10.1186/1471-2180-10-192,Biosynthesis of compatible solutes in rhizobial strains isolated from Phaseolus vulgaris nodules in Tunisian fields,BMC microbiology,2010,"Fernandez-Aunión et al., 2010"
6,GWYFCOCPABKNJV-UHFFFAOYSA-N,Flos,,https://patents.google.com/?q=GWYFCOCPABKNJV-UHFFFAOYSA-N&q=TI%3d%22Flos%22&patents=false&scholar&sort=old,NaN,NaN,NaN,NaN,NaN,NaN
7,MQDWBAYFXRRHRX-FPLPWBNLSA-N,Bathyplotes natans,,https://patents.google.com/?q=MQDWBAYFXRRHRX-FPLPWBNLSA-N&q=TI%3d%22Bathyplotes+natans%22&patents=false&scholar&sort=old,NaN,NaN,NaN,NaN,NaN,NaN
8,IFELYQDGJJZHIW-KPBPQVAGSA-N,Abacopteris penangiana,,https://patents.google.com/?q=IFELYQDGJJZHIW-KPBPQVAGSA-N&q=TI%3d%22Abacopteris+penangiana%22&patents=false&scholar&sort=old,https://patents.google.com/scholar/10708986353025837853,https://www.sciencedirect.com/science/article/pii/S027869151100456X,Hypolipidemic and anti-inflammatory properties of Abacopterin A from Abacopteris penangiana in high-fat diet-induced hyperlipidemia mice,Food and chemical toxicology,2011,"Lei et al., 2011"
9,PFTAWBLQPZVEMU-UKRRQHHQSA-N,Fridericia chica,,https://patents.google.com/?q=PFTAWBLQPZVEMU-UKRRQHHQSA-N&q=TI%3d%22Fridericia+chica%22&patents=false&scholar&sort=old,NaN,NaN,NaN,NaN,NaN,NaN
10,ITDYPNOEEHONAH-UHFFFAOYSA-N,Pterogyne nitens,,https://patents.google.com/?q=ITDYPNOEEHONAH-UHFFFAOYSA-N&q=TI%3d%22Pterogyne+nitens%22&patents=false&scholar&sort=old,https://patents.google.com/scholar/14819695354811598113,https://inis.iaea.org/search/search.aspx?orig_q=RN:39082685,Chemical constituents of the flowers of Pterogyne nitens (Caesalpinioideae),Quimica Nova,2008,"Regasini et al., 2008"
11,COLNVLDHVKWLRT-QMMMGPOBSA-N,Persea americana,,https://patents.google.com/?q=COLNVLDHVKWLRT-QMMMGPOBSA-N&q=TI%3d%22Persea+americana%22&patents=false&scholar&sort=old,https://patents.google.com/scholar/8578194558991267641,https://www.sciencedirect.com/science/article/pii/0008621580900154,Lectin-like activity from Persea americana,Carbohydrate research,1980,"Meade et al., 1980"
12,XMGQYMWWDOXHJM-UHFFFAOYSA-N,Labiatae,,https://patents.google.com/?q=XMGQYMWWDOXHJM-UHFFFAOYSA-N&q=TI%3d%22Labiatae%22&patents=false&scholar&sort=old,https://patents.google.com/scholar/6892512260805973364,NaN,NaN,NaN,NaN,NaN
13,ZGHMHQGZMJLPND-GGQHDFQOSA-N,Gomesa radicans,,https://patents.google.com/?q=ZGHMHQGZMJLPND-GGQHDFQOSA-N&q=TI%3d%22Gomesa+radicans%22&patents=false&scholar&sort=old,NaN,NaN,NaN,NaN,NaN,NaN
14,XYWFSSFJPFAYCA-JRJNMRRASA-O,Vaccinium angustifolium,Quantitation and Distribution of Simple and Acylated Anthocyanins and Other Phenolics in Blueberries,https://patents.google.com/?q=XYWFSSFJPFAYCA-JRJNMRRASA-O&q=TI%3d%22Vaccinium+angustifolium%22&patents=false&scholar&sort=old,NaN,NaN,NaN,NaN,NaN,NaN
15,NFSCOXCDAAETPI-WSLAOOLZSA-N,Kokoona reflexa,,https://patents.google.com/?q=NFSCOXCDAAETPI-WSLAOOLZSA-N&q=TI%3d%22Kokoona+reflexa%22&patents=false&scholar&sort=old,NaN,NaN,NaN,NaN,NaN,NaN
16,CRPUJAZIXJMDBK-BDAKNGLRSA-N,Amomum krervanh,,https://patents.google.com/?q=CRPUJAZIXJMDBK-BDAKNGLRSA-N&q=TI%3d%22Amomum+krervanh%22&patents=false&scholar&sort=old,NaN,NaN,NaN,NaN,NaN,NaN
17,HJRVLGWTJSLQIG-ABNMXWHVSA-N,Panax ginseng,,https://patents.google.com/?q=HJRVLGWTJSLQIG-ABNMXWHVSA-N&q=TI%3d%22Panax+ginseng%22&patents=false&scholar&sort=old,https://patents.google.com/scholar/2423877230832608617,NaN,NaN,NaN,NaN,NaN
18,IVFDDIVDEWRXDC-OUYBMOFHSA-N,Papaver commutatum,,https://patents.google.com/?q=IVFDDIVDEWRXDC-OUYBMOFHSA-N&q=TI%3d%22Papaver+commutatum%22&patents=false&scholar&sort=old,NaN,NaN,NaN,NaN,NaN,NaN
19,HENXGMAQUCSEHW-UHFFFAOYSA-N,Mangifera indica,,https://patents.google.com/?q=HENXGMAQUCSEHW-UHFFFAOYSA-N&q=TI%3d%22Mangifera+indica%22&patents=false&scholar&sort=old,NaN,NaN,NaN,NaN,NaN,NaN
20,YRXRHZOKDFCXIB-PYDDKJGSSA-N,Vitis vinifera,,https://patents.google.com/?q=YRXRHZOKDFCXIB-PYDDKJGSSA-N&q=TI%3d%22Vitis+vinifera%22&patents=false&scholar&sort=old,NaN,NaN,NaN,NaN,NaN,NaN
21,QGOOHFJSKVIFAC-QGCGKJESSA-N,Phacelia congesta,,https://patents.google.com/?q=QGOOHFJSKVIFAC-QGCGKJESSA-N&q=TI%3d%22Phacelia+congesta%22&patents=false&scholar&sort=old,NaN,NaN,NaN,NaN,NaN,NaN
22,TZCSIFOYBLPUIF-OQONWLFBSA-N,Escontria chiotilla,,https://patents.google.com/?q=TZCSIFOYBLPUIF-OQONWLFBSA-N&q=TI%3d%22Escontria+chiotilla%22&patents=false&scholar&sort=old,NaN,NaN,NaN,NaN,NaN,NaN
23,ITTPZDMHCNGAGQ-UHFFFAOYSA-N,Oryza brachyantha,,https://patents.google.com/?q=ITTPZDMHCNGAGQ-UHFFFAOYSA-N&q=TI%3d%22Oryza+brachyantha%22&patents=false&scholar&sort=old,NaN,NaN,NaN,NaN,NaN,NaN
24,HCIBTBXNLVOFER-UHFFFAOYSA-N,Valeriana officinalis latifolia,,https://patents.google.com/?q=HCIBTBXNLVOFER-UHFFFAOYSA-N&q=TI%3d%22Valeriana+officinalis+latifolia%22&patents=false&scholar&sort=old,NaN,NaN,NaN,NaN,NaN,NaN
25,LOJUQFSPYHMHEO-SGHXUWJISA-N,Micromonas pusilla,,https://patents.google.com/?q=LOJUQFSPYHMHEO-SGHXUWJISA-N&q=TI%3d%22Micromonas+pusilla%22&patents=false&scholar&sort=old,NaN,NaN,NaN,NaN,NaN,NaN
26,NEEQFPMRODQIKX-UHFFFAOYSA-N,Panax ginseng,,https://patents.google.com/?q=NEEQFPMRODQIKX-UHFFFAOYSA-N&q=TI%3d%22Panax+ginseng%22&patents=false&scholar&sort=old,https://patents.google.com/scholar/4234307667519165554,http://en.cnki.com.cn/Article_en/CJFDTotal-ZGZY199101000.htm,Pharmacological Variations of Panax ginseng CA Meyer during Processing,China Journal of Chinese Materia Medica,1991,"Xianggao et al., 1991"
27,UCHYSPNEUSDFQR-UHFFFAOYSA-N,Glycyrrhiza inflata,,https://patents.google.com/?q=UCHYSPNEUSDFQR-UHFFFAOYSA-N&q=TI%3d%22Glycyrrhiza+inflata%22&patents=false&scholar&sort=old,https://patents.google.com/scholar/8118206811798654398,https://www.sciencedirect.com/science/article/pii/S0968089617312464,Nrf2 activators from Glycyrrhiza inflata and their hepatoprotective activities against CCl4-induced liver injury in mice,Bioorganic & medicinal chemistry,2017,"Lin et al., 2017"
28,PTDAHAWQAGSZDD-IOVCITQVSA-N,Pueraria montana thomsonii,,https://patents.google.com/?q=PTDAHAWQAGSZDD-IOVCITQVSA-N&q=TI%3d%22Pueraria+montana+thomsonii%22&patents=false&scholar&sort=old,NaN,NaN,NaN,NaN,NaN,NaN
29,YFVGIJBUXMQFOF-PJOVQGMDSA-N,Buddleja officinalis,,https://patents.google.com/?q=YFVGIJBUXMQFOF-PJOVQGMDSA-N&q=TI%3d%22Buddleja+officinalis%22&patents=false&scholar&sort=old,https://patents.google.com/scholar/16023081886445697347,https://pubs.acs.org/doi/abs/10.1021/np0300131,Saponins from the flower buds of Buddleja officinalis,Journal of natural products,2004,"Guo et al., 2004"
30,QZNIVVAKPLIDJX-ZFOPBEGVSA-N,Euphorbia peplis,New cerebrosides from Euphorbia peplis L.: antimicrobial activity evaluation,https://patents.google.com/?q=QZNIVVAKPLIDJX-ZFOPBEGVSA-N&q=TI%3d%22Euphorbia+peplis%22&patents=false&scholar&sort=old,NaN,NaN,NaN,NaN,NaN,NaN
31,QMAYBMKBYCGXDH-UHFFFAOYSA-N,Lamiaceae,,https://patents.google.com/?q=QMAYBMKBYCGXDH-UHFFFAOYSA-N&q=TI%3d%22Lamiaceae%22&patents=false&scholar&sort=old,https://patents.google.com/scholar/5840493203632321183,NaN,NaN,NaN,NaN,NaN
32,SWRFKGRMQVLMKA-JIZJWZDPSA-N,Dioscorea japonica,,https://patents.google.com/?q=SWRFKGRMQVLMKA-JIZJWZDPSA-N&q=TI%3d%22Dioscorea+japonica%22&patents=false&scholar&sort=old,NaN,NaN,NaN,NaN,NaN,NaN
33,GMXMKSFJQLFOSO-SRRICDNISA-N,Xanthostemon oppositifolius,,https://patents.google.com/?q=GMXMKSFJQLFOSO-SRRICDNISA-N&q=TI%3d%22Xanthostemon+oppositifolius%22&patents=false&scholar&sort=old,NaN,NaN,NaN,NaN,NaN,NaN
34,XJTABSPWPMYLQX-UHFFFAOYSA-N,Murraya euchrestifolia,,https://patents.google.com/?q=XJTABSPWPMYLQX-UHFFFAOYSA-N&q=TI%3d%22Murraya+euchrestifolia%22&patents=false&scholar&sort=old,https://patents.google.com/scholar/15981203355442518397,https://www.jstage.jst.go.jp/article/cpb1958/33/10/33_10_4132/_pdf,Chemical constituents of Murraya euchrestifolia HAYATA. Structures of novel carbazolequinones and other new carbazole alkaloids,Chemical and pharmaceutical bulletin,1985,"Furukawa et al., 1985"
35,JDCPEKQWFDWQLI-MZPUHGDESA-N,Panax ginseng,Liquid chromatography–electrospray mass spectrometric identification of ginsenosides in Panax ginseng roots,https://patents.google.com/?q=JDCPEKQWFDWQLI-MZPUHGDESA-N&q=TI%3d%22Panax+ginseng%22&patents=false&scholar&sort=old,NaN,NaN,NaN,NaN,NaN,NaN
36,MWHXKPBCIAZXEJ-ZXMLKOPSSA-N,Daphniphyllum longeracemosum,,https://patents.google.com/?q=MWHXKPBCIAZXEJ-ZXMLKOPSSA-N&q=TI%3d%22Daphniphyllum+longeracemosum%22&patents=false&scholar&sort=old,NaN,NaN,NaN,NaN,NaN,NaN
37,RNYZJZKPGHQTJR-UHFFFAOYSA-N,Clematis flammula,,https://patents.google.com/?q=RNYZJZKPGHQTJR-UHFFFAOYSA-N&q=TI%3d%22Clematis+flammula%22&patents=false&scholar&sort=old,https://patents.google.com/scholar/5574012580270243735,https://www.sciencedirect.com/science/article/pii/S1995764517307745,"Antifungal, molluscicidal and larvicidal assessment of anemonin and Clematis flammula L. extracts against mollusc Galba truncatula, intermediate host of Fasciola …",Asian Pacific journal of tropical medicine,2017,"Saidi et al., 2017"
38,KVMXBSSOCCPAOR-DMKPBYKFSA-N,Coreopsis nodosa,,https://patents.google.com/?q=KVMXBSSOCCPAOR-DMKPBYKFSA-N&q=TI%3d%22Coreopsis+nodosa%22&patents=false&scholar&sort=old,NaN,NaN,NaN,NaN,NaN,NaN
39,SAEPCOKFKLLTED-UHFFFAOYSA-N,Acanthaceae,,https://patents.google.com/?q=SAEPCOKFKLLTED-UHFFFAOYSA-N&q=TI%3d%22Acanthaceae%22&patents=false&scholar&sort=old,https://patents.google.com/scholar/14487944748272835150,NaN,NaN,NaN,NaN,NaN
40,YYGNTYWPHWGJRM-AAJYLUCBSA-N,Coronilla cretica,,https://patents.google.com/?q=YYGNTYWPHWGJRM-AAJYLUCBSA-N&q=TI%3d%22Coronilla+cretica%22&patents=false&scholar&sort=old,NaN,NaN,NaN,NaN,NaN,NaN
41,CGYAQWIKCVTWHO-QPJJXVBHSA-N,Penstemon fruticosus,,https://patents.google.com/?q=CGYAQWIKCVTWHO-QPJJXVBHSA-N&q=TI%3d%22Penstemon+fruticosus%22&patents=false&scholar&sort=old,NaN,NaN,NaN,NaN,NaN,NaN
42,RNZCIODIVSAJQF-FPOFAZKOSA-N,Oreosolen wattii,,https://patents.google.com/?q=RNZCIODIVSAJQF-FPOFAZKOSA-N&q=TI%3d%22Oreosolen+wattii%22&patents=false&scholar&sort=old,NaN,NaN,NaN,NaN,NaN,NaN
43,VNCQCPQAMDQEBY-YTJHIPEWSA-N,Pennisetum glaucum,,https://patents.google.com/?q=VNCQCPQAMDQEBY-YTJHIPEWSA-N&q=TI%3d%22Pennisetum+glaucum%22&patents=false&scholar&sort=old,NaN,NaN,NaN,NaN,NaN,NaN
44,WUYQEGNOQLRQAQ-AWEZNQCLSA-N,Annona cherimola,,https://patents.google.com/?q=WUYQEGNOQLRQAQ-AWEZNQCLSA-N&q=TI%3d%22Annona+cherimola%22&patents=false&scholar&sort=old,NaN,NaN,NaN,NaN,NaN,NaN
45,HCXVJBMSMIARIN-PHZDYDNGSA-N,Origanum,,https://patents.google.com/?q=HCXVJBMSMIARIN-PHZDYDNGSA-N&q=TI%3d%22Origanum%22&patents=false&scholar&sort=old,https://patents.google.com/scholar/15981473367754656365,https://www.researchgate.net/profile/Erika_Vagi/publication/8098518_Phenolic_and_Triterpenoid_Antioxidants_from_Origanum_majorana_L_Herb_and_Extracts_Obtained_with_Different_Solvents/links/5ad06bdba6fdcc878411c9fd/Phenolic-and-Triterpenoid-Antioxidants-from-Origanum-majorana-L-Herb-and-Extracts-Obtained-with-Different-Solvents.pdf,Phenolic and triterpenoid antioxidants from Origanum majorana L. herb and extracts obtained with different solvents,Journal of agricultural and food chemistry,2005,"Vagi et al., 2005"
46,YUSWMAULDXZHPY-UHFFFAOYSA-N,Selaginella willdenowii,,https://patents.google.com/?q=YUSWMAULDXZHPY-UHFFFAOYSA-N&q=TI%3d%22Selaginella+willdenowii%22&patents=false&scholar&sort=old,https://patents.google.com/scholar/6023580851183742370,https://www.sciencedirect.com/science/article/pii/003194229500212P,Cytotoxic biflavonoids from Selaginella willdenowii,Phytochemistry,1995,"Silva et al., 1995"
47,XTOKXEQMTBIOGT-AWEZNQCLSA-N,Thalictrum minus,,https://patents.google.com/?q=XTOKXEQMTBIOGT-AWEZNQCLSA-N&q=TI%3d%22Thalictrum+minus%22&patents=false&scholar&sort=old,https://patents.google.com/scholar/18336789283761576767,https://link.springer.com/article/10.1007/BF00564307,N-oxides of thalicmidine and preocoteine from the roots of Thalictrum minus,Chemistry of Natural Compounds,1972,"Khozhdaev et al., 1972"
48,AKSGLPBROCFVSE-TUHDNREHSA-N,Trifolium alexandrinum,,https://patents.google.com/?q=AKSGLPBROCFVSE-TUHDNREHSA-N&q=TI%3d%22Trifolium+alexandrinum%22&patents=false&scholar&sort=old,NaN,NaN,NaN,NaN,NaN,NaN
49,FJAQNRBDVKIIKK-LFLQOBSNSA-N,Streptomyces hygroscopicus,Resistance genes of aminocoumarin producers: two type II topoisomerase genes confer resistance against coumermycin A1 and clorobiocin.,https://patents.google.com/?q=FJAQNRBDVKIIKK-LFLQOBSNSA-N&q=TI%3d%22Streptomyces+hygroscopicus%22&patents=false&scholar&sort=old,NaN,NaN,NaN,NaN,NaN,NaN
50,PVLHKMGYBLUVEL-FPLPWBNLSA-N,Pyrularia pubera,,https://patents.google.com/?q=PVLHKMGYBLUVEL-FPLPWBNLSA-N&q=TI%3d%22Pyrularia+pubera%22&patents=false&scholar&sort=old,NaN,NaN,NaN,NaN,NaN,NaN
51,WKKJGHCXVKEJNU-QMIVOQANSA-N,Arecastrum romanzoffianum,,https://patents.google.com/?q=WKKJGHCXVKEJNU-QMIVOQANSA-N&q=TI%3d%22Arecastrum+romanzoffianum%22&patents=false&scholar&sort=old,NaN,NaN,NaN,NaN,NaN,NaN
52,WRJIJSMXYWUZAJ-BLLLJJGKSA-N,Paecilomyces variotii,Antibacterial Polyketides from the Jellyfish-Derived FungusPaecilomyces variotii,https://patents.google.com/?q=WRJIJSMXYWUZAJ-BLLLJJGKSA-N&q=TI%3d%22Paecilomyces+variotii%22&patents=false&scholar&sort=old,https://patents.google.com/scholar/14989095797276289358,https://pubs.acs.org/doi/abs/10.1021/np200350b,Antibacterial polyketides from the jellyfish-derived fungus Paecilomyces variotii,Journal of natural products,2011,"Liu et al., 2011"
53,CDAISMWEOUEBRE-GPIVLXJGSA-N,Asparagus officinalis,,https://patents.google.com/?q=CDAISMWEOUEBRE-GPIVLXJGSA-N&q=TI%3d%22Asparagus+officinalis%22&patents=false&scholar&sort=old,https://patents.google.com/scholar/724094024743782308,https://academic.oup.com/jxb/article-abstract/26/2/263/486351,Regeneration of Asparagus officinalis L. through callus cultures derived from protoplasts,Journal of Experimental Botany,1975,"Ha et al., 1975"
54,SBHOAZQBEGVQLJ-UHFFFAOYSA-N,Mammea americana,,https://patents.google.com/?q=SBHOAZQBEGVQLJ-UHFFFAOYSA-N&q=TI%3d%22Mammea+americana%22&patents=false&scholar&sort=old,https://patents.google.com/scholar/7947934585885619338,https://pubs.rsc.org/en/content/articlehtml/1967/j3/j39670002553,"Extractives of Mammea americana L. Part II. The 4-phenylcoumarins. Isolation and structure of Mammea A/AA, A/A cyclo D, A/BA, A/AB, and A/BB",Journal of the Chemical Society C: Organic,1967,"Crombie et al., 1967"
55,XAOLJGCZESYRFT-VHSKNIDJSA-N,Petunia axillaris,,https://patents.google.com/?q=XAOLJGCZESYRFT-VHSKNIDJSA-N&q=TI%3d%22Petunia+axillaris%22&patents=false&scholar&sort=old,NaN,NaN,NaN,NaN,NaN,NaN
56,YBUPEBCCYZBAJQ-UHFFFAOYSA-N,Notodoris gardineri,,https://patents.google.com/?q=YBUPEBCCYZBAJQ-UHFFFAOYSA-N&q=TI%3d%22Notodoris+gardineri%22&patents=false&scholar&sort=old,NaN,NaN,NaN,NaN,NaN,NaN
57,JEYLKNVLTAPJAF-RXMQYKEDSA-N,Quercus sessiliflora,,https://patents.google.com/?q=JEYLKNVLTAPJAF-RXMQYKEDSA-N&q=TI%3d%22Quercus+sessiliflora%22&patents=false&scholar&sort=old,NaN,NaN,NaN,NaN,NaN,NaN
58,MLYKFKUTKJPICF-UHFFFAOYSA-N,Aconitum campylorrhynchum,,https://patents.google.com/?q=MLYKFKUTKJPICF-UHFFFAOYSA-N&q=TI%3d%22Aconitum+campylorrhynchum%22&patents=false&scholar&sort=old,https://patents.google.com/scholar/4991510262489267833,https://europepmc.org/abstract/med/2284971,Studies on the chemical constituents of Aconitum campylorrhynchum,Yao xue xue bao= Acta pharmaceutica Sinica,1990,"Ding et al., 1990"
59,BVHIKUCXNBQDEM-UHFFFAOYSA-N,Olea europaea,,https://patents.google.com/?q=BVHIKUCXNBQDEM-UHFFFAOYSA-N&q=TI%3d%22Olea+europaea%22&patents=false&scholar&sort=old,https://patents.google.com/scholar/2208581236918672765,NaN,NaN,NaN,NaN,NaN
60,WSLYCILIEOFQPK-UHFFFAOYSA-N,Pseudoalteromonas haloplanktis,,https://patents.google.com/?q=WSLYCILIEOFQPK-UHFFFAOYSA-N&q=TI%3d%22Pseudoalteromonas+haloplanktis%22&patents=false&scholar&sort=old,NaN,NaN,NaN,NaN,NaN,NaN
61,PVTHJAPFENJVNC-UQTMRZPGSA-N,Streptomyces kasugaensis,Cloning and analysis of a gene (sms13) encoding sannamycin B-glycyltransferase from Streptomyces sannanensis and its distribution among actinomycetes.,https://patents.google.com/?q=PVTHJAPFENJVNC-UQTMRZPGSA-N&q=TI%3d%22Streptomyces+kasugaensis%22&patents=false&scholar&sort=old,NaN,NaN,NaN,NaN,NaN,NaN
62,QKHCQFQIJKXMOE-QAQUXCEGSA-N,Vitex,,https://patents.google.com/?q=QKHCQFQIJKXMOE-QAQUXCEGSA-N&q=TI%3d%22Vitex%22&patents=false&scholar&sort=old,NaN,NaN,NaN,NaN,NaN,NaN
63,MIJYXULNPSFWEK-LXLHWSNGSA-N,Diospyros moonii,,https://patents.google.com/?q=MIJYXULNPSFWEK-LXLHWSNGSA-N&q=TI%3d%22Diospyros+moonii%22&patents=false&scholar&sort=old,NaN,NaN,NaN,NaN,NaN,NaN
64,IPQKDIRUZHOIOM-IAAKTDFRSA-N,Dryopteris,,https://patents.google.com/?q=IPQKDIRUZHOIOM-IAAKTDFRSA-N&q=TI%3d%22Dryopteris%22&patents=false&scholar&sort=old,NaN,NaN,NaN,NaN,NaN,NaN
65,QBOLVLBSUGJHGB-WDSKDSINSA-N,Oryza longistaminata,,https://patents.google.com/?q=QBOLVLBSUGJHGB-WDSKDSINSA-N&q=TI%3d%22Oryza+longistaminata%22&patents=false&scholar&sort=old,NaN,NaN,NaN,NaN,NaN,NaN
66,NBSCHQHZLSJFNQ-RWOPYEJCSA-N,Petunia axillaris,,https://patents.google.com/?q=NBSCHQHZLSJFNQ-RWOPYEJCSA-N&q=TI%3d%22Petunia+axillaris%22&patents=false&scholar&sort=old,NaN,NaN,NaN,NaN,NaN,NaN
67,IPCSVZSSVZVIGE-UHFFFAOYSA-N,Isatis indigotica,,https://patents.google.com/?q=IPCSVZSSVZVIGE-UHFFFAOYSA-N&q=TI%3d%22Isatis+indigotica%22&patents=false&scholar&sort=old,https://patents.google.com/scholar/16224659228299447272,https://www.thieme-connect.com/products/ejournals/pdf/10.1055/s-2007-971650.pdf,"Isolation of 2-hydroxy-3-butenyl thiocyanate, epigoitrin, and adenosine from 'banlangen', Isatis indigotica root",Planta medica,1981,"Qiao-Shu et al., 1981"
68,FEWLNYSYJNLUOO-UHFFFAOYSA-N,Piper,,https://patents.google.com/?q=FEWLNYSYJNLUOO-UHFFFAOYSA-N&q=TI%3d%22Piper%22&patents=false&scholar&sort=old,https://patents.google.com/scholar/4460839139831196479,NaN,NaN,NaN,NaN,NaN
69,BYGRZBWUKYXRHL-UHFFFAOYSA-N,Astragalus chrysopterus,,https://patents.google.com/?q=BYGRZBWUKYXRHL-UHFFFAOYSA-N&q=TI%3d%22Astragalus+chrysopterus%22&patents=false&scholar&sort=old,NaN,NaN,NaN,NaN,NaN,NaN
70,DIXWVWLWNGDQEC-UHFFFAOYSA-N,Coccus,,https://patents.google.com/?q=DIXWVWLWNGDQEC-UHFFFAOYSA-N&q=TI%3d%22Coccus%22&patents=false&scholar&sort=old,NaN,NaN,NaN,NaN,NaN,NaN
71,YFVXJVUOUCABDU-LDHFCIDVSA-N,Leucocyclus formosus,,https://patents.google.com/?q=YFVXJVUOUCABDU-LDHFCIDVSA-N&q=TI%3d%22Leucocyclus+formosus%22&patents=false&scholar&sort=old,NaN,NaN,NaN,NaN,NaN,NaN
72,QQGLQYQXUKHWPX-UNSIAWGWSA-N,Carica papaya,,https://patents.google.com/?q=QQGLQYQXUKHWPX-UNSIAWGWSA-N&q=TI%3d%22Carica+papaya%22&patents=false&scholar&sort=old,NaN,NaN,NaN,NaN,NaN,NaN
73,OCVDPTFDIDYGNY-UHFFFAOYSA-N,Selaginella tamariscina,,https://patents.google.com/?q=OCVDPTFDIDYGNY-UHFFFAOYSA-N&q=TI%3d%22Selaginella+tamariscina%22&patents=false&scholar&sort=old,NaN,NaN,NaN,NaN,NaN,NaN
74,BOPIMTNSYWYZOC-VNHYZAJKSA-N,Lindera,,https://patents.google.com/?q=BOPIMTNSYWYZOC-VNHYZAJKSA-N&q=TI%3d%22Lindera%22&patents=false&scholar&sort=old,https://patents.google.com/scholar/7683148883979280181,NaN,NaN,NaN,NaN,NaN
75,PHOZASLNSDMYGR-VZRGJMDUSA-N,Emericella,,https://patents.google.com/?q=PHOZASLNSDMYGR-VZRGJMDUSA-N&q=TI%3d%22Emericella%22&patents=false&scholar&sort=old,https://patents.google.com/scholar/257188619872058260,NaN,NaN,NaN,NaN,NaN
76,RROGHRHLBLVQSG-UHFFFAOYSA-N,Pulsatilla dahurica,,https://patents.google.com/?q=RROGHRHLBLVQSG-UHFFFAOYSA-N&q=TI%3d%22Pulsatilla+dahurica%22&patents=false&scholar&sort=old,NaN,NaN,NaN,NaN,NaN,NaN
77,KDRQUXQQNFOTAO-ISLYRVAYSA-N,Conyza canadensis,,https://patents.google.com/?q=KDRQUXQQNFOTAO-ISLYRVAYSA-N&q=TI%3d%22Conyza+canadensis%22&patents=false&scholar&sort=old,NaN,NaN,NaN,NaN,NaN,NaN
78,FFOPQHZFBMZAKK-UJHQHGQKSA-N,Viticis,,https://patents.google.com/?q=FFOPQHZFBMZAKK-UJHQHGQKSA-N&q=TI%3d%22Viticis%22&patents=false&scholar&sort=old,NaN,NaN,NaN,NaN,NaN,NaN
79,KZJWDPNRJALLNS-BWRKXDIJSA-N,Solidago chinensis,,https://patents.google.com/?q=KZJWDPNRJALLNS-BWRKXDIJSA-N&q=TI%3d%22Solidago+chinensis%22&patents=false&scholar&sort=old,NaN,NaN,NaN,NaN,NaN,NaN
80,MXXWOMGUGJBKIW-YPCIICBESA-N,Piper,,https://patents.google.com/?q=MXXWOMGUGJBKIW-YPCIICBESA-N&q=TI%3d%22Piper%22&patents=false&scholar&sort=old,NaN,NaN,NaN,NaN,NaN,NaN
81,CSVDSXWAISTBNQ-ZPHPHTNESA-N,Briareum,,https://patents.google.com/?q=CSVDSXWAISTBNQ-ZPHPHTNESA-N&q=TI%3d%22Briareum%22&patents=false&scholar&sort=old,NaN,NaN,NaN,NaN,NaN,NaN
82,PAAIVDWVROTCOU-SREVYHEPSA-N,Phalaenopsis aphrodite,,https://patents.google.com/?q=PAAIVDWVROTCOU-SREVYHEPSA-N&q=TI%3d%22Phalaenopsis+aphrodite%22&patents=false&scholar&sort=old,NaN,NaN,NaN,NaN,NaN,NaN
83,UFCLZKMFXSILNL-PSEXTPKNSA-N,Coffea robusta,,https://patents.google.com/?q=UFCLZKMFXSILNL-PSEXTPKNSA-N&q=TI%3d%22Coffea+robusta%22&patents=false&scholar&sort=old,NaN,NaN,NaN,NaN,NaN,NaN
84,IRZVHDLBAYNPCT-UHFFFAOYSA-N,Acrocarpia paniculata,,https://patents.google.com/?q=IRZVHDLBAYNPCT-UHFFFAOYSA-N&q=TI%3d%22Acrocarpia+paniculata%22&patents=false&scholar&sort=old,NaN,NaN,NaN,NaN,NaN,NaN
85,HGZMVLUPBGGJMI-RMKNXTFCSA-N,Prorocentrum micans,,https://patents.google.com/?q=HGZMVLUPBGGJMI-RMKNXTFCSA-N&q=TI%3d%22Prorocentrum+micans%22&patents=false&scholar&sort=old,NaN,NaN,NaN,NaN,NaN,NaN
86,PZZRDJXEMZMZFD-IEGSVRCHSA-N,Lecanora planaica,,https://patents.google.com/?q=PZZRDJXEMZMZFD-IEGSVRCHSA-N&q=TI%3d%22Lecanora+planaica%22&patents=false&scholar&sort=old,NaN,NaN,NaN,NaN,NaN,NaN
87,IVLBHBFTRNVIAP-MEGGAXOGSA-N,Vitis vinifera,,https://patents.google.com/?q=IVLBHBFTRNVIAP-MEGGAXOGSA-N&q=TI%3d%22Vitis+vinifera%22&patents=false&scholar&sort=old,NaN,NaN,NaN,NaN,NaN,NaN
88,VIOIVRWPFHCJTK-HRVZHFCNSA-N,Aster tataricus,,https://patents.google.com/?q=VIOIVRWPFHCJTK-HRVZHFCNSA-N&q=TI%3d%22Aster+tataricus%22&patents=false&scholar&sort=old,NaN,NaN,NaN,NaN,NaN,NaN
89,LICNWLVMUWTBPF-UHFFFAOYSA-N,Sophora tonkinensis,,https://patents.google.com/?q=LICNWLVMUWTBPF-UHFFFAOYSA-N&q=TI%3d%22Sophora+tonkinensis%22&patents=false&scholar&sort=old,NaN,NaN,NaN,NaN,NaN,NaN
90,KMOUJOKENFFTPU-QNDFHXLGSA-N,Sarcomelicope argyrophylla,,https://patents.google.com/?q=KMOUJOKENFFTPU-QNDFHXLGSA-N&q=TI%3d%22Sarcomelicope+argyrophylla%22&patents=false&scholar&sort=old,NaN,NaN,NaN,NaN,NaN,NaN
91,NHNODHRSCRALBF-NQNBQJKNSA-N,Cicer arietinum,,https://patents.google.com/?q=NHNODHRSCRALBF-NQNBQJKNSA-N&q=TI%3d%22Cicer+arietinum%22&patents=false&scholar&sort=old,NaN,NaN,NaN,NaN,NaN,NaN
92,UKZCPYJTHXIGBQ-UHFFFAOYSA-N,Streptomyces,"Rotihibins, Novel Plant Growth Regulators from Streptomyces graminofaciens.",https://patents.google.com/?q=UKZCPYJTHXIGBQ-UHFFFAOYSA-N&q=TI%3d%22Streptomyces%22&patents=false&scholar&sort=old,NaN,NaN,NaN,NaN,NaN,NaN
93,LTEDCNNXJUTLEF-IXFPVDPPSA-N,Guatteria boliviana,,https://patents.google.com/?q=LTEDCNNXJUTLEF-IXFPVDPPSA-N&q=TI%3d%22Guatteria+boliviana%22&patents=false&scholar&sort=old,NaN,NaN,NaN,NaN,NaN,NaN
94,LSHVYAFMTMFKBA-TZIWHRDSSA-N,Senna siamea,,https://patents.google.com/?q=LSHVYAFMTMFKBA-TZIWHRDSSA-N&q=TI%3d%22Senna+siamea%22&patents=false&scholar&sort=old,NaN,NaN,NaN,NaN,NaN,NaN
95,COTCWLNCVLHGEY-UHFFFAOYSA-N,Phaeanthus vietnamensis,,https://patents.google.com/?q=COTCWLNCVLHGEY-UHFFFAOYSA-N&q=TI%3d%22Phaeanthus+vietnamensis%22&patents=false&scholar&sort=old,NaN,NaN,NaN,NaN,NaN,NaN
96,OZIHYFWYFUSXIS-HDDFSWBLSA-N,Ranunculus bulbosus,,https://patents.google.com/?q=OZIHYFWYFUSXIS-HDDFSWBLSA-N&q=TI%3d%22Ranunculus+bulbosus%22&patents=false&scholar&sort=old,NaN,NaN,NaN,NaN,NaN,NaN
97,LTXWSWWXNHYXCW-UJOWSUJOSA-N,Lemnalia,Steroids and sesquiterpenoids from the soft corals Dendronephthya gigantea and Lemnalia cervicorni.,https://patents.google.com/?q=LTXWSWWXNHYXCW-UJOWSUJOSA-N&q=TI%3d%22Lemnalia%22&patents=false&scholar&sort=old,NaN,NaN,NaN,NaN,NaN,NaN
98,MUNWAHDYFVYIKH-PHDIDXHHSA-N,Epidendrum rigidum,,https://patents.google.com/?q=MUNWAHDYFVYIKH-PHDIDXHHSA-N&q=TI%3d%22Epidendrum+rigidum%22&patents=false&scholar&sort=old,NaN,NaN,NaN,NaN,NaN,NaN
99,HDVRLUFGYQYLFJ-UHFFFAOYSA-N,Micromonas pusilla,,https://patents.google.com/?q=HDVRLUFGYQYLFJ-UHFFFAOYSA-N&q=TI%3d%22Micromonas+pusilla%22&patents=false&scholar&sort=old,NaN,NaN,NaN,NaN,NaN,NaN
100,SAJFRLDIWQUNCQ-KFWWJZLASA-N,Buxus hildebrandtii,,https://patents.google.com/?q=SAJFRLDIWQUNCQ-KFWWJZLASA-N&q=TI%3d%22Buxus+hildebrandtii%22&patents=false&scholar&sort=old,NaN,NaN,NaN,NaN,NaN,NaN
101,IQPNAANSBPBGFQ-UHFFFAOYSA-N,Prosopis glandulosa,,https://patents.google.com/?q=IQPNAANSBPBGFQ-UHFFFAOYSA-N&q=TI%3d%22Prosopis+glandulosa%22&patents=false&scholar&sort=old,NaN,NaN,NaN,NaN,NaN,NaN
102,LAAFMXBDDPXIKZ-UHFFFAOYSA-N,Aloe deltoideodonta,,https://patents.google.com/?q=LAAFMXBDDPXIKZ-UHFFFAOYSA-N&q=TI%3d%22Aloe+deltoideodonta%22&patents=false&scholar&sort=old,NaN,NaN,NaN,NaN,NaN,NaN
103,TXHIPUZLOILIIU-RAJZRIHCSA-N,Vitis vinifera,,https://patents.google.com/?q=TXHIPUZLOILIIU-RAJZRIHCSA-N&q=TI%3d%22Vitis+vinifera%22&patents=false&scholar&sort=old,NaN,NaN,NaN,NaN,NaN,NaN
104,RODXRVNMMDRFIK-UHFFFAOYSA-N,Platytaenia dasycarpa,,https://patents.google.com/?q=RODXRVNMMDRFIK-UHFFFAOYSA-N&q=TI%3d%22Platytaenia+dasycarpa%22&patents=false&scholar&sort=old,NaN,NaN,NaN,NaN,NaN,NaN
105,WQZGKKKJIJFFOK-PHYPRBDBSA-N,Fridericia chica,,https://patents.google.com/?q=WQZGKKKJIJFFOK-PHYPRBDBSA-N&q=TI%3d%22Fridericia+chica%22&patents=false&scholar&sort=old,NaN,NaN,NaN,NaN,NaN,NaN
106,NDZJCEAHBZKIDU-KGSGWQTPSA-N,Asparagus officinalis,,https://patents.google.com/?q=NDZJCEAHBZKIDU-KGSGWQTPSA-N&q=TI%3d%22Asparagus+officinalis%22&patents=false&scholar&sort=old,NaN,NaN,NaN,NaN,NaN,NaN
107,IGDOLPGZDYSOBC-UHFFFAOYSA-N,Origanum majorana,,https://patents.google.com/?q=IGDOLPGZDYSOBC-UHFFFAOYSA-N&q=TI%3d%22Origanum+majorana%22&patents=false&scholar&sort=old,NaN,NaN,NaN,NaN,NaN,NaN
108,WEWBWVMTOYUPHH-UUFBCVLASA-N,Senna siamea,,https://patents.google.com/?q=WEWBWVMTOYUPHH-UUFBCVLASA-N&q=TI%3d%22Senna+siamea%22&patents=false&scholar&sort=old,NaN,NaN,NaN,NaN,NaN,NaN
109,SAQCMXSMERVZIH-OQLLNIDSSA-N,Ceratodictyon spongiosum,,https://patents.google.com/?q=SAQCMXSMERVZIH-OQLLNIDSSA-N&q=TI%3d%22Ceratodictyon+spongiosum%22&patents=false&scholar&sort=old,NaN,NaN,NaN,NaN,NaN,NaN
110,FFDULTAFAQRACT-XKBSQSBASA-N,Tephroseris kirilowii,,https://patents.google.com/?q=FFDULTAFAQRACT-XKBSQSBASA-N&q=TI%3d%22Tephroseris+kirilowii%22&patents=false&scholar&sort=old,NaN,NaN,NaN,NaN,NaN,NaN
111,MRBLTWPEPGRXQN-INIPNLRTSA-N,Tephroseris kirilowii,,https://patents.google.com/?q=MRBLTWPEPGRXQN-INIPNLRTSA-N&q=TI%3d%22Tephroseris+kirilowii%22&patents=false&scholar&sort=old,NaN,NaN,NaN,NaN,NaN,NaN
112,CLBAIZZJADAEOT-ZVWYDXNDSA-N,Borassus flabellifer,,https://patents.google.com/?q=CLBAIZZJADAEOT-ZVWYDXNDSA-N&q=TI%3d%22Borassus+flabellifer%22&patents=false&scholar&sort=old,NaN,NaN,NaN,NaN,NaN,NaN
113,HDSXDWASQCHADG-OAHLLOKOSA-N,Colchicum,,https://patents.google.com/?q=HDSXDWASQCHADG-OAHLLOKOSA-N&q=TI%3d%22Colchicum%22&patents=false&scholar&sort=old,NaN,NaN,NaN,NaN,NaN,NaN
114,WEPFDGKIDPCING-MGPQQGTHSA-N,Escontria chiotilla,,https://patents.google.com/?q=WEPFDGKIDPCING-MGPQQGTHSA-N&q=TI%3d%22Escontria+chiotilla%22&patents=false&scholar&sort=old,NaN,NaN,NaN,NaN,NaN,NaN
115,PCWWIOUZYOPZHT-VBUSEHTESA-N,Piper longum,Preparative isolation and purification of amides from the fruits of Piper longum L. by upright counter-current chromatography and reversed-phase liquid chromatography,https://patents.google.com/?q=PCWWIOUZYOPZHT-VBUSEHTESA-N&q=TI%3d%22Piper+longum%22&patents=false&scholar&sort=old,https://patents.google.com/scholar/1549395381117783352,https://www.biorxiv.org/content/biorxiv/early/2017/11/08/169763.full.pdf,Piper longum Linn: A review of its phytochemicals and their network pharmacological evaluation,bioRxiv,2017,"Choudhary et al., 2017"
116,AWNFCMRYPKKIHV-CCCSFANCSA-N,Gentiana punctata,,https://patents.google.com/?q=AWNFCMRYPKKIHV-CCCSFANCSA-N&q=TI%3d%22Gentiana+punctata%22&patents=false&scholar&sort=old,NaN,NaN,NaN,NaN,NaN,NaN
117,FMMOOAYVCKXGMF-MURFETPASA-N,Fructus,,https://patents.google.com/?q=FMMOOAYVCKXGMF-MURFETPASA-N&q=TI%3d%22Fructus%22&patents=false&scholar&sort=old,https://patents.google.com/scholar/15294203647971180524,https://www.tandfonline.com/doi/pdf/10.1080/00021369.1989.10869813,Volatile flavor components of CORNI FRUCTUS (Cornus officinalis Sieb. et Zucc.),Agricultural and biological chemistry,1989,"Miyazawa et al., 1989"
118,FJAQNRBDVKIIKK-LFLQOBSNSA-N,Streptomyces hygroscopicus,Structure and mechanism of the magnesium-independent aromatic prenyltransferase CloQ from the clorobiocin biosynthetic pathway.,https://patents.google.com/?q=FJAQNRBDVKIIKK-LFLQOBSNSA-N&q=TI%3d%22Streptomyces+hygroscopicus%22&patents=false&scholar&sort=old,NaN,NaN,NaN,NaN,NaN,NaN
119,OLAKPNFIICOONC-ZJUUUORDSA-N,Petunia axillaris,,https://patents.google.com/?q=OLAKPNFIICOONC-ZJUUUORDSA-N&q=TI%3d%22Petunia+axillaris%22&patents=false&scholar&sort=old,NaN,NaN,NaN,NaN,NaN,NaN
120,YSJGIOJYGKGLQE-UHFFFAOYSA-N,Reaumuria vermiculata,Cytotoxic ellagitannins from Reaumuria vermiculata,https://patents.google.com/?q=YSJGIOJYGKGLQE-UHFFFAOYSA-N&q=TI%3d%22Reaumuria+vermiculata%22&patents=false&scholar&sort=old,NaN,NaN,NaN,NaN,NaN,NaN
121,VGWBUQPQZOSEEG-ZCZCPNQZSA-N,Angostura granulosa,,https://patents.google.com/?q=VGWBUQPQZOSEEG-ZCZCPNQZSA-N&q=TI%3d%22Angostura+granulosa%22&patents=false&scholar&sort=old,NaN,NaN,NaN,NaN,NaN,NaN
122,YUSWMAULDXZHPY-UHFFFAOYSA-N,Selaginella moellendorffii,,https://patents.google.com/?q=YUSWMAULDXZHPY-UHFFFAOYSA-N&q=TI%3d%22Selaginella+moellendorffii%22&patents=false&scholar&sort=old,https://patents.google.com/scholar/16132982659070237055,https://www.airitilibrary.com/Publication/alDetailedMesh?docid=10176446-199509-201003290024-201003290024-223-230,Test of the Biflavones from Selaginella Moellendorffii on the in Vitro Inhibition of HIV-1 Protease,中醫藥雜誌,1995,"Sun et al., 1995"
123,HYBRYAPKQCZIAE-UHFFFAOYSA-N,Teclea sudanica,,https://patents.google.com/?q=HYBRYAPKQCZIAE-UHFFFAOYSA-N&q=TI%3d%22Teclea+sudanica%22&patents=false&scholar&sort=old,NaN,NaN,NaN,NaN,NaN,NaN
124,KANVQRLDTGOSBL-HUUCEWRRSA-N,Flammulina velutipes,,https://patents.google.com/?q=KANVQRLDTGOSBL-HUUCEWRRSA-N&q=TI%3d%22Flammulina+velutipes%22&patents=false&scholar&sort=old,https://patents.google.com/scholar/7742382769177387475,https://www.sciencedirect.com/science/article/pii/S0031942200001898,Highly oxidized cuparene-type sesquiterpenes from a mycelial culture of Flammulina velutipes,Phytochemistry,2000,"Ishikawa et al., 2000"
125,5.6696,[],,https://patents.google.com/?q=5.6696&q=TI%3d%22[]%22&patents=false&scholar&sort=old,https://patents.google.com/scholar/1589845920367855487,http://adsabs.harvard.edu/full/1995AJ....110.1866F,Mid-infrared observations of the nucleus and dust of Comet P/Swift-Tuttle,The Astronomical Journal,1995,"Fomenkova et al., 1995"
126,PGCDSBFUSBDSAX-UHFFFAOYSA-N,Cussonia paniculata,,https://patents.google.com/?q=PGCDSBFUSBDSAX-UHFFFAOYSA-N&q=TI%3d%22Cussonia+paniculata%22&patents=false&scholar&sort=old,NaN,NaN,NaN,NaN,NaN,NaN
127,FBUBVLUPUDBFME-UHFFFAOYSA-N,Punicaceae,,https://patents.google.com/?q=FBUBVLUPUDBFME-UHFFFAOYSA-N&q=TI%3d%22Punicaceae%22&patents=false&scholar&sort=old,NaN,NaN,NaN,NaN,NaN,NaN
128,RDUAJIJVNHKTQC-UHFFFAOYSA-N,Plantae,Profiling of phenolic compounds and antioxidant activity of dry extracts from the selected Sorbus species.,https://patents.google.com/?q=RDUAJIJVNHKTQC-UHFFFAOYSA-N&q=TI%3d%22Plantae%22&patents=false&scholar&sort=old,NaN,NaN,NaN,NaN,NaN,NaN
129,QLJNETOQFQXTLI-WMYFGKAISA-N,Calodendrum capense,,https://patents.google.com/?q=QLJNETOQFQXTLI-WMYFGKAISA-N&q=TI%3d%22Calodendrum+capense%22&patents=false&scholar&sort=old,NaN,NaN,NaN,NaN,NaN,NaN
130,QZZGJDVWLFXDLK-UHFFFAOYSA-N,Kniphofia foliosa,,https://patents.google.com/?q=QZZGJDVWLFXDLK-UHFFFAOYSA-N&q=TI%3d%22Kniphofia+foliosa%22&patents=false&scholar&sort=old,NaN,NaN,NaN,NaN,NaN,NaN
131,NTYJJOPFIAHURM-UHFFFAOYSA-N,Arctium,,https://patents.google.com/?q=NTYJJOPFIAHURM-UHFFFAOYSA-N&q=TI%3d%22Arctium%22&patents=false&scholar&sort=old,https://patents.google.com/scholar/16306538990502969922,https://synapse.koreamed.org/DOIx.php?id=10.11637/kjpa.2004.17.1.55,Inhibitory effect of Arctium lappa Linne on compound 48/80-induced mast cell activation and vascular permeability,Korean Journal of Physical Anthropology,2004,"Kim et al., 2004"
132,DDWHHTJGVBUNTF-UHFFFAOYSA-N,Croton tiglium,,https://patents.google.com/?q=DDWHHTJGVBUNTF-UHFFFAOYSA-N&q=TI%3d%22Croton+tiglium%22&patents=false&scholar&sort=old,NaN,NaN,NaN,NaN,NaN,NaN
133,MOYAFQVGZZPNRA-UHFFFAOYSA-N,Kokoona reflexa,,https://patents.google.com/?q=MOYAFQVGZZPNRA-UHFFFAOYSA-N&q=TI%3d%22Kokoona+reflexa%22&patents=false&scholar&sort=old,NaN,NaN,NaN,NaN,NaN,NaN
134,IGDOLPGZDYSOBC-UHFFFAOYSA-N,Origanum,,https://patents.google.com/?q=IGDOLPGZDYSOBC-UHFFFAOYSA-N&q=TI%3d%22Origanum%22&patents=false&scholar&sort=old,NaN,NaN,NaN,NaN,NaN,NaN
135,MWUXSHHQAYIFBG-UHFFFAOYSA-N,Spirodela polyrhiza,,https://patents.google.com/?q=MWUXSHHQAYIFBG-UHFFFAOYSA-N&q=TI%3d%22Spirodela+polyrhiza%22&patents=false&scholar&sort=old,https://patents.google.com/scholar/6759842337209155288,http://www.dbpia.co.kr/Journal/articleDetail?nodeId=NODE02503392,Antioxidative and Acute Anti-inflammatory Effects of Spirodela polyrhiza Extract in Human HaCaT Keratinocytes and NC/Nga Mice,한국콘텐츠학회 ICCC 논문집,2009,"Mok et al., 2009"
136,NNDHDYDFEDRMGH-IUQDZDMUSA-N,Aconitum finetianum,,https://patents.google.com/?q=NNDHDYDFEDRMGH-IUQDZDMUSA-N&q=TI%3d%22Aconitum+finetianum%22&patents=false&scholar&sort=old,NaN,NaN,NaN,NaN,NaN,NaN
137,JLVVSXFLKOJNIY-UHFFFAOYSA-N,Caulophyllum thalictroides,"Pedersøn [Pedersen], Mogens",https://patents.google.com/?q=JLVVSXFLKOJNIY-UHFFFAOYSA-N&q=TI%3d%22Caulophyllum+thalictroides%22&patents=false&scholar&sort=old,NaN,NaN,NaN,NaN,NaN,NaN
138,KBPHJBAIARWVSC-RGZFRNHPSA-N,Vaccinium macrocarpon,,https://patents.google.com/?q=KBPHJBAIARWVSC-RGZFRNHPSA-N&q=TI%3d%22Vaccinium+macrocarpon%22&patents=false&scholar&sort=old,https://patents.google.com/scholar/6656516779228672947,https://journals.ashs.org/hortsci/downloadpdf/journals/hortsci/35/3/article-p501C.xml,605 Agrobacterium-mediated Cranberry (Vaccinium macrocarpon) Transformation,HortScience,2000,"Qu et al., 2000"
139,LUESCPPTDJZZQN-UHFFFAOYSA-N,Penicillium griseofulvum,,https://patents.google.com/?q=LUESCPPTDJZZQN-UHFFFAOYSA-N&q=TI%3d%22Penicillium+griseofulvum%22&patents=false&scholar&sort=old,NaN,NaN,NaN,NaN,NaN,NaN
140,QBCUUJGHWFKMDC-UHFFFAOYSA-N,Wisteria floribunda,,https://patents.google.com/?q=QBCUUJGHWFKMDC-UHFFFAOYSA-N&q=TI%3d%22Wisteria+floribunda%22&patents=false&scholar&sort=old,NaN,NaN,NaN,NaN,NaN,NaN
141,SALXTEMFWBBTBS-YPDCMUIKSA-N,Melampodium argophyllum,,https://patents.google.com/?q=SALXTEMFWBBTBS-YPDCMUIKSA-N&q=TI%3d%22Melampodium+argophyllum%22&patents=false&scholar&sort=old,NaN,NaN,NaN,NaN,NaN,NaN
142,IMGVNJNCCGXBHD-UYBVJOGSSA-N,Phaseolus vulgaris,,https://patents.google.com/?q=IMGVNJNCCGXBHD-UYBVJOGSSA-N&q=TI%3d%22Phaseolus+vulgaris%22&patents=false&scholar&sort=old,NaN,NaN,NaN,NaN,NaN,NaN
143,SROXOOFXVXNIKK-QWZNPZGDSA-N,Angostura granulosa,,https://patents.google.com/?q=SROXOOFXVXNIKK-QWZNPZGDSA-N&q=TI%3d%22Angostura+granulosa%22&patents=false&scholar&sort=old,NaN,NaN,NaN,NaN,NaN,NaN
144,ISAKRJDGNUQOIC-UHFFFAOYSA-N,Eschweilera coriacea,,https://patents.google.com/?q=ISAKRJDGNUQOIC-UHFFFAOYSA-N&q=TI%3d%22Eschweilera+coriacea%22&patents=false&scholar&sort=old,NaN,NaN,NaN,NaN,NaN,NaN
145,UMZXFBIHFDLFCP-UHFFFAOYSA-N,Ruta graveolens,,https://patents.google.com/?q=UMZXFBIHFDLFCP-UHFFFAOYSA-N&q=TI%3d%22Ruta+graveolens%22&patents=false&scholar&sort=old,NaN,NaN,NaN,NaN,NaN,NaN
146,MTZQAGJQAFMTAQ-UHFFFAOYSA-N,Ribes nigrum,,https://patents.google.com/?q=MTZQAGJQAFMTAQ-UHFFFAOYSA-N&q=TI%3d%22Ribes+nigrum%22&patents=false&scholar&sort=old,https://patents.google.com/scholar/12032862306853342349,https://onlinelibrary.wiley.com/doi/abs/10.1002/jsfa.2740200207,"Volatile constituents of the black currant, Ribes nigrum L.: I. A commercial black‐currant distillate",Journal of the Science of Food and Agriculture,1969,"Nursten et al., 1969"
147,LRMLWYXJORUTBG-UHFFFAOYSA-N,Perilla,,https://patents.google.com/?q=LRMLWYXJORUTBG-UHFFFAOYSA-N&q=TI%3d%22Perilla%22&patents=false&scholar&sort=old,NaN,NaN,NaN,NaN,NaN,NaN
148,QORYECKXLDDYAN-UHFFFAOYSA-N,Cassine xylocarpa,,https://patents.google.com/?q=QORYECKXLDDYAN-UHFFFAOYSA-N&q=TI%3d%22Cassine+xylocarpa%22&patents=false&scholar&sort=old,NaN,NaN,NaN,NaN,NaN,NaN
149,HSZHLEHJAGXDMO-UHFFFAOYSA-N,Liliaceae,,https://patents.google.com/?q=HSZHLEHJAGXDMO-UHFFFAOYSA-N&q=TI%3d%22Liliaceae%22&patents=false&scholar&sort=old,NaN,NaN,NaN,NaN,NaN,NaN
150,JXOFEBNJOOEXJY-UHFFFAOYSA-N,Symploca,,https://patents.google.com/?q=JXOFEBNJOOEXJY-UHFFFAOYSA-N&q=TI%3d%22Symploca%22&patents=false&scholar&sort=old,https://patents.google.com/scholar/1051891205118999516,https://pubs.acs.org/doi/abs/10.1021/np010049y,Isolation of dolastatin 10 from the marine cyanobacterium Symploca species VP642 and total stereochemistry and biological evaluation of its analogue symplostatin 1,Journal of Natural Products,2001,"Luesch et al., 2001"
151,FJAQNRBDVKIIKK-LFLQOBSNSA-N,Streptomyces,"Aminocoumarins mutasynthesis, chemoenzymatic synthesis, and metabolic engineering.",https://patents.google.com/?q=FJAQNRBDVKIIKK-LFLQOBSNSA-N&q=TI%3d%22Streptomyces%22&patents=false&scholar&sort=old,NaN,NaN,NaN,NaN,NaN,NaN
152,OMRZIYHFGILQAL-UHFFFAOYSA-N,Adelanthus lindenbergianus,,https://patents.google.com/?q=OMRZIYHFGILQAL-UHFFFAOYSA-N&q=TI%3d%22Adelanthus+lindenbergianus%22&patents=false&scholar&sort=old,NaN,NaN,NaN,NaN,NaN,NaN
153,IIQSJHUEZBTSAT-URLMMPGGSA-N,Argyreia nervosa,,https://patents.google.com/?q=IIQSJHUEZBTSAT-URLMMPGGSA-N&q=TI%3d%22Argyreia+nervosa%22&patents=false&scholar&sort=old,NaN,NaN,NaN,NaN,NaN,NaN
154,XRWQBDJPMXRDOQ-YUUDFPFBSA-N,Periploca sepium,,https://patents.google.com/?q=XRWQBDJPMXRDOQ-YUUDFPFBSA-N&q=TI%3d%22Periploca+sepium%22&patents=false&scholar&sort=old,NaN,NaN,NaN,NaN,NaN,NaN
155,LTQYPAVLAYVKTK-YFKPBYRVSA-N,Petunia axillaris,,https://patents.google.com/?q=LTQYPAVLAYVKTK-YFKPBYRVSA-N&q=TI%3d%22Petunia+axillaris%22&patents=false&scholar&sort=old,NaN,NaN,NaN,NaN,NaN,NaN
156,HRQVZXBGBCUWQA-UHFFFAOYSA-N,Streptomyces,Bi- and Tetracyclic Spirotetronates from the Coal Mine Fire Isolate Streptomyces sp. LC-6-2,https://patents.google.com/?q=HRQVZXBGBCUWQA-UHFFFAOYSA-N&q=TI%3d%22Streptomyces%22&patents=false&scholar&sort=old,NaN,NaN,NaN,NaN,NaN,NaN
157,LMPCSMHAJDXHSV-IBEHDNSVSA-N,Jungermannia obovata,,https://patents.google.com/?q=LMPCSMHAJDXHSV-IBEHDNSVSA-N&q=TI%3d%22Jungermannia+obovata%22&patents=false&scholar&sort=old,NaN,NaN,NaN,NaN,NaN,NaN
158,JDVMHRYIBAJAJK-AJBKOCBKSA-N,Acanthus ilicifolius,,https://patents.google.com/?q=JDVMHRYIBAJAJK-AJBKOCBKSA-N&q=TI%3d%22Acanthus+ilicifolius%22&patents=false&scholar&sort=old,NaN,NaN,NaN,NaN,NaN,NaN
159,GENAHGKEFJLNJB-UHFFFAOYSA-N,Argyreia,,https://patents.google.com/?q=GENAHGKEFJLNJB-UHFFFAOYSA-N&q=TI%3d%22Argyreia%22&patents=false&scholar&sort=old,https://patents.google.com/scholar/16483087380044514743,https://chemistry.mdma.ch/hiveboard/rhodium/pdf/forensic/lsa.hbwr.jaoac.pdf,"Isolation and identification of lysergic acid amide and isolysergic acid amide as the principal ergoline alkaloids in Argyreia nervosa, a tropical wood rose",J AOAC,1970,"Miller, 1970"
160,XSNPKRVRWPBMKE-JPIRQXTESA-N,Vitis vinifera,,https://patents.google.com/?q=XSNPKRVRWPBMKE-JPIRQXTESA-N&q=TI%3d%22Vitis+vinifera%22&patents=false&scholar&sort=old,NaN,NaN,NaN,NaN,NaN,NaN
161,GYHFUZHODSMOHU-UHFFFAOYSA-N,Fructus,,https://patents.google.com/?q=GYHFUZHODSMOHU-UHFFFAOYSA-N&q=TI%3d%22Fructus%22&patents=false&scholar&sort=old,NaN,NaN,NaN,NaN,NaN,NaN
162,DMFPEGLBGOENBN-UHFFFAOYSA-N,Croton cumingii,,https://patents.google.com/?q=DMFPEGLBGOENBN-UHFFFAOYSA-N&q=TI%3d%22Croton+cumingii%22&patents=false&scholar&sort=old,NaN,NaN,NaN,NaN,NaN,NaN
163,RLEKJHOJOZAHJF-VHWYSAPLSA-N,Streptomyces,Unique post-translational oxime formation in the biosynthesis of the azolemycin complex of novel ribosomal peptides from Streptomyces sp. FXJ1.264,https://patents.google.com/?q=RLEKJHOJOZAHJF-VHWYSAPLSA-N&q=TI%3d%22Streptomyces%22&patents=false&scholar&sort=old,NaN,NaN,NaN,NaN,NaN,NaN
164,LTSBAPIBOQOBOR-WAYWQWQTSA-N,Peucedanum praeruptorum,Chemical components of the roots of Noni (Morinda citrifolia) and their cytotoxic effects.,https://patents.google.com/?q=LTSBAPIBOQOBOR-WAYWQWQTSA-N&q=TI%3d%22Peucedanum+praeruptorum%22&patents=false&scholar&sort=old,NaN,NaN,NaN,NaN,NaN,NaN
165,LHYHMMRYTDARSZ-AJNGGQMLSA-N,Zygosaccharomyces rouxii,,https://patents.google.com/?q=LHYHMMRYTDARSZ-AJNGGQMLSA-N&q=TI%3d%22Zygosaccharomyces+rouxii%22&patents=false&scholar&sort=old,NaN,NaN,NaN,NaN,NaN,NaN
166,AGUBCDYYAKENKG-YVNJGZBMSA-N,Phoma linga,,https://patents.google.com/?q=AGUBCDYYAKENKG-YVNJGZBMSA-N&q=TI%3d%22Phoma+linga%22&patents=false&scholar&sort=old,NaN,NaN,NaN,NaN,NaN,NaN
167,WRMNZCZEMHIOCP-UHFFFAOYSA-N,Fructus,,https://patents.google.com/?q=WRMNZCZEMHIOCP-UHFFFAOYSA-N&q=TI%3d%22Fructus%22&patents=false&scholar&sort=old,https://patents.google.com/scholar/5739510300364966431,https://www.jstage.jst.go.jp/article/cpb1958/30/12/30_12_4548/_pdf,"Studies on the Chinese crude drug"" Forsythiae Fructus."" VI. The structure and antibacterial activity of suspensaside isolated from Forsythia suspensa",Chemical and Pharmaceutical Bulletin,1982,"NISHIBE et al., 1982"
168,OXFPYCSNYOFUCH-UHFFFAOYSA-N,Prunus cerasus,,https://patents.google.com/?q=OXFPYCSNYOFUCH-UHFFFAOYSA-N&q=TI%3d%22Prunus+cerasus%22&patents=false&scholar&sort=old,NaN,NaN,NaN,NaN,NaN,NaN
169,SXFSQZDSUWACKX-UHFFFAOYSA-N,Asparagus officinalis,,https://patents.google.com/?q=SXFSQZDSUWACKX-UHFFFAOYSA-N&q=TI%3d%22Asparagus+officinalis%22&patents=false&scholar&sort=old,NaN,NaN,NaN,NaN,NaN,NaN
170,FSYKKLYZXJSNPZ-UHFFFAOYSA-N,Micromonas pusilla,,https://patents.google.com/?q=FSYKKLYZXJSNPZ-UHFFFAOYSA-N&q=TI%3d%22Micromonas+pusilla%22&patents=false&scholar&sort=old,NaN,NaN,NaN,NaN,NaN,NaN
171,MNWFXJYAOYHMED-UHFFFAOYSA-N,Vitis vinifera,Distinct metabolic responses of an ovarian cancer stem cell line.,https://patents.google.com/?q=MNWFXJYAOYHMED-UHFFFAOYSA-N&q=TI%3d%22Vitis+vinifera%22&patents=false&scholar&sort=old,https://patents.google.com/scholar/6345042674781000960,https://pubs.acs.org/doi/pdf/10.1021/jf00038a020,"Effect of storage under carbon dioxide atmosphere on the volatile, amino acid, and pigment constituents in red grape (Vitis vinifera L. var. Agiorgitiko)",Journal of Agricultural and Food Chemistry,1994,"Dourtoglou et al., 1994"
172,WUYQEGNOQLRQAQ-AWEZNQCLSA-N,Tephroseris kirilowii,,https://patents.google.com/?q=WUYQEGNOQLRQAQ-AWEZNQCLSA-N&q=TI%3d%22Tephroseris+kirilowii%22&patents=false&scholar&sort=old,NaN,NaN,NaN,NaN,NaN,NaN
173,XYFCBTPGUUZFHI-UHFFFAOYSA-N,Tragopogon porrifolius,,https://patents.google.com/?q=XYFCBTPGUUZFHI-UHFFFAOYSA-N&q=TI%3d%22Tragopogon+porrifolius%22&patents=false&scholar&sort=old,https://patents.google.com/scholar/1920325690868074321,https://content.sciendo.com/downloadpdf/journals/fhort/20/2/article-p75.xml,Pathogenicity of fungi colonising the soil after the cultivation of cover crops towards the seedlings of salsify Tragopogon porrifolius var. sativus (Gaterau) Br.,Folia Horticulturae,2008,"Patkowska et al., 2008"
174,LIHFAKVUZYFNPM-DKIHBDHHSA-O,Meconopsis grandis,,https://patents.google.com/?q=LIHFAKVUZYFNPM-DKIHBDHHSA-O&q=TI%3d%22Meconopsis+grandis%22&patents=false&scholar&sort=old,NaN,NaN,NaN,NaN,NaN,NaN
175,MXCOJKLBLFWFNI-VBFYFJBNSA-N,Prunus subhirtella,,https://patents.google.com/?q=MXCOJKLBLFWFNI-VBFYFJBNSA-N&q=TI%3d%22Prunus+subhirtella%22&patents=false&scholar&sort=old,NaN,NaN,NaN,NaN,NaN,NaN
176,HMYKTCAHZPOVHL-BYNSBNAKSA-N,Eucryphia cordifolia,,https://patents.google.com/?q=HMYKTCAHZPOVHL-BYNSBNAKSA-N&q=TI%3d%22Eucryphia+cordifolia%22&patents=false&scholar&sort=old,NaN,NaN,NaN,NaN,NaN,NaN
177,IYCPMVXIUPYNHI-NVOSNEJBSA-N,Galium dasypodum,,https://patents.google.com/?q=IYCPMVXIUPYNHI-NVOSNEJBSA-N&q=TI%3d%22Galium+dasypodum%22&patents=false&scholar&sort=old,NaN,NaN,NaN,NaN,NaN,NaN
178,CRPUJAZIXJMDBK-DTWKUNHWSA-N,Agrimonia eupatoria,,https://patents.google.com/?q=CRPUJAZIXJMDBK-DTWKUNHWSA-N&q=TI%3d%22Agrimonia+eupatoria%22&patents=false&scholar&sort=old,https://patents.google.com/scholar/18302240269767947004,https://pdfs.semanticscholar.org/74a2/853bf94e2b43d027c86497245cb80163caf5.pdf,The pharmacological and therapeutic importance of Agrimonia eupatoria-A review,Asian Journal of Pharmaceutical Science and Technology,2015,"Al-Snafi, 2015"
179,ZUHSRZLUGOUPFT-YQAZJISCSA-N,Piper,"Chabamide, a Novel Piperine Dimer from Stems ofPiper chaba",https://patents.google.com/?q=ZUHSRZLUGOUPFT-YQAZJISCSA-N&q=TI%3d%22Piper%22&patents=false&scholar&sort=old,NaN,NaN,NaN,NaN,NaN,NaN
180,GYFFKZTYYAFCTR-AVXJPILUSA-N,Juglans regia,,https://patents.google.com/?q=GYFFKZTYYAFCTR-AVXJPILUSA-N&q=TI%3d%22Juglans+regia%22&patents=false&scholar&sort=old,NaN,NaN,NaN,NaN,NaN,NaN
181,SGSNFWBUTGZVOW-UHFFFAOYSA-N,Streptomyces,"Genoketides A1 and A2, New Octaketides and Biosynthetic Intermediates of Chrysophanol Produced by Streptomyces sp. AK 671",https://patents.google.com/?q=SGSNFWBUTGZVOW-UHFFFAOYSA-N&q=TI%3d%22Streptomyces%22&patents=false&scholar&sort=old,NaN,NaN,NaN,NaN,NaN,NaN
182,QOTBQNVNUBKJMS-UHFFFAOYSA-N,Piper,,https://patents.google.com/?q=QOTBQNVNUBKJMS-UHFFFAOYSA-N&q=TI%3d%22Piper%22&patents=false&scholar&sort=old,https://patents.google.com/scholar/16832671803242225012,http://www.scielo.br/scielo.php?pid=S0103-50532004000100022&script=sci_arttext,Three new natural cyclopentenedione derivatives from Piper carniconnectivum,Journal of the Brazilian Chemical Society,2004,"Facundo et al., 2004"
183,LPFBOGGFSMIWEO-NHKIKYQASA-N,Solenopsis punctaticeps,,https://patents.google.com/?q=LPFBOGGFSMIWEO-NHKIKYQASA-N&q=TI%3d%22Solenopsis+punctaticeps%22&patents=false&scholar&sort=old,NaN,NaN,NaN,NaN,NaN,NaN
184,JBGYSAVRIDZNKA-NKECSCAMSA-N,Panax ginseng,,https://patents.google.com/?q=JBGYSAVRIDZNKA-NKECSCAMSA-N&q=TI%3d%22Panax+ginseng%22&patents=false&scholar&sort=old,NaN,NaN,NaN,NaN,NaN,NaN
185,DVKQFBNYDILOTK-FSFQXNNFSA-N,Delphinium virgatum,,https://patents.google.com/?q=DVKQFBNYDILOTK-FSFQXNNFSA-N&q=TI%3d%22Delphinium+virgatum%22&patents=false&scholar&sort=old,NaN,NaN,NaN,NaN,NaN,NaN
186,XKQZIXVJVUPORE-RPDRRWSUSA-N,Vitis vinifera,,https://patents.google.com/?q=XKQZIXVJVUPORE-RPDRRWSUSA-N&q=TI%3d%22Vitis+vinifera%22&patents=false&scholar&sort=old,NaN,NaN,NaN,NaN,NaN,NaN
187,LBKYKMRIFPZXPI-XNBKRRRXSA-N,Hypericum reptans,,https://patents.google.com/?q=LBKYKMRIFPZXPI-XNBKRRRXSA-N&q=TI%3d%22Hypericum+reptans%22&patents=false&scholar&sort=old,NaN,NaN,NaN,NaN,NaN,NaN
188,XYFCBTPGUUZFHI-UHFFFAOYSA-N,Lactuca sativa,,https://patents.google.com/?q=XYFCBTPGUUZFHI-UHFFFAOYSA-N&q=TI%3d%22Lactuca+sativa%22&patents=false&scholar&sort=old,https://patents.google.com/scholar/11620310734410119930,NaN,NaN,NaN,NaN,NaN
189,UNDXCFHARZFVCR-UHFFFAOYSA-N,Chaetomium,Armochaetoglasins A–I: Cytochalasan alkaloids from fermentation broth of Chaetomium globosum TW1-1 by feeding L-tyrosine,https://patents.google.com/?q=UNDXCFHARZFVCR-UHFFFAOYSA-N&q=TI%3d%22Chaetomium%22&patents=false&scholar&sort=old,NaN,NaN,NaN,NaN,NaN,NaN
190,SRWJAXVAWDYXPA-ACNGEOCHSA-N,Quercus sessiliflora,,https://patents.google.com/?q=SRWJAXVAWDYXPA-ACNGEOCHSA-N&q=TI%3d%22Quercus+sessiliflora%22&patents=false&scholar&sort=old,NaN,NaN,NaN,NaN,NaN,NaN
191,SEOVTRFCIGRIMH-UHFFFAOYSA-N,Pisum sativum,,https://patents.google.com/?q=SEOVTRFCIGRIMH-UHFFFAOYSA-N&q=TI%3d%22Pisum+sativum%22&patents=false&scholar&sort=old,https://patents.google.com/scholar/9531381122007192716,NaN,NaN,NaN,NaN,NaN
192,VLGRWXYRKYWRPX-VSRLVKTQSA-N,Spilanthes,Two New Alkamides fromSpilanthes callimorpha,https://patents.google.com/?q=VLGRWXYRKYWRPX-VSRLVKTQSA-N&q=TI%3d%22Spilanthes%22&patents=false&scholar&sort=old,https://patents.google.com/scholar/10714370092057602231,NaN,NaN,NaN,NaN,NaN
193,FMCGSUUBYTWNDP-BFHBGLAWSA-N,Aizoon,,https://patents.google.com/?q=FMCGSUUBYTWNDP-BFHBGLAWSA-N&q=TI%3d%22Aizoon%22&patents=false&scholar&sort=old,NaN,NaN,NaN,NaN,NaN,NaN
194,PDDHCVXPABQISO-XJJFHSEKSA-N,Micromonas pusilla,,https://patents.google.com/?q=PDDHCVXPABQISO-XJJFHSEKSA-N&q=TI%3d%22Micromonas+pusilla%22&patents=false&scholar&sort=old,NaN,NaN,NaN,NaN,NaN,NaN
195,GUVLNFNFGNJCPX-UHFFFAOYSA-N,Porifera,,https://patents.google.com/?q=GUVLNFNFGNJCPX-UHFFFAOYSA-N&q=TI%3d%22Porifera%22&patents=false&scholar&sort=old,NaN,NaN,NaN,NaN,NaN,NaN
196,PIBJADPEZQHMQS-CMKMFDCUSA-N,Magnolia sieboldii,,https://patents.google.com/?q=PIBJADPEZQHMQS-CMKMFDCUSA-N&q=TI%3d%22Magnolia+sieboldii%22&patents=false&scholar&sort=old,NaN,NaN,NaN,NaN,NaN,NaN
197,OAPCZFOTYXBKOD-KQBQCQLESA-N,Stevia polycephala,,https://patents.google.com/?q=OAPCZFOTYXBKOD-KQBQCQLESA-N&q=TI%3d%22Stevia+polycephala%22&patents=false&scholar&sort=old,NaN,NaN,NaN,NaN,NaN,NaN
198,YWPLTMNXKKXXII-HJTGRKLOSA-N,Stevia polycephala,,https://patents.google.com/?q=YWPLTMNXKKXXII-HJTGRKLOSA-N&q=TI%3d%22Stevia+polycephala%22&patents=false&scholar&sort=old,NaN,NaN,NaN,NaN,NaN,NaN
199,VPKWZVYOUBFOHG-AEPQJSCQSA-N,Micromonas pusilla,,https://patents.google.com/?q=VPKWZVYOUBFOHG-AEPQJSCQSA-N&q=TI%3d%22Micromonas+pusilla%22&patents=false&scholar&sort=old,NaN,NaN,NaN,NaN,NaN,NaN
200,PTKNECMMKRDZEG-KHMFPJBWSA-N,Sideritis cossoniana,External and vacuolar flavonoids from ibero-North African Sideritis species. A chemosystematic approach,https://patents.google.com/?q=PTKNECMMKRDZEG-KHMFPJBWSA-N&q=TI%3d%22Sideritis+cossoniana%22&patents=false&scholar&sort=old,NaN,NaN,NaN,NaN,NaN,NaN
201,HNDVDQJCIGZPNO-YFKPBYRVSA-N,Cucurbita pepo,,https://patents.google.com/?q=HNDVDQJCIGZPNO-YFKPBYRVSA-N&q=TI%3d%22Cucurbita+pepo%22&patents=false&scholar&sort=old,https://patents.google.com/scholar/14205007901653223007,https://febs.onlinelibrary.wiley.com/doi/pdf/10.1111/j.1432-1033.1979.tb04217.x,Ascorbate oxidase from Cucurbita pepo medullosa: New method of purification and reinvestigation of properties,European journal of biochemistry,1979,"MARCHESINI et al., 1979"
202,JVQYSWDUAOAHFM-BYPYZUCNSA-N,Oryza brachyantha,,https://patents.google.com/?q=JVQYSWDUAOAHFM-BYPYZUCNSA-N&q=TI%3d%22Oryza+brachyantha%22&patents=false&scholar&sort=old,NaN,NaN,NaN,NaN,NaN,NaN
203,PIXFHVWJOVNKQK-UHFFFAOYSA-N,Homo sapiens,,https://patents.google.com/?q=PIXFHVWJOVNKQK-UHFFFAOYSA-N&q=TI%3d%22Homo+sapiens%22&patents=false&scholar&sort=old,NaN,NaN,NaN,NaN,NaN,NaN
204,QQXLDOJGLXJCSE-KNVOCYPGSA-N,Trifolium pratense,,https://patents.google.com/?q=QQXLDOJGLXJCSE-KNVOCYPGSA-N&q=TI%3d%22Trifolium+pratense%22&patents=false&scholar&sort=old,NaN,NaN,NaN,NaN,NaN,NaN
205,HJKVPZJVBHWFCQ-UHFFFAOYSA-N,Setaria italica,,https://patents.google.com/?q=HJKVPZJVBHWFCQ-UHFFFAOYSA-N&q=TI%3d%22Setaria+italica%22&patents=false&scholar&sort=old,NaN,NaN,NaN,NaN,NaN,NaN
206,YGFBEYXVYDNDKK-ZQHYZAEZSA-N,Datisca glomerata,,https://patents.google.com/?q=YGFBEYXVYDNDKK-ZQHYZAEZSA-N&q=TI%3d%22Datisca+glomerata%22&patents=false&scholar&sort=old,NaN,NaN,NaN,NaN,NaN,NaN
207,YOKBTBNVNCFOBF-UHFFFAOYSA-N,Plantae,Total Synthesis of Bassiatin and Its Stereoisomers:  Novel Divergent Behavior of Substrates in Mitsunobu Cyclizations,https://patents.google.com/?q=YOKBTBNVNCFOBF-UHFFFAOYSA-N&q=TI%3d%22Plantae%22&patents=false&scholar&sort=old,NaN,NaN,NaN,NaN,NaN,NaN
208,FMMOOAYVCKXGMF-MURFETPASA-N,Gentiana dahurica,,https://patents.google.com/?q=FMMOOAYVCKXGMF-MURFETPASA-N&q=TI%3d%22Gentiana+dahurica%22&patents=false&scholar&sort=old,NaN,NaN,NaN,NaN,NaN,NaN
209,SFXSFWVZPKEDPA-KJOZQHLTSA-N,Setaria italica,,https://patents.google.com/?q=SFXSFWVZPKEDPA-KJOZQHLTSA-N&q=TI%3d%22Setaria+italica%22&patents=false&scholar&sort=old,NaN,NaN,NaN,NaN,NaN,NaN
210,GZSUNDIGWVWSKD-SQFVCTCFSA-N,Jasminum urophyllum,,https://patents.google.com/?q=GZSUNDIGWVWSKD-SQFVCTCFSA-N&q=TI%3d%22Jasminum+urophyllum%22&patents=false&scholar&sort=old,NaN,NaN,NaN,NaN,NaN,NaN
211,KWXMBUMKDBAWGQ-UHFFFAOYSA-N,Millettia speciosa,,https://patents.google.com/?q=KWXMBUMKDBAWGQ-UHFFFAOYSA-N&q=TI%3d%22Millettia+speciosa%22&patents=false&scholar&sort=old,NaN,NaN,NaN,NaN,NaN,NaN
212,QNAYBMKLOCPYGJ-REOHCLBHSA-N,Juglans regia,Sequelae,https://patents.google.com/?q=QNAYBMKLOCPYGJ-REOHCLBHSA-N&q=TI%3d%22Juglans+regia%22&patents=false&scholar&sort=old,https://patents.google.com/scholar/17525734097228984500,https://pubs.acs.org/doi/pdf/10.1021/jf60136a012,"Nutrients in Nut Kernels, Free Amino Acids in English Walnut (Juglans regia) Kernels",Journal of Agricultural and Food Chemistry,1964,"Rockland et al., 1964"
213,IOIGOIPHPUCFOB-UHFFFAOYSA-N,Strychnos dinklagei,,https://patents.google.com/?q=IOIGOIPHPUCFOB-UHFFFAOYSA-N&q=TI%3d%22Strychnos+dinklagei%22&patents=false&scholar&sort=old,NaN,NaN,NaN,NaN,NaN,NaN
214,LKMNXYDUQXAUCZ-UHFFFAOYSA-N,Stenostomum lucidum,,https://patents.google.com/?q=LKMNXYDUQXAUCZ-UHFFFAOYSA-N&q=TI%3d%22Stenostomum+lucidum%22&patents=false&scholar&sort=old,NaN,NaN,NaN,NaN,NaN,NaN
215,GUGDAUYYWAEZBO-QMMMGPOBSA-N,Phomopsis,"Pyrenocines J-M: four new pyrenocines from the endophytic fungus, Phomopsis sp.",https://patents.google.com/?q=GUGDAUYYWAEZBO-QMMMGPOBSA-N&q=TI%3d%22Phomopsis%22&patents=false&scholar&sort=old,NaN,NaN,NaN,NaN,NaN,NaN
216,GQRUHVMVWNKUFW-LWYYNNOASA-N,Vitis vinifera,,https://patents.google.com/?q=GQRUHVMVWNKUFW-LWYYNNOASA-N&q=TI%3d%22Vitis+vinifera%22&patents=false&scholar&sort=old,NaN,NaN,NaN,NaN,NaN,NaN
217,HIBLNBRXFIYJIP-UHFFFAOYSA-N,Solanum tomatillo,,https://patents.google.com/?q=HIBLNBRXFIYJIP-UHFFFAOYSA-N&q=TI%3d%22Solanum+tomatillo%22&patents=false&scholar&sort=old,NaN,NaN,NaN,NaN,NaN,NaN
218,MVRALRDWANJVMR-HWNSJAFFSA-J,Phaseolus vulgaris,,https://patents.google.com/?q=MVRALRDWANJVMR-HWNSJAFFSA-J&q=TI%3d%22Phaseolus+vulgaris%22&patents=false&scholar&sort=old,NaN,NaN,NaN,NaN,NaN,NaN
219,MZQDVARUQLLSGL-UHFFFAOYSA-N,Pestalotiopsis,"Photinides A−F, Cytotoxic Benzofuranone-Derived γ-Lactones from the Plant Endophytic FungusPestalotiopsis photiniae",https://patents.google.com/?q=MZQDVARUQLLSGL-UHFFFAOYSA-N&q=TI%3d%22Pestalotiopsis%22&patents=false&scholar&sort=old,https://patents.google.com/scholar/15300646147191768867,http://www.im.ac.cn/UserFiles/File/2009/200907/12-JNP.pdf,"Photinides A− F, Cytotoxic Benzofuranone-Derived γ-Lactones from the Plant Endophytic Fungus Pestalotiopsis photiniae",Journal of natural products,2009,"Ding et al., 2009"
220,KNJNBKINYHZUGC-UHFFFAOYSA-N,Trifolium pratense,,https://patents.google.com/?q=KNJNBKINYHZUGC-UHFFFAOYSA-N&q=TI%3d%22Trifolium+pratense%22&patents=false&scholar&sort=old,https://patents.google.com/scholar/10484397640293912578,NaN,NaN,NaN,NaN,NaN
221,PFJBHVURUOQVHW-VPRICQMDSA-N,Oryza brachyantha,,https://patents.google.com/?q=PFJBHVURUOQVHW-VPRICQMDSA-N&q=TI%3d%22Oryza+brachyantha%22&patents=false&scholar&sort=old,NaN,NaN,NaN,NaN,NaN,NaN
222,NFYYATWFXNPTRM-QJICHLCESA-N,Gelsemium sempervirens,,https://patents.google.com/?q=NFYYATWFXNPTRM-QJICHLCESA-N&q=TI%3d%22Gelsemium+sempervirens%22&patents=false&scholar&sort=old,https://patents.google.com/scholar/14024477941420827066,NaN,NaN,NaN,NaN,NaN
223,LFFQVHXIFJLJSP-IZLXSDGUSA-N,Xylopia columbiana,,https://patents.google.com/?q=LFFQVHXIFJLJSP-IZLXSDGUSA-N&q=TI%3d%22Xylopia+columbiana%22&patents=false&scholar&sort=old,NaN,NaN,NaN,NaN,NaN,NaN
224,YKFLAYDHMOASIY-UHFFFAOYSA-N,Rhizoma,,https://patents.google.com/?q=YKFLAYDHMOASIY-UHFFFAOYSA-N&q=TI%3d%22Rhizoma%22&patents=false&scholar&sort=old,https://patents.google.com/scholar/730826958507131560,https://www.nature.com/articles/aps200665.pdf?origin=ppub,Analysis of volatile oil in rhizoma ligustici chuanxiong-radix paeoniae rubra by gas chromatography-mass spectrometry and chemometric resolution,Acta Pharmacologica Sinica,2006,"Li et al., 2006"
225,SZQCDAMPRNWLHM-UHFFFAOYSA-N,Graphis proserpens,Phenolic compounds from the cultured mycobionts of Graphis proserpens,https://patents.google.com/?q=SZQCDAMPRNWLHM-UHFFFAOYSA-N&q=TI%3d%22Graphis+proserpens%22&patents=false&scholar&sort=old,NaN,NaN,NaN,NaN,NaN,NaN
226,WPKMGEQXTYQXGI-UHFFFAOYSA-N,Sideritis dasygnaphala,,https://patents.google.com/?q=WPKMGEQXTYQXGI-UHFFFAOYSA-N&q=TI%3d%22Sideritis+dasygnaphala%22&patents=false&scholar&sort=old,NaN,NaN,NaN,NaN,NaN,NaN
227,OXZVCLBRMKYHOG-HICIGQBLSA-N,Tripodanthus acutifolius,,https://patents.google.com/?q=OXZVCLBRMKYHOG-HICIGQBLSA-N&q=TI%3d%22Tripodanthus+acutifolius%22&patents=false&scholar&sort=old,NaN,NaN,NaN,NaN,NaN,NaN
228,MRIFZKMKTDPBHR-XLOWEYQUSA-N,Pedicularis rostratocapitata,,https://patents.google.com/?q=MRIFZKMKTDPBHR-XLOWEYQUSA-N&q=TI%3d%22Pedicularis+rostratocapitata%22&patents=false&scholar&sort=old,https://patents.google.com/scholar/14708540077219108043,https://www.tandfonline.com/doi/abs/10.1080/14786419.2015.1136307,Secoiridoids and other chemotaxonomically relevant compounds in Pedicularis: phytochemical analysis and comparison of Pedicularis rostratocapitata Crantz and …,Natural product research,2016,"Venditti et al., 2016"
229,CHCBSUXEBKZFGJ-RLCKCSFISA-N,Barnettia kerrii,,https://patents.google.com/?q=CHCBSUXEBKZFGJ-RLCKCSFISA-N&q=TI%3d%22Barnettia+kerrii%22&patents=false&scholar&sort=old,https://patents.google.com/scholar/13660949779472685292,http://citeseerx.ist.psu.edu/viewdoc/download?doi=10.1.1.572.9143&rep=rep1&type=pdf,Phenolic glycosides from Barnettia kerrii,Phytochemistry,2002,"Kanchanapoom et al., 2002"
230,OGFXBIXJCWAUCH-WAWZGNHOSA-N,Jungermannia obovata,,https://patents.google.com/?q=OGFXBIXJCWAUCH-WAWZGNHOSA-N&q=TI%3d%22Jungermannia+obovata%22&patents=false&scholar&sort=old,NaN,NaN,NaN,NaN,NaN,NaN
231,JAOKJWAOOMRVIW-FDEWBFOVSA-N,Angelica keiskei,,https://patents.google.com/?q=JAOKJWAOOMRVIW-FDEWBFOVSA-N&q=TI%3d%22Angelica+keiskei%22&patents=false&scholar&sort=old,NaN,NaN,NaN,NaN,NaN,NaN
232,JSNCLYJIPUAGQE-UHFFFAOYSA-N,Trichocereus pachanoi,,https://patents.google.com/?q=JSNCLYJIPUAGQE-UHFFFAOYSA-N&q=TI%3d%22Trichocereus+pachanoi%22&patents=false&scholar&sort=old,NaN,NaN,NaN,NaN,NaN,NaN
233,UOKVQQMBGVMXPU-CJPDYEHRSA-N,Petunia axillaris,,https://patents.google.com/?q=UOKVQQMBGVMXPU-CJPDYEHRSA-N&q=TI%3d%22Petunia+axillaris%22&patents=false&scholar&sort=old,NaN,NaN,NaN,NaN,NaN,NaN
234,LLPKQRMDOFYSGZ-UHFFFAOYSA-N,Asimina parviflora,,https://patents.google.com/?q=LLPKQRMDOFYSGZ-UHFFFAOYSA-N&q=TI%3d%22Asimina+parviflora%22&patents=false&scholar&sort=old,NaN,NaN,NaN,NaN,NaN,NaN
235,NFHVTCJKAHYEQN-UHFFFAOYSA-N,Streptomyces albus,,https://patents.google.com/?q=NFHVTCJKAHYEQN-UHFFFAOYSA-N&q=TI%3d%22Streptomyces+albus%22&patents=false&scholar&sort=old,NaN,NaN,NaN,NaN,NaN,NaN
236,PXNMNABLQWUMCX-UHFFFAOYSA-N,Schrebera swietenoides,,https://patents.google.com/?q=PXNMNABLQWUMCX-UHFFFAOYSA-N&q=TI%3d%22Schrebera+swietenoides%22&patents=false&scholar&sort=old,NaN,NaN,NaN,NaN,NaN,NaN
237,PHKFQMUSOLODBO-NPGRQBJYSA-N,Arnica mollis,,https://patents.google.com/?q=PHKFQMUSOLODBO-NPGRQBJYSA-N&q=TI%3d%22Arnica+mollis%22&patents=false&scholar&sort=old,NaN,NaN,NaN,NaN,NaN,NaN
238,OKHXOUGRECCASI-SHUUEZRQSA-N,Vitis vinifera,,https://patents.google.com/?q=OKHXOUGRECCASI-SHUUEZRQSA-N&q=TI%3d%22Vitis+vinifera%22&patents=false&scholar&sort=old,https://patents.google.com/scholar/15231331253535221245,https://www.sciencedirect.com/science/article/pii/S1874391913003874,Proteomic analysis of grapevine (Vitis vinifera L.) leaf changes induced by transition to autotrophy and exposure to high light irradiance,Journal of proteomics,2013,"Nilo-Poyanco et al., 2013"
239,DWLHCWUIQVURCE-KCACFXOTSA-N,Tristania conferta,,https://patents.google.com/?q=DWLHCWUIQVURCE-KCACFXOTSA-N&q=TI%3d%22Tristania+conferta%22&patents=false&scholar&sort=old,NaN,NaN,NaN,NaN,NaN,NaN
240,RODBXVVNKJCWQR-GSQAGGHASA-N,Oryza longistaminata,,https://patents.google.com/?q=RODBXVVNKJCWQR-GSQAGGHASA-N&q=TI%3d%22Oryza+longistaminata%22&patents=false&scholar&sort=old,NaN,NaN,NaN,NaN,NaN,NaN
241,BQYFJMJMECTZIE-UHFFFAOYSA-N,Boronia lanceolata,,https://patents.google.com/?q=BQYFJMJMECTZIE-UHFFFAOYSA-N&q=TI%3d%22Boronia+lanceolata%22&patents=false&scholar&sort=old,NaN,NaN,NaN,NaN,NaN,NaN
242,RODBXVVNKJCWQR-GSQAGGHASA-N,Cicer arietinum,,https://patents.google.com/?q=RODBXVVNKJCWQR-GSQAGGHASA-N&q=TI%3d%22Cicer+arietinum%22&patents=false&scholar&sort=old,NaN,NaN,NaN,NaN,NaN,NaN
243,FJEKCPBQVANMTA-SAEPALGJSA-N,Micromonospora schwarzwaldensis,,https://patents.google.com/?q=FJEKCPBQVANMTA-SAEPALGJSA-N&q=TI%3d%22Micromonospora+schwarzwaldensis%22&patents=false&scholar&sort=old,NaN,NaN,NaN,NaN,NaN,NaN
244,PIGLOISSVVAGBD-NHQGMKOOSA-N,Erythrina burtii,Two prenylated flavanones from stem bark of Erythrina burttii,https://patents.google.com/?q=PIGLOISSVVAGBD-NHQGMKOOSA-N&q=TI%3d%22Erythrina+burtii%22&patents=false&scholar&sort=old,NaN,NaN,NaN,NaN,NaN,NaN
245,XNPSXACEPKSJAF-SHPGVJHPSA-N,Ratibida mexicana,,https://patents.google.com/?q=XNPSXACEPKSJAF-SHPGVJHPSA-N&q=TI%3d%22Ratibida+mexicana%22&patents=false&scholar&sort=old,NaN,NaN,NaN,NaN,NaN,NaN
246,QNKGXSIDHDDDHD-UHFFFAOYSA-N,Fusarium graminearum,,https://patents.google.com/?q=QNKGXSIDHDDDHD-UHFFFAOYSA-N&q=TI%3d%22Fusarium+graminearum%22&patents=false&scholar&sort=old,NaN,NaN,NaN,NaN,NaN,NaN
247,SQYIWHJCOMWKNU-CBQIKETKSA-N,Narcissus concolor,,https://patents.google.com/?q=SQYIWHJCOMWKNU-CBQIKETKSA-N&q=TI%3d%22Narcissus+concolor%22&patents=false&scholar&sort=old,NaN,NaN,NaN,NaN,NaN,NaN
248,ZMYQRHSOVRDQDL-CPPDSBOHSA-N,Lepidophorum repandum,,https://patents.google.com/?q=ZMYQRHSOVRDQDL-CPPDSBOHSA-N&q=TI%3d%22Lepidophorum+repandum%22&patents=false&scholar&sort=old,NaN,NaN,NaN,NaN,NaN,NaN
249,BXXSHQYDJWZXPB-OKNSCYNVSA-N,Vitis vinifera,,https://patents.google.com/?q=BXXSHQYDJWZXPB-OKNSCYNVSA-N&q=TI%3d%22Vitis+vinifera%22&patents=false&scholar&sort=old,https://patents.google.com/scholar/9073490375007148984,https://onlinelibrary.wiley.com/doi/abs/10.1002/jsfa.2375,Study of the effect of ripening stages and climatic conditions on the physicochemical and sensorial parameters of two varieties of Vitis vinifera L. by principal …,Journal of the Science of Food and Agriculture,2006,"Serrano‐Megías et al., 2006"
250,MRVYFOANPDTYBY-YORTWTKJSA-N,Phaseolus vulgaris,,https://patents.google.com/?q=MRVYFOANPDTYBY-YORTWTKJSA-N&q=TI%3d%22Phaseolus+vulgaris%22&patents=false&scholar&sort=old,NaN,NaN,NaN,NaN,NaN,NaN
251,HTCXXOQBBXKJIN-UHFFFAOYSA-N,Panax ginseng,,https://patents.google.com/?q=HTCXXOQBBXKJIN-UHFFFAOYSA-N&q=TI%3d%22Panax+ginseng%22&patents=false&scholar&sort=old,https://patents.google.com/scholar/11987446280325624551,https://onlinelibrary.wiley.com/doi/abs/10.1002/bmc.969,"Determination of volatile organic compounds generated from fresh, white and red Panax ginseng (CA Meyer) using a direct sample injection technique",Biomedical Chromatography,2008,"Abd El‐Aty et al., 2008"
252,HMFHBZSHGGEWLO-MBMOQRBOSA-N,Oryza brachyantha,,https://patents.google.com/?q=HMFHBZSHGGEWLO-MBMOQRBOSA-N&q=TI%3d%22Oryza+brachyantha%22&patents=false&scholar&sort=old,NaN,NaN,NaN,NaN,NaN,NaN
253,NXYYIKXGZKILRL-UHFFFAOYSA-N,Tabebuia impetiginosa,,https://patents.google.com/?q=NXYYIKXGZKILRL-UHFFFAOYSA-N&q=TI%3d%22Tabebuia+impetiginosa%22&patents=false&scholar&sort=old,NaN,NaN,NaN,NaN,NaN,NaN
254,QIHHQEWWGMEJTH-WYSCZCKCSA-N,Euonymus sieboldianus,,https://patents.google.com/?q=QIHHQEWWGMEJTH-WYSCZCKCSA-N&q=TI%3d%22Euonymus+sieboldianus%22&patents=false&scholar&sort=old,NaN,NaN,NaN,NaN,NaN,NaN
255,KKGQTZUTZRNORY-UHFFFAOYSA-N,Isaria sinclairii,"FTY720, a synthetic compound from Isaria sinclairii, inhibits proliferation and induces apoptosis in pancreatic cancer cells.",https://patents.google.com/?q=KKGQTZUTZRNORY-UHFFFAOYSA-N&q=TI%3d%22Isaria+sinclairii%22&patents=false&scholar&sort=old,https://patents.google.com/scholar/7970642488767837843,https://www.tandfonline.com/doi/abs/10.1080/15287390490514796,Genotoxicity evaluation of Isaria sinclairii (ISE) extract,"Journal of Toxicology and Environmental Health, Part A",2004,"Ahn et al., 2004"
256,MAGQQZHFHJDIRE-BNFZFUHLSA-N,Cissampelos,Isobutylamides and a New Methylbutylamide fromPiper sarmentosum,https://patents.google.com/?q=MAGQQZHFHJDIRE-BNFZFUHLSA-N&q=TI%3d%22Cissampelos%22&patents=false&scholar&sort=old,https://patents.google.com/scholar/142576636709580573,https://www.thieme-connect.com/products/ejournals/abstract/10.1055/s-2006-957913,Alkamides from Cissampelos glaberrima,Planta medica,1996,"Rosario et al., 1996"
257,PEUUVVGQIVMSAW-DJDZNOHASA-N,Acorus tatarinowii,"(±)-Acortatarinowins A-F, Norlignan, Neolignan, and Lignan Enantiomers from Acorus tatarinowii.",https://patents.google.com/?q=PEUUVVGQIVMSAW-DJDZNOHASA-N&q=TI%3d%22Acorus+tatarinowii%22&patents=false&scholar&sort=old,https://patents.google.com/scholar/6883076222431338034,https://pubs.acs.org/doi/abs/10.1021/acs.jnatprod.5b00328,"(±)-Acortatarinowins A–F, norlignan, neolignan, and lignan enantiomers from Acorus tatarinowii",Journal of natural products,2015,"Lu et al., 2015"
258,MTZQAGJQAFMTAQ-UHFFFAOYSA-N,Grossulariaceae,,https://patents.google.com/?q=MTZQAGJQAFMTAQ-UHFFFAOYSA-N&q=TI%3d%22Grossulariaceae%22&patents=false&scholar&sort=old,NaN,NaN,NaN,NaN,NaN,NaN
259,NZWARRNVJMJZTP-UHFFFAOYSA-N,Emericella,"Isolation and structure elucidation of new phthalide and phthalane derivatives, isolated as antimicrobial agents from Emericella sp. IFM57991",https://patents.google.com/?q=NZWARRNVJMJZTP-UHFFFAOYSA-N&q=TI%3d%22Emericella%22&patents=false&scholar&sort=old,NaN,NaN,NaN,NaN,NaN,NaN
260,OFAZPSYXUKIJIK-JGRZZSDMSA-N,Goupia tomentosa,,https://patents.google.com/?q=OFAZPSYXUKIJIK-JGRZZSDMSA-N&q=TI%3d%22Goupia+tomentosa%22&patents=false&scholar&sort=old,NaN,NaN,NaN,NaN,NaN,NaN
261,JRUFOFIHYXDKPU-FMPAGVTOSA-N,Streptomyces,"Cloning and analysis of a type II polyketide synthase gene cluster from Streptomyces toxytricini NRRL 15,443.",https://patents.google.com/?q=JRUFOFIHYXDKPU-FMPAGVTOSA-N&q=TI%3d%22Streptomyces%22&patents=false&scholar&sort=old,NaN,NaN,NaN,NaN,NaN,NaN
262,VUQLHQFKACOHNZ-LURJTMIESA-N,Capsella grandiflora,,https://patents.google.com/?q=VUQLHQFKACOHNZ-LURJTMIESA-N&q=TI%3d%22Capsella+grandiflora%22&patents=false&scholar&sort=old,NaN,NaN,NaN,NaN,NaN,NaN
263,WRMNZCZEMHIOCP-UHFFFAOYSA-N,Aspergillus albus,,https://patents.google.com/?q=WRMNZCZEMHIOCP-UHFFFAOYSA-N&q=TI%3d%22Aspergillus+albus%22&patents=false&scholar&sort=old,NaN,NaN,NaN,NaN,NaN,NaN
264,AOZTYYBGNNXAOI-NTEUORMPSA-N,Piper,,https://patents.google.com/?q=AOZTYYBGNNXAOI-NTEUORMPSA-N&q=TI%3d%22Piper%22&patents=false&scholar&sort=old,https://patents.google.com/scholar/4152621742665663610,https://www.jstage.jst.go.jp/article/cpb1958/18/1/18_1_100/_pdf,"The Structure of Futoquinol, a Constituent of Piper futokadzura SIEB. et ZUCC.",Chemical and Pharmaceutical Bulletin,1970,"TAKAHASHI et al., 1970"
265,YUSWMAULDXZHPY-UHFFFAOYSA-N,Garcinia livingstonei,,https://patents.google.com/?q=YUSWMAULDXZHPY-UHFFFAOYSA-N&q=TI%3d%22Garcinia+livingstonei%22&patents=false&scholar&sort=old,https://patents.google.com/scholar/14283677060355139932,https://journals.sagepub.com/doi/pdf/10.1177/1934578X0900401010,Isolation and activity of two antibacterial biflavonoids from leaf extracts of Garcinia livingstonei (Clusiaceae),Natural product communications,2009,"Kaikabo et al., 2009"
266,ISWSIDIOOBJBQZ-UHFFFAOYSA-N,Vitex,,https://patents.google.com/?q=ISWSIDIOOBJBQZ-UHFFFAOYSA-N&q=TI%3d%22Vitex%22&patents=false&scholar&sort=old,https://patents.google.com/scholar/12073331394630218100,NaN,NaN,NaN,NaN,NaN
267,RXGUTQNKCXHALN-BJMVGYQFSA-N,Solanum,The distribution of hydroxycinnamic acid amides in flowering plants,https://patents.google.com/?q=RXGUTQNKCXHALN-BJMVGYQFSA-N&q=TI%3d%22Solanum%22&patents=false&scholar&sort=old,https://patents.google.com/scholar/10211545099458509637,NaN,NaN,NaN,NaN,NaN
268,SGNZYJXNUURYCH-UHFFFAOYSA-N,Vitis vinifera,,https://patents.google.com/?q=SGNZYJXNUURYCH-UHFFFAOYSA-N&q=TI%3d%22Vitis+vinifera%22&patents=false&scholar&sort=old,NaN,NaN,NaN,NaN,NaN,NaN
269,MYHSVHWQEVDFQT-ILPXZUKPSA-N,Brassica rapa,Biogene Gifte. Von Eberhard Teuscher und Ulrike Lindequist,https://patents.google.com/?q=MYHSVHWQEVDFQT-ILPXZUKPSA-N&q=TI%3d%22Brassica+rapa%22&patents=false&scholar&sort=old,https://patents.google.com/scholar/14351971568305252183,https://pubs.acs.org/doi/abs/10.1021/jf201626z,Kinetic changes in glucosinolate-derived volatiles by heat-treatment and myrosinase activity in Nakajimana (Brassica rapa L. cv. Nakajimana),Journal of agricultural and food chemistry,2011,"Kato et al., 2011"
