,IK,bio_lowertaxon,query_link,top1_link,ref,extracted_title,extracted_journal,extracted_year,extracted_firstauthor_year
0,JQQBXPCJFAKSPG-SVYIMCMUSA-N,Penicillium paxilli,"https://patents.google.com/?q=JQQBXPCJFAKSPG-SVYIMCMUSA-N&q=TI%3d""Penicillium+paxilli""&patents=false&scholar",NaN,NaN,NaN,NaN,NaN,NaN
1,DTGKSKDOIYIVQL-UHFFFAOYSA-N,Elsholtzia ciliata,"https://patents.google.com/?q=DTGKSKDOIYIVQL-UHFFFAOYSA-N&q=TI%3d""Elsholtzia+ciliata""&patents=false&scholar",NaN,NaN,NaN,NaN,NaN,NaN
2,IUCHKMAZAWJNBJ-RCYXVVTDSA-N,Callerya cinerea,"https://patents.google.com/?q=IUCHKMAZAWJNBJ-RCYXVVTDSA-N&q=TI%3d""Callerya+cinerea""&patents=false&scholar",NaN,NaN,NaN,NaN,NaN,NaN
3,CVGWYDBQFQBYKB-VNVUOZPZSA-N,Euphorbia nivulia,"https://patents.google.com/?q=CVGWYDBQFQBYKB-VNVUOZPZSA-N&q=TI%3d""Euphorbia+nivulia""&patents=false&scholar",NaN,NaN,NaN,NaN,NaN,NaN
4,XFZJEEAOWLFHDH-VUGKQVTMSA-N,Chaenomeles sinensis,"https://patents.google.com/?q=XFZJEEAOWLFHDH-VUGKQVTMSA-N&q=TI%3d""Chaenomeles+sinensis""&patents=false&scholar",https://patents.google.com/scholar/5829584398813796525?q=PFEUJUXMHXWDQS-MHSWQEBQSA-N&patents=false&scholar&oq=PFEUJUXMHXWDQS-MHSWQEBQSA-N,https://www.mdpi.com/2079-9284/6/1/21/pdf,The Anti-Aging Potential of Extracts from Chaenomeles sinensis,Cosmetics,2019,"Itoh et al., 2019"
5,BBLGCDSLCDDALX-LKGBESRRSA-N,Streptomyces,"https://patents.google.com/?q=BBLGCDSLCDDALX-LKGBESRRSA-N&q=TI%3d""Streptomyces""&patents=false&scholar",https://patents.google.com/scholar/12435268252085283140?q=PFEUJUXMHXWDQS-MHSWQEBQSA-N&patents=false&scholar&oq=PFEUJUXMHXWDQS-MHSWQEBQSA-N,https://pubag.nal.usda.gov/?page=20641&per_page=100&search_field=all_fields,Marine Streptomyces as a novel source of bioactive substances,World Journal of Microbiology and Biotechnology,2010,"Dharmaraj, 2010"
6,PLWGJLHNBNMJOH-PABCKOPISA-N,Ferula kuhistanica,"https://patents.google.com/?q=PLWGJLHNBNMJOH-PABCKOPISA-N&q=TI%3d""Ferula+kuhistanica""&patents=false&scholar",https://patents.google.com/scholar/17072076670604819141?q=PFEUJUXMHXWDQS-MHSWQEBQSA-N&patents=false&scholar&oq=PFEUJUXMHXWDQS-MHSWQEBQSA-N,https://www.sciencedirect.com/science/article/pii/S0031942200001977,Sesquiterpenoids from Ferula kuhistanica,Phytochemistry,2000,"Chen et al., 2000"
7,LNTHITQWFMADLM-UHFFFAOYSA-N,Phormia regina,"https://patents.google.com/?q=LNTHITQWFMADLM-UHFFFAOYSA-N&q=TI%3d""Phormia+regina""&patents=false&scholar",NaN,NaN,NaN,NaN,NaN,NaN
8,DPTZOOXIEWHODB-XLDMSTKGSA-N,Isoberlinia angolensis,"https://patents.google.com/?q=DPTZOOXIEWHODB-XLDMSTKGSA-N&q=TI%3d""Isoberlinia+angolensis""&patents=false&scholar",NaN,NaN,NaN,NaN,NaN,NaN
9,WLXLLQQGGGHOMA-UHFFFAOYSA-N,Euphorbia pithyusa,"https://patents.google.com/?q=WLXLLQQGGGHOMA-UHFFFAOYSA-N&q=TI%3d""Euphorbia+pithyusa""&patents=false&scholar",NaN,NaN,NaN,NaN,NaN,NaN
10,PFEUJUXMHXWDQS-MHSWQEBQSA-N,Eurycoma longifolia,"https://patents.google.com/?q=PFEUJUXMHXWDQS-MHSWQEBQSA-N&q=TI%3d""Eurycoma+longifolia""&patents=false&scholar",https://patents.google.com/scholar/2775812499262969859?q=PFEUJUXMHXWDQS-MHSWQEBQSA-N&patents=false&scholar&oq=PFEUJUXMHXWDQS-MHSWQEBQSA-N,https://pubs.acs.org/doi/full/10.1021/np400701k,NF-κB inhibitors from Eurycoma longifolia,Journal of natural products,2014,"Tran et al., 2014"
