,IK,bio_lowertaxon,original_ref,query_link,top1_link,ref,extracted_title,extracted_journal,extracted_year,extracted_firstauthor_year
0,MNWFXJYAOYHMED-UHFFFAOYSA-N,Vitis vinifera,Distinct metabolic responses of an ovarian cancer stem cell line.,https://patents.google.com/?q=MNWFXJYAOYHMED-UHFFFAOYSA-N&q=TI%3d%22Vitis+vinifera%22&patents=false&scholar&sort=old,https://patents.google.com/scholar/6345042674781000960,https://pubs.acs.org/doi/pdf/10.1021/jf00038a020,"Effect of storage under carbon dioxide atmosphere on the volatile, amino acid, and pigment constituents in red grape (Vitis vinifera L. var. Agiorgitiko)",Journal of Agricultural and Food Chemistry,1994,"Dourtoglou et al., 1994"
1,YOKBTBNVNCFOBF-UHFFFAOYSA-N,Plantae,Total Synthesis of Bassiatin and Its Stereoisomers:  Novel Divergent Behavior of Substrates in Mitsunobu Cyclizations,https://patents.google.com/?q=YOKBTBNVNCFOBF-UHFFFAOYSA-N&q=TI%3d%22Plantae%22&patents=false&scholar&sort=old,NaN,NaN,NaN,NaN,NaN,NaN
2,SZQCDAMPRNWLHM-UHFFFAOYSA-N,Graphis proserpens,Phenolic compounds from the cultured mycobionts of Graphis proserpens,https://patents.google.com/?q=SZQCDAMPRNWLHM-UHFFFAOYSA-N&q=TI%3d%22Graphis+proserpens%22&patents=false&scholar&sort=old,NaN,NaN,NaN,NaN,NaN,NaN
3,QZNIVVAKPLIDJX-ZFOPBEGVSA-N,Euphorbia peplis,New cerebrosides from Euphorbia peplis L.: antimicrobial activity evaluation,https://patents.google.com/?q=QZNIVVAKPLIDJX-ZFOPBEGVSA-N&q=TI%3d%22Euphorbia+peplis%22&patents=false&scholar&sort=old,NaN,NaN,NaN,NaN,NaN,NaN
4,MAGQQZHFHJDIRE-BNFZFUHLSA-N,Cissampelos,Isobutylamides and a New Methylbutylamide fromPiper sarmentosum,https://patents.google.com/?q=MAGQQZHFHJDIRE-BNFZFUHLSA-N&q=TI%3d%22Cissampelos%22&patents=false&scholar&sort=old,https://patents.google.com/scholar/142576636709580573,https://www.thieme-connect.com/products/ejournals/abstract/10.1055/s-2006-957913,Alkamides from Cissampelos glaberrima,Planta medica,1996,"Rosario et al., 1996"
5,YSJGIOJYGKGLQE-UHFFFAOYSA-N,Reaumuria alternifolia,Cytotoxic ellagitannins from Reaumuria vermiculata,https://patents.google.com/?q=YSJGIOJYGKGLQE-UHFFFAOYSA-N&q=TI%3d%22Reaumuria+alternifolia%22&patents=false&scholar&sort=old,NaN,NaN,NaN,NaN,NaN,NaN
6,MYHSVHWQEVDFQT-ILPXZUKPSA-N,Brassica rapa,Biogene Gifte. Von Eberhard Teuscher und Ulrike Lindequist,https://patents.google.com/?q=MYHSVHWQEVDFQT-ILPXZUKPSA-N&q=TI%3d%22Brassica+rapa%22&patents=false&scholar&sort=old,https://patents.google.com/scholar/14351971568305252183,https://pubs.acs.org/doi/abs/10.1021/jf201626z,Kinetic changes in glucosinolate-derived volatiles by heat-treatment and myrosinase activity in Nakajimana (Brassica rapa L. cv. Nakajimana),Journal of agricultural and food chemistry,2011,"Kato et al., 2011"
7,LTSBAPIBOQOBOR-WAYWQWQTSA-N,Peucedanum praeruptorum,Chemical components of the roots of Noni (Morinda citrifolia) and their cytotoxic effects.,https://patents.google.com/?q=LTSBAPIBOQOBOR-WAYWQWQTSA-N&q=TI%3d%22Peucedanum+praeruptorum%22&patents=false&scholar&sort=old,NaN,NaN,NaN,NaN,NaN,NaN
8,KKGQTZUTZRNORY-UHFFFAOYSA-N,Isaria sinclairii,"FTY720, a synthetic compound from Isaria sinclairii, inhibits proliferation and induces apoptosis in pancreatic cancer cells.",https://patents.google.com/?q=KKGQTZUTZRNORY-UHFFFAOYSA-N&q=TI%3d%22Isaria+sinclairii%22&patents=false&scholar&sort=old,https://patents.google.com/scholar/7970642488767837843,https://www.tandfonline.com/doi/abs/10.1080/15287390490514796,Genotoxicity evaluation of Isaria sinclairii (ISE) extract,"Journal of Toxicology and Environmental Health, Part A",2004,"Ahn et al., 2004"
9,PCWWIOUZYOPZHT-VBUSEHTESA-N,Piper longum,Preparative isolation and purification of amides from the fruits of Piper longum L. by upright counter-current chromatography and reversed-phase liquid chromatography,https://patents.google.com/?q=PCWWIOUZYOPZHT-VBUSEHTESA-N&q=TI%3d%22Piper+longum%22&patents=false&scholar&sort=old,https://patents.google.com/scholar/1549395381117783352,https://www.biorxiv.org/content/biorxiv/early/2017/11/08/169763.full.pdf,Piper longum Linn: A review of its phytochemicals and their network pharmacological evaluation,bioRxiv,2017,"Choudhary et al., 2017"
10,XYWFSSFJPFAYCA-JRJNMRRASA-O,Vaccinium angustifolium,Quantitation and Distribution of Simple and Acylated Anthocyanins and Other Phenolics in Blueberries,https://patents.google.com/?q=XYWFSSFJPFAYCA-JRJNMRRASA-O&q=TI%3d%22Vaccinium+angustifolium%22&patents=false&scholar&sort=old,NaN,NaN,NaN,NaN,NaN,NaN
11,PIGLOISSVVAGBD-NHQGMKOOSA-N,Erythrina burttii,Two prenylated flavanones from stem bark of Erythrina burttii,https://patents.google.com/?q=PIGLOISSVVAGBD-NHQGMKOOSA-N&q=TI%3d%22Erythrina+burttii%22&patents=false&scholar&sort=old,NaN,NaN,NaN,NaN,NaN,NaN
12,MZQDVARUQLLSGL-UHFFFAOYSA-N,Pestalotiopsis,"Photinides A−F, Cytotoxic Benzofuranone-Derived γ-Lactones from the Plant Endophytic FungusPestalotiopsis photiniae",https://patents.google.com/?q=MZQDVARUQLLSGL-UHFFFAOYSA-N&q=TI%3d%22Pestalotiopsis%22&patents=false&scholar&sort=old,https://patents.google.com/scholar/15300646147191768867,http://www.im.ac.cn/UserFiles/File/2009/200907/12-JNP.pdf,"Photinides A− F, Cytotoxic Benzofuranone-Derived γ-Lactones from the Plant Endophytic Fungus Pestalotiopsis photiniae",Journal of natural products,2009,"Ding et al., 2009"
13,LTXWSWWXNHYXCW-UJOWSUJOSA-N,Lemnalia,Steroids and sesquiterpenoids from the soft corals Dendronephthya gigantea and Lemnalia cervicorni.,https://patents.google.com/?q=LTXWSWWXNHYXCW-UJOWSUJOSA-N&q=TI%3d%22Lemnalia%22&patents=false&scholar&sort=old,NaN,NaN,NaN,NaN,NaN,NaN
14,WRJIJSMXYWUZAJ-BLLLJJGKSA-N,Paecilomyces variotii,Antibacterial Polyketides from the Jellyfish-Derived FungusPaecilomyces variotii,https://patents.google.com/?q=WRJIJSMXYWUZAJ-BLLLJJGKSA-N&q=TI%3d%22Paecilomyces+variotii%22&patents=false&scholar&sort=old,https://patents.google.com/scholar/14989095797276289358,https://pubs.acs.org/doi/abs/10.1021/np200350b,Antibacterial polyketides from the jellyfish-derived fungus Paecilomyces variotii,Journal of natural products,2011,"Liu et al., 2011"
15,RLEKJHOJOZAHJF-VHWYSAPLSA-N,Streptomyces,Unique post-translational oxime formation in the biosynthesis of the azolemycin complex of novel ribosomal peptides from Streptomyces sp. FXJ1.264,https://patents.google.com/?q=RLEKJHOJOZAHJF-VHWYSAPLSA-N&q=TI%3d%22Streptomyces%22&patents=false&scholar&sort=old,NaN,NaN,NaN,NaN,NaN,NaN
16,SGSNFWBUTGZVOW-UHFFFAOYSA-N,Streptomyces,"Genoketides A1 and A2, New Octaketides and Biosynthetic Intermediates of Chrysophanol Produced by Streptomyces sp. AK 671",https://patents.google.com/?q=SGSNFWBUTGZVOW-UHFFFAOYSA-N&q=TI%3d%22Streptomyces%22&patents=false&scholar&sort=old,NaN,NaN,NaN,NaN,NaN,NaN
17,ZUHSRZLUGOUPFT-YQAZJISCSA-N,Piper,"Chabamide, a Novel Piperine Dimer from Stems ofPiper chaba",https://patents.google.com/?q=ZUHSRZLUGOUPFT-YQAZJISCSA-N&q=TI%3d%22Piper%22&patents=false&scholar&sort=old,NaN,NaN,NaN,NaN,NaN,NaN
18,JLVVSXFLKOJNIY-UHFFFAOYSA-N,Caulophyllum thalictroides,"Pedersøn [Pedersen], Mogens",https://patents.google.com/?q=JLVVSXFLKOJNIY-UHFFFAOYSA-N&q=TI%3d%22Caulophyllum+thalictroides%22&patents=false&scholar&sort=old,NaN,NaN,NaN,NaN,NaN,NaN
19,JDCPEKQWFDWQLI-MZPUHGDESA-N,Panax ginseng,Liquid chromatography–electrospray mass spectrometric identification of ginsenosides in Panax ginseng roots,https://patents.google.com/?q=JDCPEKQWFDWQLI-MZPUHGDESA-N&q=TI%3d%22Panax+ginseng%22&patents=false&scholar&sort=old,NaN,NaN,NaN,NaN,NaN,NaN
20,RDUAJIJVNHKTQC-UHFFFAOYSA-N,Plantae,Profiling of phenolic compounds and antioxidant activity of dry extracts from the selected Sorbus species.,https://patents.google.com/?q=RDUAJIJVNHKTQC-UHFFFAOYSA-N&q=TI%3d%22Plantae%22&patents=false&scholar&sort=old,NaN,NaN,NaN,NaN,NaN,NaN
21,NZWARRNVJMJZTP-UHFFFAOYSA-N,Emericella,"Isolation and structure elucidation of new phthalide and phthalane derivatives, isolated as antimicrobial agents from Emericella sp. IFM57991",https://patents.google.com/?q=NZWARRNVJMJZTP-UHFFFAOYSA-N&q=TI%3d%22Emericella%22&patents=false&scholar&sort=old,NaN,NaN,NaN,NaN,NaN,NaN
22,JRUFOFIHYXDKPU-FMPAGVTOSA-N,Streptomyces,"Cloning and analysis of a type II polyketide synthase gene cluster from Streptomyces toxytricini NRRL 15,443.",https://patents.google.com/?q=JRUFOFIHYXDKPU-FMPAGVTOSA-N&q=TI%3d%22Streptomyces%22&patents=false&scholar&sort=old,NaN,NaN,NaN,NaN,NaN,NaN
23,FJAQNRBDVKIIKK-LFLQOBSNSA-N,Streptomyces hygroscopicus,Structure and mechanism of the magnesium-independent aromatic prenyltransferase CloQ from the clorobiocin biosynthetic pathway.,https://patents.google.com/?q=FJAQNRBDVKIIKK-LFLQOBSNSA-N&q=TI%3d%22Streptomyces+hygroscopicus%22&patents=false&scholar&sort=old,NaN,NaN,NaN,NaN,NaN,NaN
24,HRQVZXBGBCUWQA-UHFFFAOYSA-N,Streptomyces,Bi- and Tetracyclic Spirotetronates from the Coal Mine Fire Isolate Streptomyces sp. LC-6-2,https://patents.google.com/?q=HRQVZXBGBCUWQA-UHFFFAOYSA-N&q=TI%3d%22Streptomyces%22&patents=false&scholar&sort=old,NaN,NaN,NaN,NaN,NaN,NaN
25,RXGUTQNKCXHALN-BJMVGYQFSA-N,Solanum,The distribution of hydroxycinnamic acid amides in flowering plants,https://patents.google.com/?q=RXGUTQNKCXHALN-BJMVGYQFSA-N&q=TI%3d%22Solanum%22&patents=false&scholar&sort=old,https://patents.google.com/scholar/10211545099458509637,NaN,NaN,NaN,NaN,NaN
26,PVTHJAPFENJVNC-UQTMRZPGSA-N,Streptomyces kasugaensis,Cloning and analysis of a gene (sms13) encoding sannamycin B-glycyltransferase from Streptomyces sannanensis and its distribution among actinomycetes.,https://patents.google.com/?q=PVTHJAPFENJVNC-UQTMRZPGSA-N&q=TI%3d%22Streptomyces+kasugaensis%22&patents=false&scholar&sort=old,NaN,NaN,NaN,NaN,NaN,NaN
27,UKZCPYJTHXIGBQ-UHFFFAOYSA-N,Streptomyces,"Rotihibins, Novel Plant Growth Regulators from Streptomyces graminofaciens.",https://patents.google.com/?q=UKZCPYJTHXIGBQ-UHFFFAOYSA-N&q=TI%3d%22Streptomyces%22&patents=false&scholar&sort=old,NaN,NaN,NaN,NaN,NaN,NaN
28,PEUUVVGQIVMSAW-DJDZNOHASA-N,Acorus tatarinowii,"(±)-Acortatarinowins A-F, Norlignan, Neolignan, and Lignan Enantiomers from Acorus tatarinowii.",https://patents.google.com/?q=PEUUVVGQIVMSAW-DJDZNOHASA-N&q=TI%3d%22Acorus+tatarinowii%22&patents=false&scholar&sort=old,https://patents.google.com/scholar/6883076222431338034,https://pubs.acs.org/doi/abs/10.1021/acs.jnatprod.5b00328,"(±)-Acortatarinowins A–F, norlignan, neolignan, and lignan enantiomers from Acorus tatarinowii",Journal of natural products,2015,"Lu et al., 2015"
29,QNAYBMKLOCPYGJ-REOHCLBHSA-N,Juglans regia,Sequelae,https://patents.google.com/?q=QNAYBMKLOCPYGJ-REOHCLBHSA-N&q=TI%3d%22Juglans+regia%22&patents=false&scholar&sort=old,https://patents.google.com/scholar/17525734097228984500,https://pubs.acs.org/doi/pdf/10.1021/jf60136a012,"Nutrients in Nut Kernels, Free Amino Acids in English Walnut (Juglans regia) Kernels",Journal of Agricultural and Food Chemistry,1964,"Rockland et al., 1964"
30,FJAQNRBDVKIIKK-LFLQOBSNSA-N,Streptomyces hygroscopicus,Resistance genes of aminocoumarin producers: two type II topoisomerase genes confer resistance against coumermycin A1 and clorobiocin.,https://patents.google.com/?q=FJAQNRBDVKIIKK-LFLQOBSNSA-N&q=TI%3d%22Streptomyces+hygroscopicus%22&patents=false&scholar&sort=old,NaN,NaN,NaN,NaN,NaN,NaN
31,FJAQNRBDVKIIKK-LFLQOBSNSA-N,Streptomyces,"Aminocoumarins mutasynthesis, chemoenzymatic synthesis, and metabolic engineering.",https://patents.google.com/?q=FJAQNRBDVKIIKK-LFLQOBSNSA-N&q=TI%3d%22Streptomyces%22&patents=false&scholar&sort=old,NaN,NaN,NaN,NaN,NaN,NaN
