,IK,bio_lowertaxon,original_ref,query_link,top1_link,ref,extracted_title,extracted_journal,extracted_year,extracted_firstauthor_year
0,CC(C)CNC(=O)\C=C\CC/C=C\C=C\C,Spilanthes acmella,"LC-MS profiling of N-alkylamides in Spilanthes acmella extract and the transmucosal behaviour of its main bio-active spilanthol Boonen J., Baert B., Burvenich C., Blondeel P., De Saeger S., De Spiegeleer B. Journal of Pharmaceutical and Biomedical Analysis 2010",https://patents.google.com/?q=CC(C)CNC(&q=Spilanthes+acmella&patents=false&scholar,https://patents.google.com/scholar/9220872761342683067,NaN,NaN,NaN,NaN,NaN
1,ancistrocladisine,Ancistrocladus heyneanus,Bringmann et al Phytochemistry 65 (2004) 2903–2907.,https://patents.google.com/?q=ancistrocladisine&q=Ancistrocladus+heyneanus&patents=false&scholar,https://patents.google.com/scholar/954815924470783516,https://pubs.acs.org/doi/abs/10.1021/cr100155e,Atroposelective total synthesis of axially chiral biaryl natural products,Chemical reviews,2011,"Bringmann et al., 2011"
2,"15,16-epoxy-12b-hydroxylabda-8(17)-13(16),14-triene",Aframomum aulacocarpos,S. V. T. Sob et al. Tetrahedron 63 (2007) 8993–8998.,"https://patents.google.com/?q=15,16-epoxy-12b-hydroxylabda-8(17)-13(16),14-triene&q=Aframomum+aulacocarpos&patents=false&scholar",https://patents.google.com/scholar/9429267877598996661,http://www.academia.edu/download/36895379/Agro-industrial_potential_of_exotic_fruit_byproducts_as_a_source_of_food_additives.pdf,Agro-industrial potential of exotic fruit byproducts as a source of food additives,Food Research International,2011,"Ayala-Zavala et al., 2011"
3,CC(C)CNC(=O)\C=C\CC/C=C\C=C\C,Spilanthes,"Bioactivity of compounds from Acmella oleracea against Tuta absoluta (Meyrick) (Lepidoptera: Gelechiidae) and selectivity to two non-target species Moreno S.C., Carvalho G.A., Picanço M.C., Morais E.G.F., Pereira R.M. Pest management science 2011",https://patents.google.com/?q=CC(C)CNC(&q=Spilanthes&patents=false&scholar,https://patents.google.com/scholar/10596501577281550194,NaN,NaN,NaN,NaN,NaN
4,hosloppin,Hoslundia opposita,"Salame et al, 2012",https://patents.google.com/?q=hosloppin&q=Hoslundia+opposita&patents=false&scholar,https://patents.google.com/scholar/14147792816825905693,https://www.researchgate.net/profile/Christian_Bories/publication/230797535_Pyrone_and_Unusually_Furanone-substituted_Flavones_from_the_Leaves_of_Hoslundia_opposita/links/540dad6d0cf2d8daaacc9cce/Pyrone-and-Unusually-Furanone-substituted-Flavones-from-the-Leaves-of-Hoslundia-opposita.pdf,Pyrone and Unusually Furanone-substituted Flavones from the Leaves of Hoslundia opposita,Planta medica,2012,"Salame et al., 2012"
5,CC(C)CNC(=O)\C=C\CC/C=C\C=C\C,Heliopsis longipes,"Acmella radicans var. radicans: In vitro culture establishment and alkamide content Rios-Chavez P., Ramirez-Chavez E., Armenta-Salinas C., Molina-Torres J. In Vitro Cellular & Developmental Biology-Plant 2003",https://patents.google.com/?q=CC(C)CNC(&q=Heliopsis+longipes&patents=false&scholar,NaN,NaN,NaN,NaN,NaN,NaN
6,ancistrocladinium A,Ancistrocladus congolensis,"Bringmann et al J. Org. Chem. 2006, 71, 9348-9356.",https://patents.google.com/?q=ancistrocladinium+A&q=Ancistrocladus+congolensis&patents=false&scholar,https://patents.google.com/scholar/3606959684707070029,https://aac.asm.org/content/aac/51/1/188.full.pdf,Activities of naphthylisoquinoline alkaloids and synthetic analogs against Leishmania major,Antimicrobial agents and chemotherapy,2007,"Ponte-Sucre et al., 2007"
7,compound 70,Hyptis spicigera,"Ladan et al African Journal of Pure and Applied Chemistry Vol. 5(4), pp. 53-58, April 2011.",https://patents.google.com/?q=compound+70&q=Hyptis+spicigera&patents=false&scholar,https://patents.google.com/scholar/1482354444861904778,http://bashaar.org.il/files/%D7%91%D7%99%D7%95%D7%97%D7%A7%D7%A8%20-%20%D7%94%D7%A0%D7%9E%D7%9C%D7%94%202.pdf,Biological effects of essential oils–a review,Food and chemical toxicology,2008,"Bakkali et al., 2008"
8,CC(C)CNC(=O)\C=C\CC/C=C\C=C\C,Spilanthes,"Acmella radicans var. radicans: In vitro culture establishment and alkamide content Rios-Chavez P., Ramirez-Chavez E., Armenta-Salinas C., Molina-Torres J. In Vitro Cellular & Developmental Biology-Plant 2003",https://patents.google.com/?q=CC(C)CNC(&q=Spilanthes&patents=false&scholar,https://patents.google.com/scholar/10596501577281550194,NaN,NaN,NaN,NaN,NaN
9,"4(13),7-coloratadiene-12,11-olide",Warburgia ugandensis,A. A. WUBE ET AL. Phytother. Res. 24: 1468–1472 (2010),"https://patents.google.com/?q=4(13),7-coloratadiene-12,11-olide&q=Warburgia+ugandensis&patents=false&scholar",https://patents.google.com/scholar/2714975151898464847,https://www.annualreviews.org/doi/full/10.1146/annurev.ento.52.110405.091407%0D,The use of push-pull strategies in integrated pest management,Annu. Rev. Entomol.,2007,"Cook et al., 2007"
10,CC(C)CNC(=O)\C=C\CC/C=C\C=C\C,Heliopsis,"Bioactivity of compounds from Acmella oleracea against Tuta absoluta (Meyrick) (Lepidoptera: Gelechiidae) and selectivity to two non-target species Moreno S.C., Carvalho G.A., Picanço M.C., Morais E.G.F., Pereira R.M. Pest management science 2011",https://patents.google.com/?q=CC(C)CNC(&q=Heliopsis&patents=false&scholar,https://patents.google.com/scholar/2056758742378447949,NaN,NaN,NaN,NaN,NaN
11,CC(C)CNC(=O)\C=C\CC/C=C\C=C\C,Heliopsis,"Bioactivity of compounds from Acmella oleracea against Tuta absoluta (Meyrick) (Lepidoptera: Gelechiidae) and selectivity to two non-target species Moreno S.C., Carvalho G.A., Picanço M.C., Morais E.G.F., Pereira R.M. Pest management science 2011",https://patents.google.com/?q=CC(C)CNC(&q=Heliopsis&patents=false&scholar,https://patents.google.com/scholar/2056758742378447949,NaN,NaN,NaN,NaN,NaN
12,CC(C)CNC(=O)\C=C\CC/C=C\C=C\C,Spilanthes,"Structure-activity relationships of trigeminal effects for artificial and naturally occuring alkamides related to spilanthol Ley J.P., Krammer G., Looft J., Reinders G., Bertram H.J., Bredie Wender L.P., Agerlin P.M. Food Science and Technology Papers 2006",https://patents.google.com/?q=CC(C)CNC(&q=Spilanthes&patents=false&scholar,https://patents.google.com/scholar/10596501577281550194,NaN,NaN,NaN,NaN,NaN
13,compound72,Hyptis spicigera,"Ladan et al African Journal of Pure and Applied Chemistry Vol. 5(4), pp. 53-58, April 2011.",https://patents.google.com/?q=compound72&q=Hyptis+spicigera&patents=false&scholar,NaN,NaN,NaN,NaN,NaN,NaN
14,CC(C)CNC(=O)\C=C\CC/C=C\C=C\C,Spilanthes acmella,"Bioactive N-isobutylamides from the flower buds of Spilanthes acmella Ramsewak R.S., Erickson A.J., Nair M.G. Phytochemistry 1999",https://patents.google.com/?q=CC(C)CNC(&q=Spilanthes+acmella&patents=false&scholar,https://patents.google.com/scholar/9220872761342683067,NaN,NaN,NaN,NaN,NaN
15,Trichilia C,Trichilia emetica,Komane et al Phytochemistry Letters 4 (2011) 1–9.,https://patents.google.com/?q=Trichilia+C&q=Trichilia+emetica&patents=false&scholar,https://patents.google.com/scholar/14910141395654286055,https://www.sciencedirect.com/science/article/pii/S0378874105007993,Evaluation of the antioxidant properties and bioavailability of free and bound phenolic acids from Trichilia emetica Vahl.,Journal of ethnopharmacology,2006,"Germano et al., 2006"
16,CC(C)CNC(=O)\C=C\CC/C=C\C=C\C,Heliopsis,"Amides and other constituents from Acmella ciliata Martin R., Becker H. Phytochemistry 1985",https://patents.google.com/?q=CC(C)CNC(&q=Heliopsis&patents=false&scholar,https://patents.google.com/scholar/2056758742378447949,NaN,NaN,NaN,NaN,NaN
17,CC(C)CNC(=O)\C=C\CC/C=C\C=C\C,Spilanthes acmella,"LC-MS profiling of N-alkylamides in Spilanthes acmella extract and the transmucosal behaviour of its main bio-active spilanthol Boonen J., Baert B., Burvenich C., Blondeel P., De Saeger S., De Spiegeleer B. Journal of Pharmaceutical and Biomedical Analysis 2010",https://patents.google.com/?q=CC(C)CNC(&q=Spilanthes+acmella&patents=false&scholar,https://patents.google.com/scholar/9220872761342683067,NaN,NaN,NaN,NaN,NaN
18,CC(C)CNC(=O)\C=C\CC/C=C\C=C\C,Heliopsis longipes,"Structure-activity relationships of trigeminal effects for artificial and naturally occuring alkamides related to spilanthol Ley J.P., Krammer G., Looft J., Reinders G., Bertram H.J., Bredie Wender L.P., Agerlin P.M. Food Science and Technology Papers 2006",https://patents.google.com/?q=CC(C)CNC(&q=Heliopsis+longipes&patents=false&scholar,NaN,NaN,NaN,NaN,NaN,NaN
19,CC(C)CNC(=O)\C=C\CC/C=C\C=C\C,Spilanthes,"Structure-activity relationships of trigeminal effects for artificial and naturally occuring alkamides related to spilanthol Ley J.P., Krammer G., Looft J., Reinders G., Bertram H.J., Bredie Wender L.P., Agerlin P.M. Food Science and Technology Papers 2006",https://patents.google.com/?q=CC(C)CNC(&q=Spilanthes&patents=false&scholar,https://patents.google.com/scholar/10596501577281550194,NaN,NaN,NaN,NaN,NaN
20,(M)-dioncophylline E,Dioncophyllum thollonii,Bringmann et al Phytochemistry 60 (2002) 389–397.,https://patents.google.com/?q=(M)-dioncophylline+E&q=Dioncophyllum+thollonii&patents=false&scholar,https://patents.google.com/scholar/12309500763831754978,http://scholar.google.com/scholar?cluster=12309500763831754978&hl=en&oi=scholarr,CUMULATIVE COMPOUND INDEX J. CHROMATOGR. A VOLS. 802–850,Journal of Chromatography A,1999,"acid Acetylcysteine, 1999"
21,CC(C)CNC(=O)\C=C\CC/C=C\C=C\C,Spilanthes acmella,"Anti-inflammatory effect of spilanthol from Spilanthes acmella on murine macrophage by down-regulating LPS-Induced inflammatory mediators Wu L.C., Fan N.C., Lin M.H., Chu I.R., Huang S.J., Hu C.Y., Han S.Y. Journal of Agricultural and Food Chemistry 2008",https://patents.google.com/?q=CC(C)CNC(&q=Spilanthes+acmella&patents=false&scholar,https://patents.google.com/scholar/9220872761342683067,NaN,NaN,NaN,NaN,NaN
22,"2-(4-hydroxyphenyl)-3,5,7-trihydroxy chromen-4-one",Vitex simplicifolia,Nwodo et al In-press,"https://patents.google.com/?q=2-(4-hydroxyphenyl)-3,5,7-trihydroxy+chromen-4-one&q=Vitex+simplicifolia&patents=false&scholar",https://patents.google.com/scholar/16935579781642995198,https://www.sciencedirect.com/science/article/pii/S0034666713000122,Atlas of the tropical West African pollen flora,Review of Palaeobotany and Palynology,2013,"Gosling et al., 2013"
23,CC(C)CNC(=O)\C=C\CC/C=C\C=C\C,Heliopsis,"Bioactivity of compounds from Acmella oleracea against Tuta absoluta (Meyrick) (Lepidoptera: Gelechiidae) and selectivity to two non-target species Moreno S.C., Carvalho G.A., Picanço M.C., Morais E.G.F., Pereira R.M. Pest management science 2011",https://patents.google.com/?q=CC(C)CNC(&q=Heliopsis&patents=false&scholar,https://patents.google.com/scholar/2056758742378447949,NaN,NaN,NaN,NaN,NaN
24,CC(C)CNC(=O)\C=C\CC/C=C\C=C\C,Heliopsis,"Anti-inflammatory effects of ethanolic extract and alkamides-derived from Heliopsis longipes roots Hernandez I., Marquez L., Martinez I., Dieguez R., Delporte C., Prieto S., Molina-Torres J., Garrido G. Journal of Ethnopharmacology 2009",https://patents.google.com/?q=CC(C)CNC(&q=Heliopsis&patents=false&scholar,https://patents.google.com/scholar/2056758742378447949,NaN,NaN,NaN,NaN,NaN
25,CC(C)CNC(=O)\C=C\CC/C=C\C=C\C,Spilanthes,"Fungistatic and bacteriostatic activities of alkamides from Heliopsis longipes roots: affinin and reduced amides Molina-Torres J., Salazar-Cabrera C.J., Armenta-Salinas C., Ramirez-Chavez E. Journal of Agricultural and Food Chemistry 2004",https://patents.google.com/?q=CC(C)CNC(&q=Spilanthes&patents=false&scholar,https://patents.google.com/scholar/10596501577281550194,NaN,NaN,NaN,NaN,NaN
26,"Methyl 1,2,3,4,4a,5,11,12b,13,14,14a,14b-dodecahydro-3,10-dihydroxy-2,4a,6,12b,14a-pentamethyl-11-oxopicene-2-carboxylate",Maytenus laevis,"Igoli et al John O. Igoli, Alexander I. Gray, Carol J. Clements and Hazar A. Mouad (2011). Anti-Trypanosomal Activityand Cytotoxicity of Some Compounds and Extracts from Nigerian Medicinal Plants, Phytochemicals -Bioactivities and Impact on Health, Prof. Iraj Rasooli (Ed.), ISBN: 978-953-307-424-5, InTech, Available from:http://www.intechopen.com/books/phytochemicals-bioactivities-and-impact-on-health/anti-trypanosomalactivity-and-cytotoxicity-of-some-compounds-and-extracts-from-nigerian-medicinal-p","https://patents.google.com/?q=Methyl+1,2,3,4,4a,5,11,12b,13,14,14a,14b-dodecahydro-3,10-dihydroxy-2,4a,6,12b,14a-pentamethyl-11-oxopicene-2-carboxylate&q=Maytenus+laevis&patents=false&scholar",https://patents.google.com/scholar/13737048276349811090,https://link.springer.com/chapter/10.1007/978-81-322-2163-0_4,Natural sources of anti-inflammation,Inflammation: Natural Resources and Its Applications,2015,"Jain et al., 2015"
27,Bicyclo[7.2.0]undec-4-ene,Hyptis spicigera,"Ladan et al African Journal of Pure and Applied Chemistry Vol. 5(4), pp. 53-58, April 2011.",https://patents.google.com/?q=Bicyclo[7.2.0]undec-4-ene&q=Hyptis+spicigera&patents=false&scholar,https://patents.google.com/scholar/17468521050452795657,http://www.academia.edu/download/58173278/11._IJLSCI_0677.pdf,Neo-simple methodology for the evaluation of potential botanical insect repellents and the rapid comparative study on specific chemical and photo sensitivity of …,Int. J. of. Life Sciences,2018,"Gopal et al., 2018"
28,O=C(/C=C/C=C/CCCCC)N1C=CCCC1,Achillea asiatica,"Amides from Achillea species and Leucocyclus formosus Greger H., Grenz M., Bohlmann F. Phytochemistry 1981",https://patents.google.com/?q=O&q=Achillea+asiatica&patents=false&scholar,https://patents.google.com/scholar/16560895387880689661,https://www.ingentaconnect.com/content/ben/cpd/2008/00000014/00000029/art00007,Biological activities of yarrow species (Achillea spp.),Current pharmaceutical design,2008,"Nemeth et al., 2008"
29,ancistroheynine A,Ancistrocladus heyneanus,Bringmann et al Phytochemistry 65 (2004) 2903–2907.,https://patents.google.com/?q=ancistroheynine+A&q=Ancistrocladus+heyneanus&patents=false&scholar,https://patents.google.com/scholar/5413171436275636688,NaN,NaN,NaN,NaN,NaN
30,"(9Z,11S,16S)- octadeca-9,17-diene-12,14-diyne-1,11,16-triol acetate",Cussonia zimmermannii,"Senn et al J. Nat. Prod. 2007, 70, 1565–1569.","https://patents.google.com/?q=(9Z,11S,16S)-+octadeca-9,17-diene-12,14-diyne-1,11,16-triol+acetate&q=Cussonia+zimmermannii&patents=false&scholar",NaN,NaN,NaN,NaN,NaN,NaN
31,CC(C)CNC(=O)\C=C\CC/C=C\C=C\C,Spilanthes,"LC-MS profiling of N-alkylamides in Spilanthes acmella extract and the transmucosal behaviour of its main bio-active spilanthol Boonen J., Baert B., Burvenich C., Blondeel P., De Saeger S., De Spiegeleer B. Journal of Pharmaceutical and Biomedical Analysis 2010",https://patents.google.com/?q=CC(C)CNC(&q=Spilanthes&patents=false&scholar,https://patents.google.com/scholar/10596501577281550194,NaN,NaN,NaN,NaN,NaN
32,CC(C)CNC(=O)\C=C\CC/C=C\C=C\C,Heliopsis longipes,"Anti-inflammatory effects of ethanolic extract and alkamides-derived from Heliopsis longipes roots Hernandez I., Marquez L., Martinez I., Dieguez R., Delporte C., Prieto S., Molina-Torres J., Garrido G. Journal of Ethnopharmacology 2009",https://patents.google.com/?q=CC(C)CNC(&q=Heliopsis+longipes&patents=false&scholar,NaN,NaN,NaN,NaN,NaN,NaN
33,"(E)-6-(5-ethylidene-4-oxo-4,5-dihydrofuran-3-yl)-5-hydroxy-7-methoxy-2-phenyl-4H-chromen-4-one.",Hoslundia opposita,"Salame et al, 2016","https://patents.google.com/?q=(E)-6-(5-ethylidene-4-oxo-4,5-dihydrofuran-3-yl)-5-hydroxy-7-methoxy-2-phenyl-4H-chromen-4-one.&q=Hoslundia+opposita&patents=false&scholar",NaN,NaN,NaN,NaN,NaN,NaN
34,14-O-2-Methoxy-5-nitrobenzyl-guttiferone A,Symphonia globulifera,Fromentin et al European Journal of Medicinal Chemistry 65 (2013) 284-294.,https://patents.google.com/?q=14-O-2-Methoxy-5-nitrobenzyl-guttiferone+A&q=Symphonia+globulifera&patents=false&scholar,https://patents.google.com/scholar/1498946720116496280,https://www.sciencedirect.com/science/article/pii/S0223523413002985,"Synthesis of novel guttiferone A derivatives: in-vitro evaluation toward Plasmodium falciparum, Trypanosoma brucei and Leishmania donovani",European journal of medicinal chemistry,2013,"Fromentin et al., 2013"
35,2-oxo-3-deacetyl salannin,Azadirachta indica,Githua et al Afr. J. Trad. CAM (2010) 7 (3): 207 - 213.,https://patents.google.com/?q=2-oxo-3-deacetyl+salannin&q=Azadirachta+indica&patents=false&scholar,https://patents.google.com/scholar/8348585110499370487,https://pubs.acs.org/doi/full/10.1021/cr9004023,Meliaceous limonoids: chemistry and biological activities,Chemical Reviews,2011,"Tan et al., 2011"
36,CC(C)CNC(=O)\C=C\CC/C=C\C=C\C,Heliopsis,"Acmella radicans var. radicans: In vitro culture establishment and alkamide content Rios-Chavez P., Ramirez-Chavez E., Armenta-Salinas C., Molina-Torres J. In Vitro Cellular & Developmental Biology-Plant 2003",https://patents.google.com/?q=CC(C)CNC(&q=Heliopsis&patents=false&scholar,https://patents.google.com/scholar/2056758742378447949,NaN,NaN,NaN,NaN,NaN
37,CC(C)CNC(=O)\C=C\CC/C=C\C=C\C,Heliopsis longipes,"Analgesic activity of affinin, an alkamide from Heliopsis longipes (Compositae) Rios M.Y., Aguilar-Guadarrama A.B., Guriérrez M.d.C. Journal of Ethnopharmacology 2007",https://patents.google.com/?q=CC(C)CNC(&q=Heliopsis+longipes&patents=false&scholar,NaN,NaN,NaN,NaN,NaN,NaN
38,CC(C)CNC(=O)\C=C\CC/C=C\C=C\C,Spilanthes,"Isolation and synthesis of acmellonate, a new unsaturated long chain 2-ketol ester from Spilanthes acmella Ley J.P., Blings M., Krammer G., Reinders G., Schmidt C.O., Bertram H.J. Natural Product Research 2006",https://patents.google.com/?q=CC(C)CNC(&q=Spilanthes&patents=false&scholar,https://patents.google.com/scholar/10596501577281550194,NaN,NaN,NaN,NaN,NaN
39,CC(C)CNC(=O)\C=C\CC/C=C\C=C\C,Heliopsis,"Fungistatic and bacteriostatic activities of alkamides from Heliopsis longipes roots: affinin and reduced amides Molina-Torres J., Salazar-Cabrera C.J., Armenta-Salinas C., Ramirez-Chavez E. Journal of Agricultural and Food Chemistry 2004",https://patents.google.com/?q=CC(C)CNC(&q=Heliopsis&patents=false&scholar,https://patents.google.com/scholar/2056758742378447949,NaN,NaN,NaN,NaN,NaN
40,CC(C)CNC(=O)\C=C\CC/C=C\C=C\C,Spilanthes acmella,"Antimicrobial properties of alkamides present in flavouring plants traditionally used in Mesoamerica: affinin and capsaicin Molina-Torres J., Garcia-Chavez A., Ramirez-Chavez E. Journal of Ethnopharmacology 1999",https://patents.google.com/?q=CC(C)CNC(&q=Spilanthes+acmella&patents=false&scholar,https://patents.google.com/scholar/9220872761342683067,NaN,NaN,NaN,NaN,NaN
41,CC(C)CNC(=O)\C=C\CC/C=C\C=C\C,Heliopsis,"Anti-inflammatory effects of ethanolic extract and alkamides-derived from Heliopsis longipes roots Hernandez I., Marquez L., Martinez I., Dieguez R., Delporte C., Prieto S., Molina-Torres J., Garrido G. Journal of Ethnopharmacology 2009",https://patents.google.com/?q=CC(C)CNC(&q=Heliopsis&patents=false&scholar,https://patents.google.com/scholar/2056758742378447949,NaN,NaN,NaN,NaN,NaN
42,akagerine,Strychnos spinosa,Rolfsen et al (J Nat Prod) 43: 97-102,https://patents.google.com/?q=akagerine&q=Strychnos+spinosa&patents=false&scholar,https://patents.google.com/scholar/17492287132780774034,https://www.researchgate.net/profile/Fred_Opperdoes/publication/6201591_Antitrypanosomal_Activity_of_Triterpenoids_and_Sterols_from_the_Leaves_of_Strychnos_spinosa_and_Related_Compounds/links/5b2f786d0f7e9b0df5c3a278/Antitrypanosomal-Activity-of-Triterpenoids-and-Sterols-from-the-Leaves-of-Strychnos-spinosa-and-Related-Compounds.pdf,Antitrypanosomal activity of triterpenoids and sterols from the leaves of Strychnos spinosa and related compounds,Journal of natural products,2007,"Hoet et al., 2007"
43,CC(C)CNC(=O)\C=C\CC/C=C\C=C\C,Spilanthes acmella,"Structure-activity relationships of trigeminal effects for artificial and naturally occuring alkamides related to spilanthol Ley J.P., Krammer G., Looft J., Reinders G., Bertram H.J., Bredie Wender L.P., Agerlin P.M. Food Science and Technology Papers 2006",https://patents.google.com/?q=CC(C)CNC(&q=Spilanthes+acmella&patents=false&scholar,https://patents.google.com/scholar/9220872761342683067,NaN,NaN,NaN,NaN,NaN
44,CC(C)CNC(=O)\C=C\CC/C=C\C=C\C,Heliopsis,"Antimicrobial properties of alkamides present in flavouring plants traditionally used in Mesoamerica: affinin and capsaicin Molina-Torres J., Garcia-Chavez A., Ramirez-Chavez E. Journal of Ethnopharmacology 1999",https://patents.google.com/?q=CC(C)CNC(&q=Heliopsis&patents=false&scholar,https://patents.google.com/scholar/2056758742378447949,NaN,NaN,NaN,NaN,NaN
45,CC(C)CNC(=O)\C=C\CC/C=C\C=C\C,Spilanthes acmella,"Isolation and synthesis of acmellonate, a new unsaturated long chain 2-ketol ester from Spilanthes acmella Ley J.P., Blings M., Krammer G., Reinders G., Schmidt C.O., Bertram H.J. Natural Product Research 2006",https://patents.google.com/?q=CC(C)CNC(&q=Spilanthes+acmella&patents=false&scholar,https://patents.google.com/scholar/9220872761342683067,NaN,NaN,NaN,NaN,NaN
46,2-(1-Hexyn-1-yl)-3-(methoxymethyl)oxirane,Hyptis spicigera,"Ladan et al African Journal of Pure and Applied Chemistry Vol. 5(4), pp. 53-58, April 2011.",https://patents.google.com/?q=2-(1-Hexyn-1-yl)-3-(methoxymethyl)oxirane&q=Hyptis+spicigera&patents=false&scholar,NaN,NaN,NaN,NaN,NaN,NaN
47,CC(C)CNC(=O)\C=C\CC/C=C\C=C\C,Spilanthes acmella,"Acmella radicans var. radicans: In vitro culture establishment and alkamide content Rios-Chavez P., Ramirez-Chavez E., Armenta-Salinas C., Molina-Torres J. In Vitro Cellular & Developmental Biology-Plant 2003",https://patents.google.com/?q=CC(C)CNC(&q=Spilanthes+acmella&patents=false&scholar,https://patents.google.com/scholar/9220872761342683067,NaN,NaN,NaN,NaN,NaN
48,CC(C)CNC(=O)\C=C\CC/C=C\C=C\C,Spilanthes,"Purely olefinic alkamides in Heliopsis longipes and Acmella (Spilanthes) oppositifolia Molina-Torres J., Salgado-Garciglia R., Ramirez-Chavez E., Del Rio R.E. Biochemical Systematics and Ecology 1996",https://patents.google.com/?q=CC(C)CNC(&q=Spilanthes&patents=false&scholar,https://patents.google.com/scholar/10596501577281550194,NaN,NaN,NaN,NaN,NaN
49,CC(C)CNC(=O)\C=C\CC/C=C\C=C\C,Heliopsis longipes,"Bioactivity of compounds from Acmella oleracea against Tuta absoluta (Meyrick) (Lepidoptera: Gelechiidae) and selectivity to two non-target species Moreno S.C., Carvalho G.A., Picanço M.C., Morais E.G.F., Pereira R.M. Pest management science 2011",https://patents.google.com/?q=CC(C)CNC(&q=Heliopsis+longipes&patents=false&scholar,NaN,NaN,NaN,NaN,NaN,NaN
