,IK,bio_lowertaxon,query_link,top1_link,ref,extracted_title,extracted_journal,extracted_year,extracted_firstauthor_year
0,JQQBXPCJFAKSPG-SVYIMCMUSA-N,Penicillium paxilli,https://patents.google.com/?q=JQQBXPCJFAKSPG-SVYIMCMUSA-N&q=TI%3dPenicillium+paxilli&patents=false&scholar,NaN,NaN,NaN,NaN,NaN,NaN
1,DTGKSKDOIYIVQL-UHFFFAOYSA-N,Elsholtzia ciliata,https://patents.google.com/?q=DTGKSKDOIYIVQL-UHFFFAOYSA-N&q=TI%3dElsholtzia+ciliata&patents=false&scholar,https://patents.google.com/scholar/12175342629877146526?q=PFEUJUXMHXWDQS-MHSWQEBQSA-N&patents=false&scholar&oq=PFEUJUXMHXWDQS-MHSWQEBQSA-N,https://www.tandfonline.com/doi/abs/10.1080/10412905.2018.1545706,Essential oil composition of leaves and inflorescences of Elsholtzia densa Benth. from western Himalaya,Journal of Essential Oil Research,2019,"Chauhan et al., 2019"
2,IUCHKMAZAWJNBJ-RCYXVVTDSA-N,Callerya cinerea,https://patents.google.com/?q=IUCHKMAZAWJNBJ-RCYXVVTDSA-N&q=TI%3dCallerya+cinerea&patents=false&scholar,NaN,NaN,NaN,NaN,NaN,NaN
3,CVGWYDBQFQBYKB-VNVUOZPZSA-N,Euphorbia nivulia,https://patents.google.com/?q=CVGWYDBQFQBYKB-VNVUOZPZSA-N&q=TI%3dEuphorbia+nivulia&patents=false&scholar,NaN,NaN,NaN,NaN,NaN,NaN
4,XFZJEEAOWLFHDH-VUGKQVTMSA-N,Chaenomeles sinensis,https://patents.google.com/?q=XFZJEEAOWLFHDH-VUGKQVTMSA-N&q=TI%3dChaenomeles+sinensis&patents=false&scholar,https://patents.google.com/scholar/18320103863327550612?q=PFEUJUXMHXWDQS-MHSWQEBQSA-N&patents=false&scholar&oq=PFEUJUXMHXWDQS-MHSWQEBQSA-N,http://sourcedb.ib.cas.cn/cn/ibthesis/201310/P020131028339778024593.pdf,Polyphenols and triterpenes from Chaenomeles fruits: Chemical analysis and antioxidant activities assessment,Food chemistry,2013,"Du et al., 2013"
5,BBLGCDSLCDDALX-LKGBESRRSA-N,Streptomyces,https://patents.google.com/?q=BBLGCDSLCDDALX-LKGBESRRSA-N&q=TI%3dStreptomyces&patents=false&scholar,https://patents.google.com/scholar/12435268252085283140?q=PFEUJUXMHXWDQS-MHSWQEBQSA-N&patents=false&scholar&oq=PFEUJUXMHXWDQS-MHSWQEBQSA-N,https://pubag.nal.usda.gov/?page=20641&per_page=100&search_field=all_fields,Marine Streptomyces as a novel source of bioactive substances,World Journal of Microbiology and Biotechnology,2010,"Dharmaraj, 2010"
6,PLWGJLHNBNMJOH-PABCKOPISA-N,Ferula kuhistanica,https://patents.google.com/?q=PLWGJLHNBNMJOH-PABCKOPISA-N&q=TI%3dFerula+kuhistanica&patents=false&scholar,https://patents.google.com/scholar/16802501631155954276?q=PFEUJUXMHXWDQS-MHSWQEBQSA-N&patents=false&scholar&oq=PFEUJUXMHXWDQS-MHSWQEBQSA-N,https://www.researchgate.net/profile/Bakhtiyor_Rasulev/publication/5810058_Molecular_modeling_and_QSAR_analysis_of_the_estrogenic_activity_of_terpenoids_isolated_from_Ferula_plants/links/09e4150fc60586d22b000000.pdf,Molecular modelling and QSAR analysis of the estrogenic activity of terpenoids isolated from Ferula plants,SAR and QSAR in Environmental Research,2007,"Rasulev et al., 2007"
7,LNTHITQWFMADLM-UHFFFAOYSA-N,Phormia regina,https://patents.google.com/?q=LNTHITQWFMADLM-UHFFFAOYSA-N&q=TI%3dPhormia+regina&patents=false&scholar,NaN,NaN,NaN,NaN,NaN,NaN
8,DPTZOOXIEWHODB-XLDMSTKGSA-N,Isoberlinia angolensis,https://patents.google.com/?q=DPTZOOXIEWHODB-XLDMSTKGSA-N&q=TI%3dIsoberlinia+angolensis&patents=false&scholar,NaN,NaN,NaN,NaN,NaN,NaN
9,WLXLLQQGGGHOMA-UHFFFAOYSA-N,Euphorbia pithyusa,https://patents.google.com/?q=WLXLLQQGGGHOMA-UHFFFAOYSA-N&q=TI%3dEuphorbia+pithyusa&patents=false&scholar,NaN,NaN,NaN,NaN,NaN,NaN
10,PFEUJUXMHXWDQS-MHSWQEBQSA-N,Eurycoma longifolia,https://patents.google.com/?q=PFEUJUXMHXWDQS-MHSWQEBQSA-N&q=TI%3dEurycoma+longifolia&patents=false&scholar,https://patents.google.com/scholar/2775812499262969859?q=PFEUJUXMHXWDQS-MHSWQEBQSA-N&patents=false&scholar&oq=PFEUJUXMHXWDQS-MHSWQEBQSA-N,https://pubs.acs.org/doi/full/10.1021/np400701k,NF-κB inhibitors from Eurycoma longifolia,Journal of natural products,2014,"Tran et al., 2014"
