%!PS-Adobe-3.0
%%Creator: (MATLAB, The Mathworks, Inc. Version 9.8.0.1323502 \(R2020a\). Operating System: Windows 10)
%%Title: C:/MRIDATA/for_ts_s1_s6_dicom_nii_clean/s2/Copy_of_nii_RL_orig/spm_2022May05.ps
%%CreationDate: 2022-05-05T16:48:10
%%Pages: (atend)
%%BoundingBox:    71    63   665   694
%%LanguageLevel: 2
%%EndComments
%%BeginDefaults
%%EndDefaults
%%BeginProlog
%%EndProlog
%%BeginSetup
%%BeginResource: procset (Apache XML Graphics Std ProcSet) 1.2 0
%%Version: 1.2 0
%%Copyright: (Copyright 2001-2003,2010 The Apache Software Foundation. License terms: http://www.apache.org/licenses/LICENSE-2.0)
/bd{bind def}bind def
/ld{load def}bd
/GR/grestore ld
/GS/gsave ld
/RM/rmoveto ld
/C/curveto ld
/t/show ld
/L/lineto ld
/ML/setmiterlimit ld
/CT/concat ld
/f/fill ld
/N/newpath ld
/S/stroke ld
/CC/setcmykcolor ld
/A/ashow ld
/cp/closepath ld
/RC/setrgbcolor ld
/LJ/setlinejoin ld
/GC/setgray ld
/LW/setlinewidth ld
/M/moveto ld
/re {4 2 roll M
1 index 0 rlineto
0 exch rlineto
neg 0 rlineto
cp } bd
/_ctm matrix def
/_tm matrix def
/BT { _ctm currentmatrix pop matrix _tm copy pop 0 0 moveto } bd
/ET { _ctm setmatrix } bd
/iTm { _ctm setmatrix _tm concat } bd
/Tm { _tm astore pop iTm 0 0 moveto } bd
/ux 0.0 def
/uy 0.0 def
/F {
  /Tp exch def
  /Tf exch def
  Tf findfont Tp scalefont setfont
  /cf Tf def  /cs Tp def
} bd
/ULS {currentpoint /uy exch def /ux exch def} bd
/ULE {
  /Tcx currentpoint pop def
  gsave
  newpath
  cf findfont cs scalefont dup
  /FontMatrix get 0 get /Ts exch def /FontInfo get dup
  /UnderlinePosition get Ts mul /To exch def
  /UnderlineThickness get Ts mul /Tt exch def
  ux uy To add moveto  Tcx uy To add lineto
  Tt setlinewidth stroke
  grestore
} bd
/OLE {
  /Tcx currentpoint pop def
  gsave
  newpath
  cf findfont cs scalefont dup
  /FontMatrix get 0 get /Ts exch def /FontInfo get dup
  /UnderlinePosition get Ts mul /To exch def
  /UnderlineThickness get Ts mul /Tt exch def
  ux uy To add cs add moveto Tcx uy To add cs add lineto
  Tt setlinewidth stroke
  grestore
} bd
/SOE {
  /Tcx currentpoint pop def
  gsave
  newpath
  cf findfont cs scalefont dup
  /FontMatrix get 0 get /Ts exch def /FontInfo get dup
  /UnderlinePosition get Ts mul /To exch def
  /UnderlineThickness get Ts mul /Tt exch def
  ux uy To add cs 10 mul 26 idiv add moveto Tcx uy To add cs 10 mul 26 idiv add lineto
  Tt setlinewidth stroke
  grestore
} bd
/QT {
/Y22 exch store
/X22 exch store
/Y21 exch store
/X21 exch store
currentpoint
/Y21 load 2 mul add 3 div exch
/X21 load 2 mul add 3 div exch
/X21 load 2 mul /X22 load add 3 div
/Y21 load 2 mul /Y22 load add 3 div
/X22 load /Y22 load curveto
} bd
/SSPD {
dup length /d exch dict def
{
/v exch def
/k exch def
currentpagedevice k known {
/cpdv currentpagedevice k get def
v cpdv ne {
/upd false def
/nullv v type /nulltype eq def
/nullcpdv cpdv type /nulltype eq def
nullv nullcpdv or
{
/upd true def
} {
/sametype v type cpdv type eq def
sametype {
v type /arraytype eq {
/vlen v length def
/cpdvlen cpdv length def
vlen cpdvlen eq {
0 1 vlen 1 sub {
/i exch def
/obj v i get def
/cpdobj cpdv i get def
obj cpdobj ne {
/upd true def
exit
} if
} for
} {
/upd true def
} ifelse
} {
v type /dicttype eq {
v {
/dv exch def
/dk exch def
/cpddv cpdv dk get def
dv cpddv ne {
/upd true def
exit
} if
} forall
} {
/upd true def
} ifelse
} ifelse
} if
} ifelse
upd true eq {
d k v put
} if
} if
} if
} forall
d length 0 gt {
d setpagedevice
} if
} bd
/RE { % /NewFontName [NewEncodingArray] /FontName RE -
  findfont dup length dict begin
  {
    1 index /FID ne
    {def} {pop pop} ifelse
  } forall
  /Encoding exch def
  /FontName 1 index def
  currentdict definefont pop
  end
} bind def
%%EndResource
%%BeginResource: procset (Apache XML Graphics EPS ProcSet) 1.0 0
%%Version: 1.0 0
%%Copyright: (Copyright 2002-2003 The Apache Software Foundation. License terms: http://www.apache.org/licenses/LICENSE-2.0)
/BeginEPSF { %def
/b4_Inc_state save def         % Save state for cleanup
/dict_count countdictstack def % Count objects on dict stack
/op_count count 1 sub def      % Count objects on operand stack
userdict begin                 % Push userdict on dict stack
/showpage { } def              % Redefine showpage, { } = null proc
0 setgray 0 setlinecap         % Prepare graphics state
1 setlinewidth 0 setlinejoin
10 setmiterlimit [ ] 0 setdash newpath
/languagelevel where           % If level not equal to 1 then
{pop languagelevel             % set strokeadjust and
1 ne                           % overprint to their defaults.
{false setstrokeadjust false setoverprint
} if
} if
} bd
/EndEPSF { %def
count op_count sub {pop} repeat            % Clean up stacks
countdictstack dict_count sub {end} repeat
b4_Inc_state restore
} bd
%%EndResource
%FOPBeginFontDict
%%IncludeResource: font Courier-Oblique
%%IncludeResource: font Courier-BoldOblique
%%IncludeResource: font Courier-Bold
%%IncludeResource: font ZapfDingbats
%%IncludeResource: font Symbol
%%IncludeResource: font Helvetica
%%IncludeResource: font Helvetica-Oblique
%%IncludeResource: font Helvetica-Bold
%%IncludeResource: font Helvetica-BoldOblique
%%IncludeResource: font Times-Roman
%%IncludeResource: font Times-Italic
%%IncludeResource: font Times-Bold
%%IncludeResource: font Times-BoldItalic
%%IncludeResource: font Courier
%FOPEndFontDict
%%BeginResource: encoding WinAnsiEncoding
/WinAnsiEncoding [
/.notdef /.notdef /.notdef /.notdef /.notdef
/.notdef /.notdef /.notdef /.notdef /.notdef
/.notdef /.notdef /.notdef /.notdef /.notdef
/.notdef /.notdef /.notdef /.notdef /.notdef
/.notdef /.notdef /.notdef /.notdef /.notdef
/.notdef /.notdef /.notdef /.notdef /.notdef
/.notdef /.notdef /space /exclam /quotedbl
/numbersign /dollar /percent /ampersand /quotesingle
/parenleft /parenright /asterisk /plus /comma
/hyphen /period /slash /zero /one
/two /three /four /five /six
/seven /eight /nine /colon /semicolon
/less /equal /greater /question /at
/A /B /C /D /E
/F /G /H /I /J
/K /L /M /N /O
/P /Q /R /S /T
/U /V /W /X /Y
/Z /bracketleft /backslash /bracketright /asciicircum
/underscore /quoteleft /a /b /c
/d /e /f /g /h
/i /j /k /l /m
/n /o /p /q /r
/s /t /u /v /w
/x /y /z /braceleft /bar
/braceright /asciitilde /bullet /Euro /bullet
/quotesinglbase /florin /quotedblbase /ellipsis /dagger
/daggerdbl /circumflex /perthousand /Scaron /guilsinglleft
/OE /bullet /Zcaron /bullet /bullet
/quoteleft /quoteright /quotedblleft /quotedblright /bullet
/endash /emdash /asciitilde /trademark /scaron
/guilsinglright /oe /bullet /zcaron /Ydieresis
/space /exclamdown /cent /sterling /currency
/yen /brokenbar /section /dieresis /copyright
/ordfeminine /guillemotleft /logicalnot /sfthyphen /registered
/macron /degree /plusminus /twosuperior /threesuperior
/acute /mu /paragraph /middot /cedilla
/onesuperior /ordmasculine /guillemotright /onequarter /onehalf
/threequarters /questiondown /Agrave /Aacute /Acircumflex
/Atilde /Adieresis /Aring /AE /Ccedilla
/Egrave /Eacute /Ecircumflex /Edieresis /Igrave
/Iacute /Icircumflex /Idieresis /Eth /Ntilde
/Ograve /Oacute /Ocircumflex /Otilde /Odieresis
/multiply /Oslash /Ugrave /Uacute /Ucircumflex
/Udieresis /Yacute /Thorn /germandbls /agrave
/aacute /acircumflex /atilde /adieresis /aring
/ae /ccedilla /egrave /eacute /ecircumflex
/edieresis /igrave /iacute /icircumflex /idieresis
/eth /ntilde /ograve /oacute /ocircumflex
/otilde /odieresis /divide /oslash /ugrave
/uacute /ucircumflex /udieresis /yacute /thorn
/ydieresis
] def
%%EndResource
%FOPBeginFontReencode
/Courier-Oblique findfont
dup length dict begin
  {1 index /FID ne {def} {pop pop} ifelse} forall
  /Encoding WinAnsiEncoding def
  currentdict
end
/Courier-Oblique exch definefont pop
/Courier-BoldOblique findfont
dup length dict begin
  {1 index /FID ne {def} {pop pop} ifelse} forall
  /Encoding WinAnsiEncoding def
  currentdict
end
/Courier-BoldOblique exch definefont pop
/Courier-Bold findfont
dup length dict begin
  {1 index /FID ne {def} {pop pop} ifelse} forall
  /Encoding WinAnsiEncoding def
  currentdict
end
/Courier-Bold exch definefont pop
/Helvetica findfont
dup length dict begin
  {1 index /FID ne {def} {pop pop} ifelse} forall
  /Encoding WinAnsiEncoding def
  currentdict
end
/Helvetica exch definefont pop
/Helvetica-Oblique findfont
dup length dict begin
  {1 index /FID ne {def} {pop pop} ifelse} forall
  /Encoding WinAnsiEncoding def
  currentdict
end
/Helvetica-Oblique exch definefont pop
/Helvetica-Bold findfont
dup length dict begin
  {1 index /FID ne {def} {pop pop} ifelse} forall
  /Encoding WinAnsiEncoding def
  currentdict
end
/Helvetica-Bold exch definefont pop
/Helvetica-BoldOblique findfont
dup length dict begin
  {1 index /FID ne {def} {pop pop} ifelse} forall
  /Encoding WinAnsiEncoding def
  currentdict
end
/Helvetica-BoldOblique exch definefont pop
/Times-Roman findfont
dup length dict begin
  {1 index /FID ne {def} {pop pop} ifelse} forall
  /Encoding WinAnsiEncoding def
  currentdict
end
/Times-Roman exch definefont pop
/Times-Italic findfont
dup length dict begin
  {1 index /FID ne {def} {pop pop} ifelse} forall
  /Encoding WinAnsiEncoding def
  currentdict
end
/Times-Italic exch definefont pop
/Times-Bold findfont
dup length dict begin
  {1 index /FID ne {def} {pop pop} ifelse} forall
  /Encoding WinAnsiEncoding def
  currentdict
end
/Times-Bold exch definefont pop
/Times-BoldItalic findfont
dup length dict begin
  {1 index /FID ne {def} {pop pop} ifelse} forall
  /Encoding WinAnsiEncoding def
  currentdict
end
/Times-BoldItalic exch definefont pop
/Courier findfont
dup length dict begin
  {1 index /FID ne {def} {pop pop} ifelse} forall
  /Encoding WinAnsiEncoding def
  currentdict
end
/Courier exch definefont pop
%FOPEndFontReencode
%%EndSetup
%%Page: 1 1
%%PageBoundingBox: 0 0 595 842
%%BeginPageSetup
<<
/PageSize [595 842]
/ImagingBBox null
>> setpagedevice
[1 0 0 -1 0 842] CT
%%EndPageSetup
GS
[0.3749 0 0 0.37484 43.217 55.33821] CT
N
0 0 M
1356 0 L
1356 1954 L
0 1954 L
0 0 L
cp
clip
1 GC
N
0 0 1356 1954 re
f
GR
GS
[0.3749 0 0 0.37484 43.217 55.33821] CT
1 GC
N
0 0 1356 1954 re
f
GR
GS
[0.3749 0 0 0.37484 297.39992 163.66796] CT
/Helvetica-Bold 42.667 F
GS
[1 0 0 1 0 0] CT
-155 -10 moveto 
1 -1 scale
(Image realignment) t 
GR
GR
GS
[0.3749 0 0 0.37484 134.84273 179.82372] CT
/Helvetica 26.667 F
GS
[1 0 0 1 0 0] CT
0 9.5 moveto 
1 -1 scale
(1   C:\\MRIDATA\\for_ts_s1_s6_dicom_nii_clean\\s2\\Copy_of_nii_RL_orig\\fMoCoSubject2-0007-00001-000001-01.nii,1) t 
GR
GR
GS
[0.3749 0 0 0.37484 134.84273 191.54882] CT
/Helvetica 26.667 F
GS
[1 0 0 1 0 0] CT
0 9.5 moveto 
1 -1 scale
(2   C:\\MRIDATA\\for_ts_s1_s6_dicom_nii_clean\\s2\\Copy_of_nii_RL_orig\\fMoCoSubject2-0007-00002-000002-01.nii,1) t 
GR
GR
GS
[0.3749 0 0 0.37484 134.84273 203.27392] CT
/Helvetica 26.667 F
GS
[1 0 0 1 0 0] CT
0 9.5 moveto 
1 -1 scale
(3   C:\\MRIDATA\\for_ts_s1_s6_dicom_nii_clean\\s2\\Copy_of_nii_RL_orig\\fMoCoSubject2-0007-00003-000003-01.nii,1) t 
GR
GR
GS
[0.3749 0 0 0.37484 134.84273 214.99903] CT
/Helvetica 26.667 F
GS
[1 0 0 1 0 0] CT
0 9.5 moveto 
1 -1 scale
(4   C:\\MRIDATA\\for_ts_s1_s6_dicom_nii_clean\\s2\\Copy_of_nii_RL_orig\\fMoCoSubject2-0007-00004-000004-01.nii,1) t 
GR
GR
GS
[0.3749 0 0 0.37484 134.84273 226.72413] CT
/Helvetica 26.667 F
GS
[1 0 0 1 0 0] CT
0 9.5 moveto 
1 -1 scale
(5   C:\\MRIDATA\\for_ts_s1_s6_dicom_nii_clean\\s2\\Copy_of_nii_RL_orig\\fMoCoSubject2-0007-00005-000005-01.nii,1) t 
GR
GR
GS
[0.3749 0 0 0.37484 134.84273 238.44923] CT
/Helvetica 26.667 F
GS
[1 0 0 1 0 0] CT
0 9.5 moveto 
1 -1 scale
(6   C:\\MRIDATA\\for_ts_s1_s6_dicom_nii_clean\\s2\\Copy_of_nii_RL_orig\\fMoCoSubject2-0007-00006-000006-01.nii,1) t 
GR
GR
GS
[0.3749 0 0 0.37484 134.84273 250.17434] CT
/Helvetica 26.667 F
GS
[1 0 0 1 0 0] CT
0 9.5 moveto 
1 -1 scale
(7   C:\\MRIDATA\\for_ts_s1_s6_dicom_nii_clean\\s2\\Copy_of_nii_RL_orig\\fMoCoSubject2-0007-00007-000007-01.nii,1) t 
GR
GR
GS
[0.3749 0 0 0.37484 134.84273 261.89944] CT
/Helvetica 26.667 F
GS
[1 0 0 1 0 0] CT
0 9.5 moveto 
1 -1 scale
(8   C:\\MRIDATA\\for_ts_s1_s6_dicom_nii_clean\\s2\\Copy_of_nii_RL_orig\\fMoCoSubject2-0007-00008-000008-01.nii,1) t 
GR
GR
GS
[0.3749 0 0 0.37484 134.84273 273.62455] CT
/Helvetica 26.667 F
GS
[1 0 0 1 0 0] CT
0 9.5 moveto 
1 -1 scale
(9   C:\\MRIDATA\\for_ts_s1_s6_dicom_nii_clean\\s2\\Copy_of_nii_RL_orig\\fMoCoSubject2-0007-00009-000009-01.nii,1) t 
GR
GR
GS
[0.3749 0 0 0.37484 134.84273 285.34964] CT
/Helvetica 26.667 F
GS
[1 0 0 1 0 0] CT
0 9.5 moveto 
1 -1 scale
(10  C:\\MRIDATA\\for_ts_s1_s6_dicom_nii_clean\\s2\\Copy_of_nii_RL_orig\\fMoCoSubject2-0007-00010-000010-01.nii,1) t 
GR
GR
GS
[0.3749 0 0 0.37484 134.84273 297.07475] CT
/Helvetica 26.667 F
GS
[1 0 0 1 0 0] CT
0 9.5 moveto 
1 -1 scale
(11  C:\\MRIDATA\\for_ts_s1_s6_dicom_nii_clean\\s2\\Copy_of_nii_RL_orig\\fMoCoSubject2-0007-00011-000011-01.nii,1) t 
GR
GR
GS
[0.3749 0 0 0.37484 134.84273 308.79985] CT
/Helvetica 26.667 F
GS
[1 0 0 1 0 0] CT
0 9.5 moveto 
1 -1 scale
(12  C:\\MRIDATA\\for_ts_s1_s6_dicom_nii_clean\\s2\\Copy_of_nii_RL_orig\\fMoCoSubject2-0007-00012-000012-01.nii,1) t 
GR
GR
GS
[0.3749 0 0 0.37484 134.84273 320.52496] CT
/Helvetica 26.667 F
GS
[1 0 0 1 0 0] CT
0 9.5 moveto 
1 -1 scale
(................ etc) t 
GR
GR
GS
[0.3749 0 0 0.37484 43.217 55.33821] CT
1 GC
N
136 1270 M
1220 1270 L
1220 879 L
136 879 L
cp
f
GR
GS
[0.3749 0 0 0.37484 43.217 55.33821] CT
0.873 GC
1 LJ
1.333 LW
N
136 1270 M
136 879 L
S
GR
GS
[0.3749 0 0 0.37484 43.217 55.33821] CT
0.873 GC
1 LJ
1.333 LW
N
290.857 1270 M
290.857 879 L
S
GR
GS
[0.3749 0 0 0.37484 43.217 55.33821] CT
0.873 GC
1 LJ
1.333 LW
N
445.714 1270 M
445.714 879 L
S
GR
GS
[0.3749 0 0 0.37484 43.217 55.33821] CT
0.873 GC
1 LJ
1.333 LW
N
600.571 1270 M
600.571 879 L
S
GR
GS
[0.3749 0 0 0.37484 43.217 55.33821] CT
0.873 GC
1 LJ
1.333 LW
N
755.429 1270 M
755.429 879 L
S
GR
GS
[0.3749 0 0 0.37484 43.217 55.33821] CT
0.873 GC
1 LJ
1.333 LW
N
910.286 1270 M
910.286 879 L
S
GR
GS
[0.3749 0 0 0.37484 43.217 55.33821] CT
0.873 GC
1 LJ
1.333 LW
N
1065.143 1270 M
1065.143 879 L
S
GR
GS
[0.3749 0 0 0.37484 43.217 55.33821] CT
0.873 GC
1 LJ
1.333 LW
N
1220 1270 M
1220 879 L
S
GR
GS
[0.3749 0 0 0.37484 43.217 55.33821] CT
0.873 GC
1 LJ
1.333 LW
N
1220 1270 M
136 1270 L
S
GR
GS
[0.3749 0 0 0.37484 43.217 55.33821] CT
0.873 GC
1 LJ
1.333 LW
N
1220 1172.25 M
136 1172.25 L
S
GR
GS
[0.3749 0 0 0.37484 43.217 55.33821] CT
0.873 GC
1 LJ
1.333 LW
N
1220 1074.5 M
136 1074.5 L
S
GR
GS
[0.3749 0 0 0.37484 43.217 55.33821] CT
0.873 GC
1 LJ
1.333 LW
N
1220 976.75 M
136 976.75 L
S
GR
GS
[0.3749 0 0 0.37484 43.217 55.33821] CT
0.873 GC
1 LJ
1.333 LW
N
1220 879 M
136 879 L
S
GR
GS
[0.3749 0 0 0.37484 43.217 55.33821] CT
2 setlinecap
1 LJ
1.333 LW
N
136 1270 M
1220 1270 L
S
GR
GS
[0.3749 0 0 0.37484 43.217 55.33821] CT
2 setlinecap
1 LJ
1.333 LW
N
136 1270 M
136 1259.16 L
S
GR
GS
[0.3749 0 0 0.37484 43.217 55.33821] CT
2 setlinecap
1 LJ
1.333 LW
N
290.857 1270 M
290.857 1259.16 L
S
GR
GS
[0.3749 0 0 0.37484 43.217 55.33821] CT
2 setlinecap
1 LJ
1.333 LW
N
445.714 1270 M
445.714 1259.16 L
S
GR
GS
[0.3749 0 0 0.37484 43.217 55.33821] CT
2 setlinecap
1 LJ
1.333 LW
N
600.571 1270 M
600.571 1259.16 L
S
GR
GS
[0.3749 0 0 0.37484 43.217 55.33821] CT
2 setlinecap
1 LJ
1.333 LW
N
755.429 1270 M
755.429 1259.16 L
S
GR
GS
[0.3749 0 0 0.37484 43.217 55.33821] CT
2 setlinecap
1 LJ
1.333 LW
N
910.286 1270 M
910.286 1259.16 L
S
GR
GS
[0.3749 0 0 0.37484 43.217 55.33821] CT
2 setlinecap
1 LJ
1.333 LW
N
1065.143 1270 M
1065.143 1259.16 L
S
GR
GS
[0.3749 0 0 0.37484 43.217 55.33821] CT
2 setlinecap
1 LJ
1.333 LW
N
1220 1270 M
1220 1259.16 L
S
GR
GS
[0.3749 0 0 0.37484 94.2035 534.78796] CT
/Helvetica 25.333 F
GS
[1 0 0 1 0 0] CT
-6 24 moveto 
1 -1 scale
(0) t 
GR
GR
GS
[0.3749 0 0 0.37484 152.25955 534.78796] CT
/Helvetica 25.333 F
GS
[1 0 0 1 0 0] CT
-17.5 24 moveto 
1 -1 scale
(100) t 
GR
GR
GS
[0.3749 0 0 0.37484 210.3156 534.78796] CT
/Helvetica 25.333 F
GS
[1 0 0 1 0 0] CT
-17.5 24 moveto 
1 -1 scale
(200) t 
GR
GR
GS
[0.3749 0 0 0.37484 268.37163 534.78796] CT
/Helvetica 25.333 F
GS
[1 0 0 1 0 0] CT
-17.5 24 moveto 
1 -1 scale
(300) t 
GR
GR
GS
[0.3749 0 0 0.37484 326.4277 534.78796] CT
/Helvetica 25.333 F
GS
[1 0 0 1 0 0] CT
-17.5 24 moveto 
1 -1 scale
(400) t 
GR
GR
GS
[0.3749 0 0 0.37484 384.48374 534.78796] CT
/Helvetica 25.333 F
GS
[1 0 0 1 0 0] CT
-17.5 24 moveto 
1 -1 scale
(500) t 
GR
GR
GS
[0.3749 0 0 0.37484 442.53977 534.78796] CT
/Helvetica 25.333 F
GS
[1 0 0 1 0 0] CT
-17.5 24 moveto 
1 -1 scale
(600) t 
GR
GR
GS
[0.3749 0 0 0.37484 500.59584 534.78796] CT
/Helvetica 25.333 F
GS
[1 0 0 1 0 0] CT
-17.5 24 moveto 
1 -1 scale
(700) t 
GR
GR
GS
[0.3749 0 0 0.37484 297.39987 546.78295] CT
/Helvetica 27.867 F
GS
[1 0 0 1 0 0] CT
-31.5 27 moveto 
1 -1 scale
(image) t 
GR
GR
GS
[0.3749 0 0 0.37484 43.217 55.33821] CT
2 setlinecap
1 LJ
1.333 LW
N
136 1270 M
136 879 L
S
GR
GS
[0.3749 0 0 0.37484 43.217 55.33821] CT
2 setlinecap
1 LJ
1.333 LW
N
136 1270 M
146.84 1270 L
S
GR
GS
[0.3749 0 0 0.37484 43.217 55.33821] CT
2 setlinecap
1 LJ
1.333 LW
N
136 1172.25 M
146.84 1172.25 L
S
GR
GS
[0.3749 0 0 0.37484 43.217 55.33821] CT
2 setlinecap
1 LJ
1.333 LW
N
136 1074.5 M
146.84 1074.5 L
S
GR
GS
[0.3749 0 0 0.37484 43.217 55.33821] CT
2 setlinecap
1 LJ
1.333 LW
N
136 976.75 M
146.84 976.75 L
S
GR
GS
[0.3749 0 0 0.37484 43.217 55.33821] CT
2 setlinecap
1 LJ
1.333 LW
N
136 879 M
146.84 879 L
S
GR
GS
[0.3749 0 0 0.37484 90.8044 531.38938] CT
/Helvetica 25.333 F
GS
[1 0 0 1 0 0] CT
-19 9 moveto 
1 -1 scale
(-3) t 
GR
GR
GS
[0.3749 0 0 0.37484 90.8044 494.74844] CT
/Helvetica 25.333 F
GS
[1 0 0 1 0 0] CT
-19 9 moveto 
1 -1 scale
(-2) t 
GR
GR
GS
[0.3749 0 0 0.37484 90.8044 458.10749] CT
/Helvetica 25.333 F
GS
[1 0 0 1 0 0] CT
-19 9 moveto 
1 -1 scale
(-1) t 
GR
GR
GS
[0.3749 0 0 0.37484 90.8044 421.46654] CT
/Helvetica 25.333 F
GS
[1 0 0 1 0 0] CT
-12 9 moveto 
1 -1 scale
(0) t 
GR
GR
GS
[0.3749 0 0 0.37484 90.8044 384.8256] CT
/Helvetica 25.333 F
GS
[1 0 0 1 0 0] CT
-12 9 moveto 
1 -1 scale
(1) t 
GR
GR
GS
[0 -0.37484 0.3749 0 81.18195 458.1074] CT
/Helvetica 27.867 F
GS
[1 0 0 1 0 0] CT
-19.5 -6 moveto 
1 -1 scale
(mm) t 
GR
GR
GS
[0.3749 0 0 0.37484 297.39992 383.32622] CT
/Helvetica-Bold 42.667 F
GS
[1 0 0 1 0 0] CT
-89.5 -10 moveto 
1 -1 scale
(translation) t 
GR
GR
GS
[0.3749 0 0 0.37484 43.217 55.33821] CT
0 0 1 RC
1 LJ
1.333 LW
N
137.549 976.75 M
139.097 976.914 L
140.646 976.256 L
142.194 976.163 L
143.743 976.809 L
145.291 976.946 L
146.84 978.95 L
148.389 978.144 L
149.937 979.406 L
151.486 980.17 L
153.034 980.252 L
154.583 980.619 L
156.131 981.326 L
157.68 980.62 L
159.229 981.628 L
160.777 981.975 L
162.326 978.927 L
163.874 978.822 L
165.423 979.509 L
166.971 979.824 L
168.52 980.299 L
170.069 979.945 L
171.617 979.175 L
173.166 979.829 L
174.714 979.234 L
176.263 978.055 L
177.811 977.108 L
179.36 977.332 L
180.909 976.589 L
182.457 976.986 L
184.006 976.014 L
185.554 976.123 L
187.103 976.464 L
188.651 976.373 L
190.2 974.431 L
191.749 991.612 L
193.297 1055.294 L
194.846 1081.266 L
196.394 1083.324 L
197.943 1082.794 L
199.491 1081.36 L
201.04 1081.443 L
202.589 1080.457 L
204.137 1079.147 L
205.686 1079.576 L
207.234 1075.183 L
208.783 1075.458 L
210.331 1074.956 L
211.88 1048.849 L
213.429 993.963 L
214.977 921.069 L
216.526 928.662 L
218.074 933.955 L
219.623 937.294 L
221.171 936.183 L
222.72 937.756 L
224.269 937.049 L
225.817 938.088 L
227.366 937.755 L
228.914 935.754 L
230.463 934.342 L
232.011 933.714 L
233.56 972.506 L
235.109 1120.474 L
236.657 1224.933 L
238.206 1205.665 L
239.754 1193.878 L
241.303 1188.715 L
242.851 1187.053 L
244.4 1185.495 L
245.949 1184.772 L
247.497 1183.553 L
249.046 1182.194 L
250.594 1182.517 L
252.143 1180.417 L
253.691 1174.591 L
255.24 1102.273 L
256.789 986.563 L
258.337 959.885 L
259.886 959.629 L
261.434 959.876 L
262.983 959.153 L
264.531 960.914 L
266.08 961.85 L
267.629 962.379 L
269.177 961.417 L
270.726 960.382 L
272.274 958.918 L
273.823 958.65 L
275.371 959.159 L
276.92 1009.808 L
278.469 1184.519 L
280.017 1200.638 L
281.566 1180.881 L
283.114 1170.348 L
284.663 1166.514 L
286.211 1166.869 L
287.76 1165.605 L
289.309 1161.016 L
290.857 1157.911 L
292.406 1158.726 L
293.954 1158.449 L
295.503 1150.298 L
297.051 1085.758 L
298.6 985.549 L
300.149 943.586 L
301.697 940.239 L
303.246 937.37 L
304.794 937.821 L
306.343 936.524 L
307.891 936.186 L
309.44 935.875 L
310.989 936.243 L
312.537 937.097 L
314.086 935.616 L
315.634 933.136 L
317.183 940.853 L
318.731 1001.578 L
320.28 1030.151 L
321.829 956.498 L
323.377 954.597 L
324.926 954.292 L
326.474 951.714 L
328.023 949.597 L
329.571 949.828 L
331.12 947.703 L
332.669 947.676 L
334.217 947.847 L
335.766 948.307 L
337.314 945.973 L
338.863 954.363 L
340.411 1043.369 L
341.96 1031.599 L
343.509 927.475 L
345.057 923.595 L
346.606 922.679 L
348.154 922.341 L
349.703 921.674 L
351.251 920.5 L
352.8 919.638 L
354.349 921.289 L
355.897 922.753 L
357.446 922.827 L
358.994 923.834 L
360.543 925.3 L
362.091 965.863 L
363.64 1048.773 L
365.189 882.563 L
366.737 893.711 L
368.286 901.282 L
369.834 903.273 L
371.383 905.651 L
372.931 906.811 L
374.48 908.956 L
376.029 909.796 L
377.577 910.683 L
379.126 909.491 L
380.674 909.098 L
382.223 913.63 L
383.771 947.466 L
385.32 1024.873 L
386.869 1011.861 L
388.417 1018.1 L
389.966 1022.684 L
391.514 1026.419 L
393.063 1029.569 L
394.611 1030.585 L
396.16 1030.785 L
397.709 1030.66 L
399.257 1031.1 L
400.806 1029.914 L
402.354 1029.437 L
403.903 1028.843 L
405.451 1007.509 L
407 950.173 L
408.549 941.908 L
410.097 947.081 L
411.646 950.356 L
413.194 950.605 L
414.743 950.903 L
416.291 951.198 L
417.84 951.037 L
419.389 950.802 L
420.937 949.198 L
422.486 949.763 L
424.034 951.758 L
425.583 994.476 L
427.131 1068.21 L
428.68 1080.101 L
430.229 1071.409 L
431.777 1065.944 L
433.326 1059.722 L
434.874 1058.046 L
436.423 1057.6 L
437.971 1056.955 L
439.52 1057.706 L
441.069 1054.606 L
442.617 1052.523 L
444.166 1050.91 L
445.714 1047.84 L
447.263 1015.163 L
448.811 923.119 L
450.36 917.629 L
451.909 925.171 L
453.457 926.768 L
455.006 921.232 L
456.554 923.085 L
458.103 927.364 L
459.651 926.974 L
461.2 938.057 L
462.749 941.85 L
464.297 942.515 L
465.846 946.609 L
467.394 967.822 L
468.943 1037.497 L
470.491 1091.985 L
472.04 1088.377 L
473.589 1091.109 L
475.137 1093.257 L
476.686 1092.345 L
478.234 1091.155 L
479.783 1089.937 L
481.331 1085.325 L
482.88 1087.647 L
484.429 1084.895 L
485.977 1084.397 L
487.526 1083.431 L
489.074 1046.13 L
490.623 947.78 L
492.171 942.013 L
493.72 947.198 L
495.269 949.626 L
496.817 949.53 L
498.366 948.872 L
499.914 950.647 L
501.463 949.61 L
503.011 948.627 L
504.56 950.861 L
506.109 949.023 L
507.657 949.05 L
509.206 950.216 L
510.754 975.492 L
512.303 999.505 L
513.851 939.571 L
515.4 948.296 L
516.949 949.577 L
518.497 951.262 L
520.046 951.549 L
521.594 951.289 L
523.143 950.86 L
524.691 951.993 L
526.24 951.034 L
527.789 951.31 L
529.337 952.744 L
530.886 950.518 L
532.434 993.137 L
533.983 1025.586 L
535.531 935.264 L
537.08 938.961 L
538.629 941.227 L
540.177 942.519 L
541.726 942.341 L
543.274 943.815 L
544.823 944.787 L
546.371 946.044 L
547.92 945.874 L
549.469 947.343 L
551.017 946.443 L
552.566 954.54 L
554.114 1053.263 L
555.663 1058.098 L
557.211 951.599 L
558.76 955.631 L
560.309 956.118 L
561.857 955.014 L
563.406 954.038 L
564.954 954.411 L
566.503 955.297 L
568.051 955.017 L
569.6 954.101 L
571.149 954.298 L
572.697 954.337 L
574.246 957.592 L
575.794 990.55 L
577.343 1002.31 L
578.891 972.928 L
580.44 987.353 L
581.989 995.348 L
583.537 999.891 L
585.086 1007.969 L
586.634 1010.465 L
588.183 1013.572 L
589.731 1013.159 L
591.28 1014.496 L
592.829 1014.446 L
594.377 1015.677 L
595.926 1008.187 L
597.474 964.278 L
599.023 938.858 L
600.571 940.028 L
602.12 941.25 L
603.669 941.261 L
605.217 942.24 L
606.766 942.156 L
608.314 942.931 L
609.863 943.547 L
611.411 944.124 L
612.96 945.266 L
614.509 944.365 L
616.057 943.439 L
617.606 947.835 L
619.154 1005.333 L
620.703 1057.77 L
622.251 1038.792 L
623.8 1028.832 L
625.349 1026.173 L
626.897 1026.586 L
628.446 1026.776 L
629.994 1026.167 L
631.543 1025.761 L
633.091 1022.955 L
634.64 1023.979 L
636.189 1021.967 L
637.737 1011.759 L
639.286 973.759 L
640.834 924.673 L
642.383 910.305 L
643.931 911.606 L
645.48 912.447 L
647.029 914.906 L
648.577 916.898 L
650.126 917.252 L
651.674 917.471 L
653.223 918.934 L
654.771 918.691 L
656.32 918.231 L
657.869 919.596 L
659.417 921.234 L
660.966 970.345 L
662.514 1093.609 L
664.063 1089.698 L
665.611 1079.035 L
667.16 1079.095 L
668.709 1079.174 L
670.257 1078.886 L
671.806 1078.685 L
673.354 1079.267 L
674.903 1078.739 L
676.451 1079.209 L
678 1077.766 L
679.549 1074.286 L
681.097 1028.41 L
682.646 953.846 L
684.194 931.607 L
685.743 933.697 L
687.291 935.282 L
688.84 937.844 L
690.389 942.456 L
691.937 942.567 L
693.486 942.515 L
695.034 941.832 L
696.583 942.249 L
698.131 942.513 L
699.68 943.286 L
701.229 944.504 L
702.777 969.111 L
704.326 996.749 L
705.874 929.353 L
707.423 939.052 L
708.971 941.231 L
710.52 943.487 L
712.069 943.474 L
713.617 945.105 L
715.166 945.534 L
716.714 947.524 L
718.263 948.459 L
719.811 946.957 L
721.36 946.74 L
722.909 953.777 L
724.457 1013.214 L
726.006 1008.999 L
727.554 935.001 L
729.103 939.371 L
730.651 942.198 L
732.2 944.32 L
733.749 943.886 L
735.297 945.353 L
736.846 945.271 L
738.394 943.379 L
739.943 943.319 L
741.491 943.537 L
743.04 943.808 L
744.589 952.058 L
746.137 1037.342 L
747.686 1049.306 L
749.234 940.035 L
750.783 944.238 L
752.331 945.769 L
753.88 945.888 L
755.429 945.386 L
756.977 946.206 L
758.526 945.756 L
760.074 946.428 L
761.623 946.206 L
763.171 944.919 L
764.72 946.375 L
766.269 955.791 L
767.817 989.118 L
769.366 989.223 L
770.914 989.804 L
772.463 989.424 L
774.011 988.338 L
775.56 986.86 L
777.109 985.488 L
778.657 983.545 L
780.206 983.234 L
781.754 983.856 L
783.303 982.638 L
784.851 984.449 L
786.4 981.272 L
787.949 970.567 L
789.497 923.694 L
791.046 919.067 L
792.594 921.331 L
794.143 924.35 L
795.691 923.953 L
797.24 926.43 L
798.789 928.546 L
800.337 927.309 L
801.886 927.045 L
803.434 925.885 L
804.983 926.532 L
806.531 926.943 L
808.08 926.94 L
809.629 941.99 L
811.177 990.227 L
812.726 1012.865 L
814.274 1016.097 L
815.823 1014.177 L
817.371 1011.972 L
818.92 1011.114 L
820.469 1012.079 L
822.017 1013.148 L
823.566 1011.949 L
825.114 1009.96 L
826.663 1010.47 L
828.211 1009.807 L
829.76 1002.494 L
831.309 962.021 L
832.857 916.712 L
834.406 914.44 L
835.954 916.002 L
837.503 918.249 L
839.051 919.568 L
840.6 923.133 L
842.149 924.445 L
843.697 924.597 L
845.246 926.031 L
846.794 925.334 L
848.343 924.557 L
849.891 925.268 L
851.44 930.985 L
852.989 995.335 L
854.537 1069.93 L
856.086 1069.398 L
857.634 1068.549 L
859.183 1068.045 L
860.731 1067.272 L
862.28 1061.526 L
863.829 1061.922 L
865.377 1058.903 L
866.926 1057.018 L
868.474 1056.33 L
870.023 1054.804 L
871.571 1053.003 L
873.12 1005.142 L
874.669 917.604 L
876.217 882.287 L
877.766 887.153 L
879.314 890.911 L
880.863 893.706 L
882.411 893.193 L
883.96 894.548 L
885.509 895.903 L
887.057 897.498 L
888.606 897.91 L
890.154 896.889 L
891.703 896.557 L
893.251 899.136 L
894.8 925.574 L
896.349 950.108 L
897.897 889.872 L
899.446 896.019 L
900.994 897.346 L
902.543 900.738 L
904.091 902.532 L
905.64 902.735 L
907.189 903.026 L
908.737 901.872 L
910.286 904.148 L
911.834 904.413 L
913.383 903.228 L
914.931 909.715 L
916.48 960.889 L
918.029 975.53 L
919.577 905.762 L
921.126 908.676 L
922.674 911.102 L
924.223 912.133 L
925.771 912.964 L
927.32 912.017 L
928.869 911.304 L
930.417 911.357 L
931.966 910.942 L
933.514 909.738 L
935.063 909.955 L
936.611 920.169 L
938.16 961.579 L
939.709 1013.853 L
941.257 892.367 L
942.806 898.856 L
944.354 904.583 L
945.903 904.399 L
947.451 905.457 L
949 906.965 L
950.549 907.108 L
952.097 907.881 L
953.646 908.834 L
955.194 909.359 L
956.743 907.452 L
958.291 916.973 L
959.84 954.788 L
961.389 968.322 L
962.937 978.321 L
964.486 984.616 L
966.034 985.511 L
967.583 985.987 L
969.131 985.42 L
970.68 982.345 L
972.229 985.105 L
973.777 984.815 L
975.326 984.722 L
976.874 984.197 L
978.423 984.232 L
979.971 977.884 L
981.52 939.414 L
983.069 901.452 L
984.617 902.155 L
986.166 904.308 L
987.714 905.168 L
989.263 907.435 L
990.811 909.484 L
992.36 913.401 L
993.909 913.059 L
995.457 912.036 L
997.006 912.388 L
998.554 911.777 L
1000.103 912.261 L
1001.651 923.959 L
1003.2 990.79 L
1004.749 1044.8 L
1006.297 1050.707 L
1007.846 1055.508 L
1009.394 1052.694 L
1010.943 1049.905 L
1012.491 1047.769 L
1014.04 1046.694 L
1015.589 1045.245 L
1017.137 1044.204 L
1018.686 1041.075 L
1020.234 1041.784 L
1021.783 1027.409 L
1023.331 979.372 L
1024.88 925.443 L
1026.429 918.597 L
1027.977 915.165 L
1029.526 915.982 L
1031.074 915.309 L
1032.623 916.441 L
1034.171 917.947 L
1035.72 917.199 L
1037.269 917.324 L
1038.817 917.485 L
1040.366 918.82 L
1041.914 917.476 L
1043.463 922.53 L
1045.011 972.953 L
1046.56 1082.257 L
1048.109 1101.236 L
1049.657 1096.957 L
1051.206 1091.306 L
1052.754 1086.723 L
1054.303 1085.467 L
1055.851 1086.231 L
1057.4 1084.752 L
1058.949 1083.313 L
1060.497 1082.924 L
1062.046 1082.443 L
1063.594 1077.695 L
1065.143 1027.598 L
1066.691 934.719 L
1068.24 912.414 L
1069.789 913.361 L
1071.337 915.14 L
1072.886 916.835 L
1074.434 915.238 L
1075.983 915.371 L
1077.531 913.816 L
1079.08 914.875 L
1080.629 916.19 L
1082.177 914.74 L
1083.726 914.359 L
1085.274 914.063 L
1086.823 941.222 L
1088.371 963.391 L
1089.92 912.481 L
1091.469 914.491 L
1093.017 914.608 L
1094.566 914.18 L
1096.114 915.866 L
1097.663 916.45 L
1099.211 916.636 L
1100.76 915.98 L
1102.309 914.878 L
1103.857 915.423 L
1105.406 914.756 L
1106.954 915.792 L
1108.503 933.689 L
1110.051 984.95 L
1111.6 905.311 L
1113.149 908.193 L
1114.697 909.268 L
1116.246 905.18 L
1117.794 907.432 L
1119.343 911.355 L
1120.891 907.236 L
1122.44 908.024 L
1123.989 909.182 L
1125.537 908.547 L
1127.086 909.148 L
1128.634 910.758 L
1130.183 961.22 L
1131.731 1004.698 L
1133.28 888.637 L
1134.829 897.712 L
S
GR
GS
[0.3749 0 0 0.37484 43.217 55.33821] CT
0 0.502 0 RC
1 LJ
1.333 LW
N
137.549 976.75 M
139.097 976.993 L
140.646 975.379 L
142.194 978.919 L
143.743 975.173 L
145.291 976.845 L
146.84 974.662 L
148.389 976.76 L
149.937 976.054 L
151.486 974.203 L
153.034 972.09 L
154.583 972.984 L
156.131 974.309 L
157.68 976.715 L
159.229 975.823 L
160.777 981.122 L
162.326 971.924 L
163.874 971.259 L
165.423 970.677 L
166.971 976.374 L
168.52 974.483 L
170.069 972.531 L
171.617 970.534 L
173.166 971.773 L
174.714 974.761 L
176.263 973.843 L
177.811 971.06 L
179.36 971.213 L
180.909 973.215 L
182.457 976.777 L
184.006 973.025 L
185.554 972.349 L
187.103 971.258 L
188.651 974.241 L
190.2 972.828 L
191.749 973.198 L
193.297 966.843 L
194.846 964.179 L
196.394 964.277 L
197.943 965.601 L
199.491 968.953 L
201.04 966.779 L
202.589 966.878 L
204.137 967.579 L
205.686 968.402 L
207.234 970.362 L
208.783 967.606 L
210.331 968.567 L
211.88 966.648 L
213.429 965.862 L
214.977 967.939 L
216.526 968.275 L
218.074 968.088 L
219.623 968.008 L
221.171 969.956 L
222.72 969.482 L
224.269 967.786 L
225.817 966.834 L
227.366 968.968 L
228.914 970.068 L
230.463 970.761 L
232.011 969.156 L
233.56 964.188 L
235.109 971.106 L
236.657 983.601 L
238.206 984.902 L
239.754 980.592 L
241.303 980.879 L
242.851 978.574 L
244.4 979.846 L
245.949 980.258 L
247.497 978.889 L
249.046 975.818 L
250.594 974.114 L
252.143 976.064 L
253.691 975.79 L
255.24 974.099 L
256.789 970.645 L
258.337 971.199 L
259.886 973.291 L
261.434 974.997 L
262.983 975.325 L
264.531 971.396 L
266.08 972.542 L
267.629 970.008 L
269.177 973.625 L
270.726 970.346 L
272.274 970.325 L
273.823 967.36 L
275.371 970.739 L
276.92 969.015 L
278.469 982.705 L
280.017 987.674 L
281.566 983.411 L
283.114 989.694 L
284.663 997.742 L
286.211 993.469 L
287.76 989.25 L
289.309 990.305 L
290.857 989.749 L
292.406 989.1 L
293.954 982.903 L
295.503 985.896 L
297.051 983.591 L
298.6 977.328 L
300.149 979.065 L
301.697 980.719 L
303.246 978.527 L
304.794 976.201 L
306.343 976.896 L
307.891 977.867 L
309.44 977.656 L
310.989 977.81 L
312.537 974.71 L
314.086 978.458 L
315.634 979.035 L
317.183 978.745 L
318.731 975.216 L
320.28 972.505 L
321.829 972.977 L
323.377 975.76 L
324.926 977.753 L
326.474 978.138 L
328.023 974.091 L
329.571 977.152 L
331.12 977.529 L
332.669 977.045 L
334.217 975.013 L
335.766 973.76 L
337.314 976.392 L
338.863 975.458 L
340.411 977.579 L
341.96 973.832 L
343.509 973.589 L
345.057 973.845 L
346.606 975.201 L
348.154 977.369 L
349.703 978.325 L
351.251 975.622 L
352.8 976.696 L
354.349 976.807 L
355.897 977.341 L
357.446 974.798 L
358.994 975.094 L
360.543 974.831 L
362.091 974.754 L
363.64 975.665 L
365.189 975.715 L
366.737 974.474 L
368.286 976.483 L
369.834 977.407 L
371.383 977.152 L
372.931 974.312 L
374.48 974.029 L
376.029 974.543 L
377.577 979.665 L
379.126 977.581 L
380.674 975.404 L
382.223 975.568 L
383.771 977.26 L
385.32 977.934 L
386.869 977.033 L
388.417 976.686 L
389.966 974.577 L
391.514 974.573 L
393.063 974.316 L
394.611 977.415 L
396.16 975.725 L
397.709 973.135 L
399.257 975.026 L
400.806 974.84 L
402.354 976.673 L
403.903 974.751 L
405.451 975.528 L
407 970.68 L
408.549 970.495 L
410.097 976.946 L
411.646 974.304 L
413.194 975.2 L
414.743 971.73 L
416.291 975.572 L
417.84 974.758 L
419.389 975.745 L
420.937 974.495 L
422.486 973.624 L
424.034 974.683 L
425.583 975.071 L
427.131 977.412 L
428.68 976.334 L
430.229 975.218 L
431.777 975.505 L
433.326 981.174 L
434.874 976.159 L
436.423 972.96 L
437.971 972.813 L
439.52 973.352 L
441.069 974.859 L
442.617 979.043 L
444.166 975.776 L
445.714 974.075 L
447.263 975.532 L
448.811 969.365 L
450.36 972.353 L
451.909 975.753 L
453.457 980.488 L
455.006 975.516 L
456.554 972.524 L
458.103 969.64 L
459.651 970.139 L
461.2 969.116 L
462.749 971.638 L
464.297 969.842 L
465.846 971.327 L
467.394 968.888 L
468.943 974.792 L
470.491 976.903 L
472.04 977.78 L
473.589 976.76 L
475.137 974.986 L
476.686 980.989 L
478.234 982.537 L
479.783 979.263 L
481.331 976.044 L
482.88 977.368 L
484.429 977.656 L
485.977 976.557 L
487.526 977.21 L
489.074 974.545 L
490.623 970.596 L
492.171 975.381 L
493.72 975.773 L
495.269 974.175 L
496.817 971.181 L
498.366 970.318 L
499.914 974.958 L
501.463 971.621 L
503.011 970.297 L
504.56 971.013 L
506.109 971.782 L
507.657 973.981 L
509.206 973.036 L
510.754 974.35 L
512.303 973.79 L
513.851 972.75 L
515.4 977.444 L
516.949 974.891 L
518.497 974.063 L
520.046 973.699 L
521.594 973.336 L
523.143 975.98 L
524.691 973.069 L
526.24 972.941 L
527.789 971.313 L
529.337 972.572 L
530.886 973.752 L
532.434 972.326 L
533.983 971.665 L
535.531 970.943 L
537.08 971.986 L
538.629 971.682 L
540.177 976.364 L
541.726 976.987 L
543.274 975.046 L
544.823 972.987 L
546.371 972.798 L
547.92 973.596 L
549.469 973.844 L
551.017 973.247 L
552.566 969.996 L
554.114 971.228 L
555.663 970.624 L
557.211 971.414 L
558.76 972.017 L
560.309 970.313 L
561.857 973.472 L
563.406 971.74 L
564.954 974.575 L
566.503 971.994 L
568.051 972.892 L
569.6 972.142 L
571.149 974.122 L
572.697 975.118 L
574.246 972.92 L
575.794 971.831 L
577.343 970.784 L
578.891 972.161 L
580.44 973.454 L
581.989 973.126 L
583.537 972.706 L
585.086 971.023 L
586.634 969.521 L
588.183 973.27 L
589.731 975.371 L
591.28 974.386 L
592.829 973.055 L
594.377 973.725 L
595.926 973.828 L
597.474 975.25 L
599.023 970.444 L
600.571 971.209 L
602.12 970.999 L
603.669 969.459 L
605.217 971.408 L
606.766 970.52 L
608.314 970.721 L
609.863 969.26 L
611.411 968.318 L
612.96 971.336 L
614.509 973.27 L
616.057 972.084 L
617.606 972.698 L
619.154 969.09 L
620.703 969.847 L
622.251 972.512 L
623.8 974.885 L
625.349 972.642 L
626.897 970.515 L
628.446 970.446 L
629.994 972.391 L
631.543 971.451 L
633.091 969.044 L
634.64 969.269 L
636.189 967.768 L
637.737 969.816 L
639.286 967.11 L
640.834 966.396 L
642.383 964.943 L
643.931 967.078 L
645.48 969.748 L
647.029 969.675 L
648.577 970.763 L
650.126 968.962 L
651.674 969.966 L
653.223 971.406 L
654.771 970.575 L
656.32 967.529 L
657.869 968.078 L
659.417 968.238 L
660.966 967.666 L
662.514 969.551 L
664.063 973.108 L
665.611 973.682 L
667.16 973.311 L
668.709 974.454 L
670.257 978.488 L
671.806 978.133 L
673.354 977.235 L
674.903 966.67 L
676.451 970.53 L
678 972.05 L
679.549 972.667 L
681.097 974.982 L
682.646 968.414 L
684.194 966.826 L
685.743 969.154 L
687.291 969.346 L
688.84 972.083 L
690.389 972.624 L
691.937 971.358 L
693.486 970.328 L
695.034 967.629 L
696.583 971.61 L
698.131 970.844 L
699.68 970.709 L
701.229 969.544 L
702.777 969.609 L
704.326 973.781 L
705.874 970.901 L
707.423 973.506 L
708.971 973.429 L
710.52 971.002 L
712.069 973.124 L
713.617 972.794 L
715.166 972.913 L
716.714 972.948 L
718.263 972.191 L
719.811 974.072 L
721.36 974.423 L
722.909 975.797 L
724.457 973.981 L
726.006 973.153 L
727.554 973.956 L
729.103 972.006 L
730.651 975 L
732.2 972.375 L
733.749 970.928 L
735.297 970.987 L
736.846 971.308 L
738.394 973.457 L
739.943 969.959 L
741.491 972.766 L
743.04 970.154 L
744.589 972.334 L
746.137 974.196 L
747.686 974.625 L
749.234 972.813 L
750.783 973.129 L
752.331 974.878 L
753.88 973.954 L
755.429 977.683 L
756.977 975.249 L
758.526 974.752 L
760.074 971.962 L
761.623 974.511 L
763.171 972.997 L
764.72 974.147 L
766.269 972.34 L
767.817 971.544 L
769.366 972.29 L
770.914 970.967 L
772.463 974.66 L
774.011 972.117 L
775.56 972.547 L
777.109 972.584 L
778.657 974.732 L
780.206 973.513 L
781.754 973.616 L
783.303 972.695 L
784.851 974.011 L
786.4 974.189 L
787.949 974.662 L
789.497 970.401 L
791.046 969.98 L
792.594 969.685 L
794.143 969.831 L
795.691 972.035 L
797.24 972.811 L
798.789 972.498 L
800.337 970.654 L
801.886 972.557 L
803.434 972.666 L
804.983 975.164 L
806.531 973.994 L
808.08 972.571 L
809.629 972.7 L
811.177 974.026 L
812.726 975.38 L
814.274 974.668 L
815.823 972.951 L
817.371 973.664 L
818.92 974.977 L
820.469 978.598 L
822.017 976.827 L
823.566 974.163 L
825.114 976.529 L
826.663 976.213 L
828.211 976.382 L
829.76 977.012 L
831.309 973.793 L
832.857 970.24 L
834.406 969.141 L
835.954 971.553 L
837.503 973.755 L
839.051 974.099 L
840.6 973.582 L
842.149 973.373 L
843.697 972.019 L
845.246 975.29 L
846.794 975.732 L
848.343 973.722 L
849.891 972.222 L
851.44 971.861 L
852.989 972.611 L
854.537 969.859 L
856.086 974.058 L
857.634 971.345 L
859.183 969.755 L
860.731 971.606 L
862.28 970.967 L
863.829 971.306 L
865.377 970.063 L
866.926 969.719 L
868.474 971.701 L
870.023 972.109 L
871.571 973.719 L
873.12 970.307 L
874.669 968.18 L
876.217 968.097 L
877.766 971.094 L
879.314 972.44 L
880.863 969.741 L
882.411 970.308 L
883.96 968.821 L
885.509 971.022 L
887.057 968.29 L
888.606 965.715 L
890.154 967.006 L
891.703 968 L
893.251 971.127 L
894.8 968.437 L
896.349 968.514 L
897.897 967.586 L
899.446 967.53 L
900.994 970.323 L
902.543 970.526 L
904.091 970.247 L
905.64 968.884 L
907.189 966.525 L
908.737 970.883 L
910.286 968.315 L
911.834 967.464 L
913.383 966.813 L
914.931 968.011 L
916.48 969.407 L
918.029 968.31 L
919.577 968.594 L
921.126 966.144 L
922.674 967.46 L
924.223 970.021 L
925.771 971.026 L
927.32 971.219 L
928.869 969.362 L
930.417 968.844 L
931.966 969.844 L
933.514 970.065 L
935.063 969.525 L
936.611 967.016 L
938.16 968.953 L
939.709 969.209 L
941.257 971.549 L
942.806 969.881 L
944.354 968.495 L
945.903 968.421 L
947.451 971.43 L
949 971.667 L
950.549 970.325 L
952.097 969.388 L
953.646 968.967 L
955.194 970.293 L
956.743 970.023 L
958.291 971.539 L
959.84 969.08 L
961.389 969.228 L
962.937 969.285 L
964.486 970.116 L
966.034 971.092 L
967.583 967.549 L
969.131 971.635 L
970.68 970.584 L
972.229 972.469 L
973.777 972.451 L
975.326 969.179 L
976.874 970.167 L
978.423 971.37 L
979.971 973.411 L
981.52 969.044 L
983.069 967.186 L
984.617 967.206 L
986.166 967.926 L
987.714 969.884 L
989.263 970.499 L
990.811 969.886 L
992.36 967.052 L
993.909 969.263 L
995.457 968.502 L
997.006 971.508 L
998.554 970.725 L
1000.103 968.91 L
1001.651 969.438 L
1003.2 968.525 L
1004.749 972.553 L
1006.297 972.062 L
1007.846 972.318 L
1009.394 968.855 L
1010.943 968.424 L
1012.491 971.675 L
1014.04 969.591 L
1015.589 967.112 L
1017.137 968.543 L
1018.686 968.095 L
1020.234 971.143 L
1021.783 970.622 L
1023.331 970.407 L
1024.88 968.112 L
1026.429 968.114 L
1027.977 969.675 L
1029.526 970.54 L
1031.074 971.649 L
1032.623 969.273 L
1034.171 969.677 L
1035.72 964.562 L
1037.269 967.326 L
1038.817 967.091 L
1040.366 967.798 L
1041.914 966.18 L
1043.463 965.041 L
1045.011 967.86 L
1046.56 969.15 L
1048.109 971.382 L
1049.657 970.041 L
1051.206 968.514 L
1052.754 968.9 L
1054.303 969.544 L
1055.851 969.196 L
1057.4 966.47 L
1058.949 966.775 L
1060.497 969.492 L
1062.046 970.864 L
1063.594 967.424 L
1065.143 966.215 L
1066.691 963.324 L
1068.24 966.194 L
1069.789 966.539 L
1071.337 967.984 L
1072.886 965.965 L
1074.434 962.913 L
1075.983 965.725 L
1077.531 966.702 L
1079.08 967.579 L
1080.629 966.624 L
1082.177 964.929 L
1083.726 966.34 L
1085.274 967.784 L
1086.823 969.421 L
1088.371 969.586 L
1089.92 968.255 L
1091.469 968.424 L
1093.017 967.01 L
1094.566 969.428 L
1096.114 969.144 L
1097.663 965.706 L
1099.211 967.311 L
1100.76 966.771 L
1102.309 966.579 L
1103.857 965.815 L
1105.406 966.927 L
1106.954 965.821 L
1108.503 965.649 L
1110.051 965.207 L
1111.6 969.534 L
1113.149 965.196 L
1114.697 966.569 L
1116.246 962.567 L
1117.794 970.354 L
1119.343 972.635 L
1120.891 972.075 L
1122.44 970.508 L
1123.989 971.105 L
1125.537 972.272 L
1127.086 969.969 L
1128.634 968.963 L
1130.183 968.096 L
1131.731 974.469 L
1133.28 974.061 L
1134.829 973.026 L
S
GR
GS
[0.3749 0 0 0.37484 43.217 55.33821] CT
1 0 0 RC
1 LJ
1.333 LW
N
137.549 976.75 M
139.097 973.286 L
140.646 972.325 L
142.194 972.903 L
143.743 970.381 L
145.291 967.391 L
146.84 965.727 L
148.389 968.422 L
149.937 969.505 L
151.486 964.143 L
153.034 963.512 L
154.583 966.674 L
156.131 970.741 L
157.68 970 L
159.229 964.436 L
160.777 966.203 L
162.326 967.982 L
163.874 964.429 L
165.423 965.83 L
166.971 969.392 L
168.52 964.579 L
170.069 961.625 L
171.617 961.9 L
173.166 967.364 L
174.714 964.211 L
176.263 960.439 L
177.811 958.981 L
179.36 959.288 L
180.909 961.532 L
182.457 964.711 L
184.006 959.693 L
185.554 956.69 L
187.103 955.336 L
188.651 959.009 L
190.2 960.177 L
191.749 960.443 L
193.297 951.709 L
194.846 945.277 L
196.394 942.939 L
197.943 943.558 L
199.491 943.361 L
201.04 943.364 L
202.589 941.069 L
204.137 940.205 L
205.686 942.673 L
207.234 945.043 L
208.783 941.901 L
210.331 940.999 L
211.88 945.96 L
213.429 953.803 L
214.977 954.275 L
216.526 950.211 L
218.074 948.889 L
219.623 950.965 L
221.171 954.98 L
222.72 953.294 L
224.269 948.289 L
225.817 948.22 L
227.366 952.334 L
228.914 956.399 L
230.463 954.991 L
232.011 951.954 L
233.56 950.568 L
235.109 943.208 L
236.657 926.406 L
238.206 919.029 L
239.754 915.111 L
241.303 914.072 L
242.851 916.2 L
244.4 917.538 L
245.949 914.725 L
247.497 911.76 L
249.046 911.198 L
250.594 914.832 L
252.143 916.839 L
253.691 917.703 L
255.24 933.297 L
256.789 937.682 L
258.337 937.667 L
259.886 941.11 L
261.434 940.789 L
262.983 935.593 L
264.531 932.911 L
266.08 938.158 L
267.629 941.84 L
269.177 942.221 L
270.726 936.742 L
272.274 935.772 L
273.823 939.161 L
275.371 942.32 L
276.92 939.155 L
278.469 918.388 L
280.017 906.343 L
281.566 906.729 L
283.114 909.46 L
284.663 910.809 L
286.211 905.867 L
287.76 906.332 L
289.309 911.183 L
290.857 911.927 L
292.406 914.392 L
293.954 911.65 L
295.503 910.127 L
297.051 922.995 L
298.6 936.053 L
300.149 939.962 L
301.697 935.313 L
303.246 931.991 L
304.794 934.394 L
306.343 937.081 L
307.891 933.552 L
309.44 930.18 L
310.989 927.777 L
312.537 928.24 L
314.086 932.49 L
315.634 932.152 L
317.183 930.374 L
318.731 923.987 L
320.28 918.804 L
321.829 922.934 L
323.377 925.881 L
324.926 925.298 L
326.474 923.222 L
328.023 919.761 L
329.571 924.863 L
331.12 927.321 L
332.669 925.439 L
334.217 921.449 L
335.766 920.596 L
337.314 923.484 L
338.863 926.328 L
340.411 926.104 L
341.96 923.02 L
343.509 921.746 L
345.057 923.418 L
346.606 925.653 L
348.154 926.048 L
349.703 925.824 L
351.251 923.985 L
352.8 927.26 L
354.349 929.972 L
355.897 928.809 L
357.446 923.627 L
358.994 924.367 L
360.543 926.713 L
362.091 927.13 L
363.64 924.162 L
365.189 928.184 L
366.737 926.601 L
368.286 929.874 L
369.834 932.665 L
371.383 930.042 L
372.931 927.677 L
374.48 926.249 L
376.029 928.429 L
377.577 932.273 L
379.126 928.062 L
380.674 923.158 L
382.223 922.751 L
383.771 929.571 L
385.32 927.027 L
386.869 922.438 L
388.417 921.855 L
389.966 920.997 L
391.514 920.99 L
393.063 923.817 L
394.611 924.373 L
396.16 919.748 L
397.709 917.608 L
399.257 917.7 L
400.806 922.876 L
402.354 922.64 L
403.903 920.892 L
405.451 922.828 L
407 926.137 L
408.549 929.104 L
410.097 927.727 L
411.646 926.607 L
413.194 922.97 L
414.743 922.541 L
416.291 929.012 L
417.84 930.109 L
419.389 926.509 L
420.937 921.346 L
422.486 923.298 L
424.034 926.819 L
425.583 928.086 L
427.131 925.695 L
428.68 921.384 L
430.229 920.48 L
431.777 922.178 L
433.326 925.601 L
434.874 920.247 L
436.423 916.359 L
437.971 920.481 L
439.52 921.668 L
441.069 927.708 L
442.617 929.67 L
444.166 927.529 L
445.714 927.441 L
447.263 934.875 L
448.811 935.783 L
450.36 934.515 L
451.909 938.315 L
453.457 923.162 L
455.006 939.412 L
456.554 938.696 L
458.103 936.935 L
459.651 939.209 L
461.2 939.788 L
462.749 937.255 L
464.297 932.976 L
465.846 934.43 L
467.394 933.425 L
468.943 934.433 L
470.491 927.67 L
472.04 923.669 L
473.589 922.032 L
475.137 922.655 L
476.686 927.926 L
478.234 933.614 L
479.783 927.916 L
481.331 923.178 L
482.88 921.633 L
484.429 922.846 L
485.977 921.236 L
487.526 918.988 L
489.074 926.605 L
490.623 933.598 L
492.171 936.458 L
493.72 932.819 L
495.269 931.622 L
496.817 931.195 L
498.366 933.433 L
499.914 934.427 L
501.463 929.693 L
503.011 930.142 L
504.56 929.251 L
506.109 933.649 L
507.657 933.784 L
509.206 929.411 L
510.754 929.807 L
512.303 926.812 L
513.851 932.196 L
515.4 934.282 L
516.949 928.485 L
518.497 928.603 L
520.046 928.101 L
521.594 930.113 L
523.143 933.342 L
524.691 930.077 L
526.24 930.038 L
527.789 929.25 L
529.337 929.015 L
530.886 932.19 L
532.434 931.936 L
533.983 930.776 L
535.531 928.523 L
537.08 926.504 L
538.629 924.04 L
540.177 929.156 L
541.726 928.182 L
543.274 928.131 L
544.823 927.528 L
546.371 928.612 L
547.92 930.793 L
549.469 933.19 L
551.017 931.229 L
552.566 928.87 L
554.114 929.629 L
555.663 929.098 L
557.211 931.964 L
558.76 930.275 L
560.309 926.546 L
561.857 926.785 L
563.406 931.087 L
564.954 930.275 L
566.503 928.607 L
568.051 926.818 L
569.6 925.84 L
571.149 929.364 L
572.697 931.137 L
574.246 927.91 L
575.794 928.479 L
577.343 924.143 L
578.891 927.744 L
580.44 928.354 L
581.989 927.674 L
583.537 926.361 L
585.086 924.069 L
586.634 924.46 L
588.183 927.394 L
589.731 929.18 L
591.28 926.836 L
592.829 925.574 L
594.377 925.259 L
595.926 928.88 L
597.474 932.594 L
599.023 930.226 L
600.571 928.569 L
602.12 926.404 L
603.669 925.354 L
605.217 931.023 L
606.766 926.511 L
608.314 926.659 L
609.863 924.238 L
611.411 921.592 L
612.96 923.863 L
614.509 926.295 L
616.057 925.525 L
617.606 923.595 L
619.154 923.473 L
620.703 921.792 L
622.251 923.166 L
623.8 923.164 L
625.349 920.545 L
626.897 919.31 L
628.446 922.35 L
629.994 925.949 L
631.543 924.009 L
633.091 922.591 L
634.64 922.748 L
636.189 925.231 L
637.737 927.137 L
639.286 928.158 L
640.834 928.602 L
642.383 923.768 L
643.931 918.592 L
645.48 922.53 L
647.029 923.112 L
648.577 922.038 L
650.126 920.056 L
651.674 922.152 L
653.223 926.063 L
654.771 925.663 L
656.32 923.014 L
657.869 921.329 L
659.417 923.363 L
660.966 924.621 L
662.514 923.172 L
664.063 919.406 L
665.611 914.998 L
667.16 915.366 L
668.709 918.625 L
670.257 918.415 L
671.806 916.997 L
673.354 919.606 L
674.903 916.503 L
676.451 914.894 L
678 918.739 L
679.549 917.346 L
681.097 922.652 L
682.646 923.472 L
684.194 919.518 L
685.743 915.143 L
687.291 912.009 L
688.84 917.353 L
690.389 916.951 L
691.937 918.087 L
693.486 916.956 L
695.034 914.118 L
696.583 917.269 L
698.131 918.252 L
699.68 917.46 L
701.229 914.641 L
702.777 916.235 L
704.326 919.184 L
705.874 920.721 L
707.423 921.299 L
708.971 917.823 L
710.52 915.058 L
712.069 918.252 L
713.617 919.397 L
715.166 918.412 L
716.714 916.904 L
718.263 916.676 L
719.811 917.798 L
721.36 919.46 L
722.909 919.123 L
724.457 917.952 L
726.006 916.038 L
727.554 915.326 L
729.103 917.372 L
730.651 920.063 L
732.2 916.864 L
733.749 916.16 L
735.297 914.71 L
736.846 917.253 L
738.394 919.252 L
739.943 917.577 L
741.491 917.336 L
743.04 914.231 L
744.589 917.263 L
746.137 921.883 L
747.686 920.834 L
749.234 921.457 L
750.783 918.99 L
752.331 914.118 L
753.88 913.379 L
755.429 918.76 L
756.977 918.82 L
758.526 918.226 L
760.074 914.702 L
761.623 917.918 L
763.171 920.104 L
764.72 920.098 L
766.269 919.404 L
767.817 919.923 L
769.366 918.497 L
770.914 919.605 L
772.463 919.504 L
774.011 917.394 L
775.56 915.087 L
777.109 915.821 L
778.657 919.246 L
780.206 918.85 L
781.754 916.478 L
783.303 913.886 L
784.851 914.58 L
786.4 916.741 L
787.949 916.338 L
789.497 916.363 L
791.046 914.255 L
792.594 909.034 L
794.143 911.736 L
795.691 915.191 L
797.24 914.387 L
798.789 914.35 L
800.337 912.095 L
801.886 912.169 L
803.434 914.94 L
804.983 917.828 L
806.531 916.653 L
808.08 913.315 L
809.629 915.794 L
811.177 919.682 L
812.726 918.703 L
814.274 915.806 L
815.823 914.69 L
817.371 913.989 L
818.92 917.255 L
820.469 920.684 L
822.017 920.009 L
823.566 916.385 L
825.114 916.201 L
826.663 917.712 L
828.211 919.403 L
829.76 919.398 L
831.309 920.937 L
832.857 919.828 L
834.406 916.822 L
835.954 915.638 L
837.503 918.207 L
839.051 917.784 L
840.6 918.054 L
842.149 916.153 L
843.697 914.262 L
845.246 918.016 L
846.794 920.052 L
848.343 918.113 L
849.891 915.755 L
851.44 915.402 L
852.989 919.382 L
854.537 919.513 L
856.086 917.647 L
857.634 915.476 L
859.183 913.127 L
860.731 916.431 L
862.28 919.238 L
863.829 917.88 L
865.377 915.715 L
866.926 915.221 L
868.474 917.111 L
870.023 919.524 L
871.571 919.852 L
873.12 921.21 L
874.669 918.369 L
876.217 919.751 L
877.766 923.522 L
879.314 923.535 L
880.863 920.639 L
882.411 920.01 L
883.96 921.845 L
885.509 925 L
887.057 921.693 L
888.606 920.229 L
890.154 920.156 L
891.703 923.022 L
893.251 924.074 L
894.8 924.114 L
896.349 924.417 L
897.897 921.141 L
899.446 920.01 L
900.994 923.329 L
902.543 923.407 L
904.091 922.778 L
905.64 918.578 L
907.189 918.594 L
908.737 923.089 L
910.286 922.768 L
911.834 920.683 L
913.383 918.049 L
914.931 919.735 L
916.48 925.862 L
918.029 925.317 L
919.577 925.104 L
921.126 919.992 L
922.674 916.984 L
924.223 919.557 L
925.771 923.479 L
927.32 922.485 L
928.869 918.539 L
930.417 918.353 L
931.966 918.51 L
933.514 920.236 L
935.063 919.776 L
936.611 917.873 L
938.16 920.284 L
939.709 922.59 L
941.257 927.562 L
942.806 923.942 L
944.354 918.631 L
945.903 920.324 L
947.451 924.464 L
949 922.753 L
950.549 918.826 L
952.097 919.472 L
953.646 918.731 L
955.194 920.851 L
956.743 924.071 L
958.291 925.643 L
959.84 923.894 L
961.389 920.166 L
962.937 921.213 L
964.486 927.284 L
966.034 923.181 L
967.583 922.474 L
969.131 921.949 L
970.68 922.532 L
972.229 925.239 L
973.777 921.027 L
975.326 920.351 L
976.874 919.166 L
978.423 921.276 L
979.971 923.944 L
981.52 924.517 L
983.069 923.324 L
984.617 919.501 L
986.166 917.136 L
987.714 919.4 L
989.263 922.659 L
990.811 921.02 L
992.36 919.882 L
993.909 916.456 L
995.457 916.707 L
997.006 921.932 L
998.554 922.12 L
1000.103 921.002 L
1001.651 917.662 L
1003.2 920.445 L
1004.749 924.764 L
1006.297 924.99 L
1007.846 924.766 L
1009.394 920.085 L
1010.943 921.895 L
1012.491 924.972 L
1014.04 923.787 L
1015.589 921.826 L
1017.137 919.984 L
1018.686 918.055 L
1020.234 920.568 L
1021.783 923.525 L
1023.331 925.236 L
1024.88 924.314 L
1026.429 920.114 L
1027.977 917.606 L
1029.526 922.49 L
1031.074 924.446 L
1032.623 921.771 L
1034.171 921.382 L
1035.72 920.381 L
1037.269 923.291 L
1038.817 924.497 L
1040.366 924.585 L
1041.914 920.382 L
1043.463 918.877 L
1045.011 924.32 L
1046.56 926.778 L
1048.109 925.398 L
1049.657 922.061 L
1051.206 921.792 L
1052.754 924.157 L
1054.303 925.041 L
1055.851 924.446 L
1057.4 922.046 L
1058.949 922.05 L
1060.497 926.362 L
1062.046 929.275 L
1063.594 927.896 L
1065.143 929.32 L
1066.691 925.998 L
1068.24 927.025 L
1069.789 930.034 L
1071.337 929.234 L
1072.886 927.731 L
1074.434 924.773 L
1075.983 923.809 L
1077.531 925.555 L
1079.08 929.103 L
1080.629 926.964 L
1082.177 922.896 L
1083.726 922.992 L
1085.274 925.658 L
1086.823 927.955 L
1088.371 926.737 L
1089.92 928.509 L
1091.469 921.772 L
1093.017 922.658 L
1094.566 927.329 L
1096.114 927.962 L
1097.663 925.831 L
1099.211 923.5 L
1100.76 924.581 L
1102.309 928.934 L
1103.857 929.604 L
1105.406 926.427 L
1106.954 925.442 L
1108.503 924.614 L
1110.051 929.527 L
1111.6 929.644 L
1113.149 927.122 L
1114.697 929.417 L
1116.246 904.65 L
1117.794 915.948 L
1119.343 913.671 L
1120.891 913.387 L
1122.44 913.042 L
1123.989 911.938 L
1125.537 917.586 L
1127.086 920.78 L
1128.634 920.185 L
1130.183 923.108 L
1131.731 933.734 L
1133.28 938.762 L
1134.829 932.473 L
S
GR
GS
[0.3749 0 0 0.37484 43.217 55.33821] CT
1 GC
N
1187 1251 M
1187 1160 L
984 1160 L
984 1251 L
cp
f
GR
GS
[0.3749 0 0 0.37484 447.35994 496.71636] CT
/Helvetica 22.8 F
GS
[1 0 0 1 0 0] CT
0 8.5 moveto 
1 -1 scale
(x translation) t 
GR
GR
GS
[0.3749 0 0 0.37484 43.217 55.33821] CT
0 0 1 RC
1 LJ
1.333 LW
N
992 1177.5 M
1072 1177.5 L
S
GR
GS
[0.3749 0 0 0.37484 447.35994 507.21198] CT
/Helvetica 22.8 F
GS
[1 0 0 1 0 0] CT
0 8.5 moveto 
1 -1 scale
(y translation) t 
GR
GR
GS
[0.3749 0 0 0.37484 43.217 55.33821] CT
0 0.502 0 RC
1 LJ
1.333 LW
N
992 1205.5 M
1072 1205.5 L
S
GR
GS
[0.3749 0 0 0.37484 447.35994 517.7076] CT
/Helvetica 22.8 F
GS
[1 0 0 1 0 0] CT
0 8.5 moveto 
1 -1 scale
(z translation) t 
GR
GR
GS
[0.3749 0 0 0.37484 43.217 55.33821] CT
1 0 0 RC
1 LJ
1.333 LW
N
992 1233.5 M
1072 1233.5 L
S
GR
GS
[0.3749 0 0 0.37484 43.217 55.33821] CT
10.0 ML
1.333 LW
N
984 1251 M
984 1160 L
1187 1160 L
1187 1251 L
cp
S
GR
GS
[0.3749 0 0 0.37484 43.217 55.33821] CT
1 GC
N
136 1856 M
1220 1856 L
1220 1465 L
136 1465 L
cp
f
GR
GS
[0.3749 0 0 0.37484 43.217 55.33821] CT
0.873 GC
1 LJ
1.333 LW
N
136 1856 M
136 1465 L
S
GR
GS
[0.3749 0 0 0.37484 43.217 55.33821] CT
0.873 GC
1 LJ
1.333 LW
N
290.857 1856 M
290.857 1465 L
S
GR
GS
[0.3749 0 0 0.37484 43.217 55.33821] CT
0.873 GC
1 LJ
1.333 LW
N
445.714 1856 M
445.714 1465 L
S
GR
GS
[0.3749 0 0 0.37484 43.217 55.33821] CT
0.873 GC
1 LJ
1.333 LW
N
600.571 1856 M
600.571 1465 L
S
GR
GS
[0.3749 0 0 0.37484 43.217 55.33821] CT
0.873 GC
1 LJ
1.333 LW
N
755.429 1856 M
755.429 1465 L
S
GR
GS
[0.3749 0 0 0.37484 43.217 55.33821] CT
0.873 GC
1 LJ
1.333 LW
N
910.286 1856 M
910.286 1465 L
S
GR
GS
[0.3749 0 0 0.37484 43.217 55.33821] CT
0.873 GC
1 LJ
1.333 LW
N
1065.143 1856 M
1065.143 1465 L
S
GR
GS
[0.3749 0 0 0.37484 43.217 55.33821] CT
0.873 GC
1 LJ
1.333 LW
N
1220 1856 M
1220 1465 L
S
GR
GS
[0.3749 0 0 0.37484 43.217 55.33821] CT
0.873 GC
1 LJ
1.333 LW
N
1220 1856 M
136 1856 L
S
GR
GS
[0.3749 0 0 0.37484 43.217 55.33821] CT
0.873 GC
1 LJ
1.333 LW
N
1220 1777.8 M
136 1777.8 L
S
GR
GS
[0.3749 0 0 0.37484 43.217 55.33821] CT
0.873 GC
1 LJ
1.333 LW
N
1220 1699.6 M
136 1699.6 L
S
GR
GS
[0.3749 0 0 0.37484 43.217 55.33821] CT
0.873 GC
1 LJ
1.333 LW
N
1220 1621.4 M
136 1621.4 L
S
GR
GS
[0.3749 0 0 0.37484 43.217 55.33821] CT
0.873 GC
1 LJ
1.333 LW
N
1220 1543.2 M
136 1543.2 L
S
GR
GS
[0.3749 0 0 0.37484 43.217 55.33821] CT
0.873 GC
1 LJ
1.333 LW
N
1220 1465 M
136 1465 L
S
GR
GS
[0.3749 0 0 0.37484 43.217 55.33821] CT
2 setlinecap
1 LJ
1.333 LW
N
136 1856 M
1220 1856 L
S
GR
GS
[0.3749 0 0 0.37484 43.217 55.33821] CT
2 setlinecap
1 LJ
1.333 LW
N
136 1856 M
136 1845.16 L
S
GR
GS
[0.3749 0 0 0.37484 43.217 55.33821] CT
2 setlinecap
1 LJ
1.333 LW
N
290.857 1856 M
290.857 1845.16 L
S
GR
GS
[0.3749 0 0 0.37484 43.217 55.33821] CT
2 setlinecap
1 LJ
1.333 LW
N
445.714 1856 M
445.714 1845.16 L
S
GR
GS
[0.3749 0 0 0.37484 43.217 55.33821] CT
2 setlinecap
1 LJ
1.333 LW
N
600.571 1856 M
600.571 1845.16 L
S
GR
GS
[0.3749 0 0 0.37484 43.217 55.33821] CT
2 setlinecap
1 LJ
1.333 LW
N
755.429 1856 M
755.429 1845.16 L
S
GR
GS
[0.3749 0 0 0.37484 43.217 55.33821] CT
2 setlinecap
1 LJ
1.333 LW
N
910.286 1856 M
910.286 1845.16 L
S
GR
GS
[0.3749 0 0 0.37484 43.217 55.33821] CT
2 setlinecap
1 LJ
1.333 LW
N
1065.143 1856 M
1065.143 1845.16 L
S
GR
GS
[0.3749 0 0 0.37484 43.217 55.33821] CT
2 setlinecap
1 LJ
1.333 LW
N
1220 1856 M
1220 1845.16 L
S
GR
GS
[0.3749 0 0 0.37484 94.2035 754.44622] CT
/Helvetica 25.333 F
GS
[1 0 0 1 0 0] CT
-6 24 moveto 
1 -1 scale
(0) t 
GR
GR
GS
[0.3749 0 0 0.37484 152.25955 754.44622] CT
/Helvetica 25.333 F
GS
[1 0 0 1 0 0] CT
-17.5 24 moveto 
1 -1 scale
(100) t 
GR
GR
GS
[0.3749 0 0 0.37484 210.3156 754.44622] CT
/Helvetica 25.333 F
GS
[1 0 0 1 0 0] CT
-17.5 24 moveto 
1 -1 scale
(200) t 
GR
GR
GS
[0.3749 0 0 0.37484 268.37163 754.44622] CT
/Helvetica 25.333 F
GS
[1 0 0 1 0 0] CT
-17.5 24 moveto 
1 -1 scale
(300) t 
GR
GR
GS
[0.3749 0 0 0.37484 326.4277 754.44622] CT
/Helvetica 25.333 F
GS
[1 0 0 1 0 0] CT
-17.5 24 moveto 
1 -1 scale
(400) t 
GR
GR
GS
[0.3749 0 0 0.37484 384.48374 754.44622] CT
/Helvetica 25.333 F
GS
[1 0 0 1 0 0] CT
-17.5 24 moveto 
1 -1 scale
(500) t 
GR
GR
GS
[0.3749 0 0 0.37484 442.53977 754.44622] CT
/Helvetica 25.333 F
GS
[1 0 0 1 0 0] CT
-17.5 24 moveto 
1 -1 scale
(600) t 
GR
GR
GS
[0.3749 0 0 0.37484 500.59584 754.44622] CT
/Helvetica 25.333 F
GS
[1 0 0 1 0 0] CT
-17.5 24 moveto 
1 -1 scale
(700) t 
GR
GR
GS
[0.3749 0 0 0.37484 297.39987 766.44121] CT
/Helvetica 27.867 F
GS
[1 0 0 1 0 0] CT
-31.5 27 moveto 
1 -1 scale
(image) t 
GR
GR
GS
[0.3749 0 0 0.37484 43.217 55.33821] CT
2 setlinecap
1 LJ
1.333 LW
N
136 1856 M
136 1465 L
S
GR
GS
[0.3749 0 0 0.37484 43.217 55.33821] CT
2 setlinecap
1 LJ
1.333 LW
N
136 1856 M
146.84 1856 L
S
GR
GS
[0.3749 0 0 0.37484 43.217 55.33821] CT
2 setlinecap
1 LJ
1.333 LW
N
136 1777.8 M
146.84 1777.8 L
S
GR
GS
[0.3749 0 0 0.37484 43.217 55.33821] CT
2 setlinecap
1 LJ
1.333 LW
N
136 1699.6 M
146.84 1699.6 L
S
GR
GS
[0.3749 0 0 0.37484 43.217 55.33821] CT
2 setlinecap
1 LJ
1.333 LW
N
136 1621.4 M
146.84 1621.4 L
S
GR
GS
[0.3749 0 0 0.37484 43.217 55.33821] CT
2 setlinecap
1 LJ
1.333 LW
N
136 1543.2 M
146.84 1543.2 L
S
GR
GS
[0.3749 0 0 0.37484 43.217 55.33821] CT
2 setlinecap
1 LJ
1.333 LW
N
136 1465 M
146.84 1465 L
S
GR
GS
[0.3749 0 0 0.37484 90.8044 751.04764] CT
/Helvetica 25.333 F
GS
[1 0 0 1 0 0] CT
-19 9 moveto 
1 -1 scale
(-8) t 
GR
GR
GS
[0.3749 0 0 0.37484 90.8044 721.7349] CT
/Helvetica 25.333 F
GS
[1 0 0 1 0 0] CT
-19 9 moveto 
1 -1 scale
(-6) t 
GR
GR
GS
[0.3749 0 0 0.37484 90.8044 692.42212] CT
/Helvetica 25.333 F
GS
[1 0 0 1 0 0] CT
-19 9 moveto 
1 -1 scale
(-4) t 
GR
GR
GS
[0.3749 0 0 0.37484 90.8044 663.10938] CT
/Helvetica 25.333 F
GS
[1 0 0 1 0 0] CT
-19 9 moveto 
1 -1 scale
(-2) t 
GR
GR
GS
[0.3749 0 0 0.37484 90.8044 633.79659] CT
/Helvetica 25.333 F
GS
[1 0 0 1 0 0] CT
-12 9 moveto 
1 -1 scale
(0) t 
GR
GR
GS
[0.3749 0 0 0.37484 90.8044 604.48385] CT
/Helvetica 25.333 F
GS
[1 0 0 1 0 0] CT
-12 9 moveto 
1 -1 scale
(2) t 
GR
GR
GS
[0 -0.37484 0.3749 0 81.18195 677.76566] CT
/Helvetica 27.867 F
GS
[1 0 0 1 0 0] CT
-41.5 -6 moveto 
1 -1 scale
(degrees) t 
GR
GR
GS
[0.3749 0 0 0.37484 297.39992 602.98448] CT
/Helvetica-Bold 42.667 F
GS
[1 0 0 1 0 0] CT
-65.5 -10 moveto 
1 -1 scale
(rotation) t 
GR
GR
GS
[0.3749 0 0 0.37484 43.217 55.33821] CT
0 0 1 RC
1 LJ
1.333 LW
N
137.549 1543.2 M
139.097 1544.549 L
140.646 1545.132 L
142.194 1544.12 L
143.743 1542.839 L
145.291 1542.175 L
146.84 1543.83 L
148.389 1544.724 L
149.937 1543.077 L
151.486 1541.975 L
153.034 1540.824 L
154.583 1544.502 L
156.131 1543.375 L
157.68 1543.641 L
159.229 1543.315 L
160.777 1545.056 L
162.326 1542.226 L
163.874 1544.378 L
165.423 1545.824 L
166.971 1545.675 L
168.52 1543.106 L
170.069 1543.447 L
171.617 1544.571 L
173.166 1545.704 L
174.714 1543.936 L
176.263 1541.834 L
177.811 1541.772 L
179.36 1542.666 L
180.909 1544.312 L
182.457 1542.934 L
184.006 1541.757 L
185.554 1540.742 L
187.103 1543.127 L
188.651 1545.125 L
190.2 1543.229 L
191.749 1541.478 L
193.297 1535.046 L
194.846 1529.332 L
196.394 1531.263 L
197.943 1533.205 L
199.491 1533.393 L
201.04 1533.969 L
202.589 1533.217 L
204.137 1535.287 L
205.686 1536.982 L
207.234 1535.031 L
208.783 1535.11 L
210.331 1535.458 L
211.88 1537.599 L
213.429 1539.865 L
214.977 1538.994 L
216.526 1538.473 L
218.074 1539.679 L
219.623 1540.869 L
221.171 1541.172 L
222.72 1540.098 L
224.269 1538.71 L
225.817 1540.201 L
227.366 1542.004 L
228.914 1541.83 L
230.463 1540.351 L
232.011 1540.573 L
233.56 1539.794 L
235.109 1529.4 L
236.657 1519.248 L
238.206 1519.148 L
239.754 1519.142 L
241.303 1520.617 L
242.851 1522.366 L
244.4 1523.097 L
245.949 1523.086 L
247.497 1523.445 L
249.046 1523.738 L
250.594 1523.205 L
252.143 1524.218 L
253.691 1526.188 L
255.24 1535.423 L
256.789 1539.659 L
258.337 1542.184 L
259.886 1544.366 L
261.434 1543.359 L
262.983 1541.238 L
264.531 1542.147 L
266.08 1544.57 L
267.629 1543.743 L
269.177 1543.23 L
270.726 1542.417 L
272.274 1543.511 L
273.823 1543.799 L
275.371 1544.376 L
276.92 1542.239 L
278.469 1532.952 L
280.017 1530.143 L
281.566 1529.695 L
283.114 1533.073 L
284.663 1541.691 L
286.211 1538.887 L
287.76 1539.542 L
289.309 1539.816 L
290.857 1537.664 L
292.406 1536.197 L
293.954 1537.644 L
295.503 1537.942 L
297.051 1546.661 L
298.6 1547.832 L
300.149 1545.429 L
301.697 1546.669 L
303.246 1546.331 L
304.794 1547 L
306.343 1547.137 L
307.891 1546.796 L
309.44 1546.293 L
310.989 1546.758 L
312.537 1547.766 L
314.086 1548.78 L
315.634 1547.502 L
317.183 1547.161 L
318.731 1544.753 L
320.28 1543.16 L
321.829 1545.008 L
323.377 1547.898 L
324.926 1545.557 L
326.474 1546.211 L
328.023 1546.882 L
329.571 1548.299 L
331.12 1548.409 L
332.669 1547.46 L
334.217 1546.314 L
335.766 1547.524 L
337.314 1548.259 L
338.863 1548.544 L
340.411 1545.083 L
341.96 1541.836 L
343.509 1544.516 L
345.057 1546.723 L
346.606 1546.564 L
348.154 1546.445 L
349.703 1544.573 L
351.251 1547.281 L
352.8 1548.282 L
354.349 1548.225 L
355.897 1547.73 L
357.446 1546.168 L
358.994 1547.42 L
360.543 1548.692 L
362.091 1547.561 L
363.64 1539.328 L
365.189 1541.404 L
366.737 1545.169 L
368.286 1546.155 L
369.834 1545.139 L
371.383 1545.759 L
372.931 1544.398 L
374.48 1546.446 L
376.029 1548.332 L
377.577 1547.273 L
379.126 1545.934 L
380.674 1545.575 L
382.223 1547.475 L
383.771 1548.701 L
385.32 1547.114 L
386.869 1546.192 L
388.417 1545.74 L
389.966 1545.03 L
391.514 1546.705 L
393.063 1547.337 L
394.611 1547.776 L
396.16 1545.483 L
397.709 1545.916 L
399.257 1548.12 L
400.806 1548.175 L
402.354 1547.855 L
403.903 1546.828 L
405.451 1547.339 L
407 1546.349 L
408.549 1545.539 L
410.097 1547.1 L
411.646 1545.994 L
413.194 1545.748 L
414.743 1547.949 L
416.291 1549.345 L
417.84 1546.506 L
419.389 1547.013 L
420.937 1546.668 L
422.486 1548.555 L
424.034 1548.356 L
425.583 1548.071 L
427.131 1544.618 L
428.68 1540.738 L
430.229 1542.326 L
431.777 1544.234 L
433.326 1544.565 L
434.874 1543.126 L
436.423 1542.805 L
437.971 1544.579 L
439.52 1545.177 L
441.069 1546.098 L
442.617 1545.736 L
444.166 1544.173 L
445.714 1542.155 L
447.263 1543.409 L
448.811 1546.392 L
450.36 1546.854 L
451.909 1550.561 L
453.457 1550.15 L
455.006 1544.177 L
456.554 1545.629 L
458.103 1546.175 L
459.651 1546.131 L
461.2 1542.649 L
462.749 1543.416 L
464.297 1544.013 L
465.846 1546.105 L
467.394 1546.918 L
468.943 1545.503 L
470.491 1544.058 L
472.04 1542.834 L
473.589 1543.609 L
475.137 1545.343 L
476.686 1547.556 L
478.234 1544.74 L
479.783 1544.393 L
481.331 1543.702 L
482.88 1545.256 L
484.429 1544.356 L
485.977 1543.264 L
487.526 1543.661 L
489.074 1544.935 L
490.623 1545.019 L
492.171 1544.583 L
493.72 1544.971 L
495.269 1545.892 L
496.817 1546.527 L
498.366 1547.269 L
499.914 1545.854 L
501.463 1544.821 L
503.011 1544.326 L
504.56 1547.199 L
506.109 1546.131 L
507.657 1545.545 L
509.206 1545.191 L
510.754 1545.573 L
512.303 1545.362 L
513.851 1545.711 L
515.4 1546.794 L
516.949 1545.791 L
518.497 1544.575 L
520.046 1547.378 L
521.594 1548.077 L
523.143 1547.193 L
524.691 1545.888 L
526.24 1545.749 L
527.789 1546.506 L
529.337 1546.865 L
530.886 1548.776 L
532.434 1545.601 L
533.983 1541.853 L
535.531 1543.308 L
537.08 1545.731 L
538.629 1546.339 L
540.177 1546.844 L
541.726 1545.451 L
543.274 1545.648 L
544.823 1546.214 L
546.371 1547.803 L
547.92 1547.593 L
549.469 1544.453 L
551.017 1545.391 L
552.566 1547.157 L
554.114 1544.595 L
555.663 1539.576 L
557.211 1544.536 L
558.76 1545.212 L
560.309 1547.347 L
561.857 1548.605 L
563.406 1547.026 L
564.954 1546.51 L
566.503 1546.369 L
568.051 1546.656 L
569.6 1548.379 L
571.149 1548.948 L
572.697 1547.233 L
574.246 1546.501 L
575.794 1545.921 L
577.343 1546.323 L
578.891 1547.033 L
580.44 1546.047 L
581.989 1545.519 L
583.537 1543.445 L
585.086 1544.514 L
586.634 1546.2 L
588.183 1546.238 L
589.731 1545.444 L
591.28 1543.861 L
592.829 1544.234 L
594.377 1545.701 L
595.926 1547.091 L
597.474 1546.119 L
599.023 1542.688 L
600.571 1543.5 L
602.12 1545.842 L
603.669 1546.112 L
605.217 1544.426 L
606.766 1544.589 L
608.314 1544.745 L
609.863 1545.554 L
611.411 1547.293 L
612.96 1548.108 L
614.509 1546.91 L
616.057 1545.677 L
617.606 1545.526 L
619.154 1544.314 L
620.703 1539.403 L
622.251 1541.202 L
623.8 1541.671 L
625.349 1542.773 L
626.897 1544.257 L
628.446 1544.283 L
629.994 1544.277 L
631.543 1542.755 L
633.091 1543.248 L
634.64 1545.443 L
636.189 1544.69 L
637.737 1543.716 L
639.286 1544.787 L
640.834 1543.577 L
642.383 1544.296 L
643.931 1546.629 L
645.48 1544.701 L
647.029 1542.872 L
648.577 1542.748 L
650.126 1544.326 L
651.674 1547.028 L
653.223 1544.811 L
654.771 1543.849 L
656.32 1543.243 L
657.869 1545.049 L
659.417 1545.758 L
660.966 1544.836 L
662.514 1536.614 L
664.063 1536.554 L
665.611 1539.027 L
667.16 1541.23 L
668.709 1541.506 L
670.257 1541.052 L
671.806 1541.333 L
673.354 1540.747 L
674.903 1540.008 L
676.451 1542.593 L
678 1542.051 L
679.549 1541.54 L
681.097 1544.863 L
682.646 1544.99 L
684.194 1545.098 L
685.743 1546.974 L
687.291 1545.403 L
688.84 1543.245 L
690.389 1542.463 L
691.937 1543.5 L
693.486 1543.086 L
695.034 1544.361 L
696.583 1546.136 L
698.131 1543.926 L
699.68 1543.668 L
701.229 1544.312 L
702.777 1546.228 L
704.326 1544.973 L
705.874 1544.747 L
707.423 1545.981 L
708.971 1544.714 L
710.52 1547.654 L
712.069 1547.187 L
713.617 1545.083 L
715.166 1545.235 L
716.714 1545.72 L
718.263 1547.072 L
719.811 1548.114 L
721.36 1547.385 L
722.909 1547.03 L
724.457 1545.645 L
726.006 1544.148 L
727.554 1547.834 L
729.103 1546.876 L
730.651 1546.489 L
732.2 1545.739 L
733.749 1546.547 L
735.297 1547.498 L
736.846 1548.441 L
738.394 1546.901 L
739.943 1545.51 L
741.491 1544.409 L
743.04 1546.992 L
744.589 1548.943 L
746.137 1545.426 L
747.686 1540.186 L
749.234 1544.32 L
750.783 1546.583 L
752.331 1548.219 L
753.88 1549.621 L
755.429 1547.945 L
756.977 1545.797 L
758.526 1544.966 L
760.074 1547.136 L
761.623 1548.449 L
763.171 1547.305 L
764.72 1546.309 L
766.269 1546.755 L
767.817 1546.342 L
769.366 1547.795 L
770.914 1546.5 L
772.463 1545.986 L
774.011 1545.326 L
775.56 1546.628 L
777.109 1548.041 L
778.657 1547.124 L
780.206 1545.491 L
781.754 1545.669 L
783.303 1546.586 L
784.851 1547.908 L
786.4 1547.874 L
787.949 1546.446 L
789.497 1543.876 L
791.046 1543.891 L
792.594 1545.768 L
794.143 1547.514 L
795.691 1547.021 L
797.24 1545.059 L
798.789 1544.866 L
800.337 1545.972 L
801.886 1547.304 L
803.434 1549.2 L
804.983 1546.713 L
806.531 1545.274 L
808.08 1546.251 L
809.629 1547.709 L
811.177 1546.606 L
812.726 1543.514 L
814.274 1543.682 L
815.823 1544.028 L
817.371 1545.426 L
818.92 1548.04 L
820.469 1548.001 L
822.017 1546.12 L
823.566 1545.865 L
825.114 1548.366 L
826.663 1548.222 L
828.211 1547.564 L
829.76 1546.894 L
831.309 1546.17 L
832.857 1543.512 L
834.406 1543.58 L
835.954 1546.609 L
837.503 1546.696 L
839.051 1544.824 L
840.6 1543.789 L
842.149 1544.188 L
843.697 1546.693 L
845.246 1548.251 L
846.794 1547.029 L
848.343 1545.471 L
849.891 1545.455 L
851.44 1547.6 L
852.989 1545.762 L
854.537 1539.172 L
856.086 1539.257 L
857.634 1538.968 L
859.183 1539.918 L
860.731 1540.488 L
862.28 1539.988 L
863.829 1539.286 L
865.377 1538.46 L
866.926 1540.023 L
868.474 1542.299 L
870.023 1541.8 L
871.571 1540.456 L
873.12 1540.658 L
874.669 1541.496 L
876.217 1542.465 L
877.766 1543.257 L
879.314 1541.226 L
880.863 1542.794 L
882.411 1544.891 L
883.96 1543.693 L
885.509 1542.698 L
887.057 1541.442 L
888.606 1542.385 L
890.154 1543.815 L
891.703 1544.991 L
893.251 1543.626 L
894.8 1542.921 L
896.349 1542.676 L
897.897 1543.103 L
899.446 1544.518 L
900.994 1544.01 L
902.543 1542.728 L
904.091 1542.919 L
905.64 1543.551 L
907.189 1543.728 L
908.737 1544.687 L
910.286 1542.435 L
911.834 1541.807 L
913.383 1543.657 L
914.931 1545.711 L
916.48 1545.218 L
918.029 1542.599 L
919.577 1541.771 L
921.126 1542.609 L
922.674 1544.153 L
924.223 1546.078 L
925.771 1544.297 L
927.32 1542.921 L
928.869 1544.1 L
930.417 1544.195 L
931.966 1545.509 L
933.514 1544.259 L
935.063 1542.823 L
936.611 1543.768 L
938.16 1544.984 L
939.709 1541.357 L
941.257 1542.101 L
942.806 1543.405 L
944.354 1544.529 L
945.903 1545.453 L
947.451 1545.347 L
949 1544.656 L
950.549 1545.643 L
952.097 1543.88 L
953.646 1545.805 L
955.194 1547.385 L
956.743 1546.546 L
958.291 1545.501 L
959.84 1544.446 L
961.389 1544.747 L
962.937 1545.634 L
964.486 1545.673 L
966.034 1544.657 L
967.583 1543.267 L
969.131 1546.057 L
970.68 1547.206 L
972.229 1546.379 L
973.777 1543.978 L
975.326 1544.907 L
976.874 1546.334 L
978.423 1548.019 L
979.971 1546.993 L
981.52 1544.928 L
983.069 1541.933 L
984.617 1543.307 L
986.166 1544.988 L
987.714 1545.151 L
989.263 1544.348 L
990.811 1543.574 L
992.36 1541.46 L
993.909 1544.781 L
995.457 1546.428 L
997.006 1546.116 L
998.554 1544.188 L
1000.103 1542.339 L
1001.651 1545.029 L
1003.2 1544.723 L
1004.749 1541.244 L
1006.297 1540.726 L
1007.846 1541.653 L
1009.394 1542.159 L
1010.943 1543.776 L
1012.491 1543.116 L
1014.04 1541.411 L
1015.589 1539.815 L
1017.137 1541.753 L
1018.686 1543.053 L
1020.234 1543.996 L
1021.783 1543.228 L
1023.331 1543.419 L
1024.88 1543.245 L
1026.429 1543.452 L
1027.977 1545.114 L
1029.526 1545.532 L
1031.074 1543.867 L
1032.623 1542.93 L
1034.171 1543.323 L
1035.72 1544.237 L
1037.269 1544.667 L
1038.817 1543.634 L
1040.366 1543.629 L
1041.914 1542.989 L
1043.463 1545.328 L
1045.011 1544.988 L
1046.56 1538.085 L
1048.109 1536.294 L
1049.657 1536.99 L
1051.206 1539.343 L
1052.754 1538.231 L
1054.303 1538.746 L
1055.851 1537.242 L
1057.4 1537.681 L
1058.949 1539.851 L
1060.497 1541.258 L
1062.046 1539.746 L
1063.594 1539.311 L
1065.143 1540.59 L
1066.691 1543.606 L
1068.24 1545.899 L
1069.789 1544.966 L
1071.337 1543.174 L
1072.886 1542.522 L
1074.434 1542.404 L
1075.983 1545.081 L
1077.531 1545.843 L
1079.08 1543.819 L
1080.629 1542.881 L
1082.177 1543.404 L
1083.726 1545.26 L
1085.274 1545.024 L
1086.823 1544.189 L
1088.371 1543.667 L
1089.92 1543.207 L
1091.469 1544.479 L
1093.017 1546.333 L
1094.566 1545.519 L
1096.114 1542.382 L
1097.663 1542.205 L
1099.211 1544.026 L
1100.76 1545.961 L
1102.309 1543.53 L
1103.857 1544.115 L
1105.406 1542.827 L
1106.954 1543.811 L
1108.503 1544.72 L
1110.051 1542.444 L
1111.6 1543.534 L
1113.149 1541.232 L
1114.697 1543.725 L
1116.246 1543.423 L
1117.794 1544.247 L
1119.343 1547.34 L
1120.891 1548.531 L
1122.44 1549.554 L
1123.989 1549.439 L
1125.537 1548.309 L
1127.086 1546.68 L
1128.634 1548.442 L
1130.183 1550.081 L
1131.731 1545.946 L
1133.28 1549.514 L
1134.829 1548.934 L
S
GR
GS
[0.3749 0 0 0.37484 43.217 55.33821] CT
0 0.502 0 RC
1 LJ
1.333 LW
N
137.549 1543.2 M
139.097 1542.436 L
140.646 1541.891 L
142.194 1541.653 L
143.743 1542.514 L
145.291 1541.726 L
146.84 1542.695 L
148.389 1541.979 L
149.937 1542.91 L
151.486 1542.606 L
153.034 1543.865 L
154.583 1542.371 L
156.131 1542.395 L
157.68 1542.997 L
159.229 1542.836 L
160.777 1544.596 L
162.326 1542.81 L
163.874 1543.328 L
165.423 1542.934 L
166.971 1543.736 L
168.52 1543.128 L
170.069 1543.214 L
171.617 1542.967 L
173.166 1543.638 L
174.714 1544.907 L
176.263 1543.586 L
177.811 1543.561 L
179.36 1544.063 L
180.909 1542.864 L
182.457 1543.723 L
184.006 1544.011 L
185.554 1543.184 L
187.103 1543.63 L
188.651 1544.427 L
190.2 1544.509 L
191.749 1547.11 L
193.297 1557.417 L
194.846 1559.413 L
196.394 1558.293 L
197.943 1557.979 L
199.491 1557.757 L
201.04 1558.351 L
202.589 1557.488 L
204.137 1558.331 L
205.686 1557.33 L
207.234 1557.769 L
208.783 1557.443 L
210.331 1557.892 L
211.88 1553.404 L
213.429 1541.142 L
214.977 1522.3 L
216.526 1524.007 L
218.074 1525.74 L
219.623 1526.5 L
221.171 1527.344 L
222.72 1528.483 L
224.269 1527.278 L
225.817 1528.069 L
227.366 1528.254 L
228.914 1528.859 L
230.463 1528.209 L
232.011 1528.475 L
233.56 1535.608 L
235.109 1560.611 L
236.657 1574.218 L
238.206 1567.936 L
239.754 1566.134 L
241.303 1564.64 L
242.851 1564.458 L
244.4 1565.713 L
245.949 1566.75 L
247.497 1566.747 L
249.046 1566.039 L
250.594 1567.228 L
252.143 1566.021 L
253.691 1567.192 L
255.24 1555.475 L
256.789 1525.438 L
258.337 1520.858 L
259.886 1522.779 L
261.434 1524.374 L
262.983 1525.271 L
264.531 1525.926 L
266.08 1526.596 L
267.629 1527.439 L
269.177 1526.777 L
270.726 1526.843 L
272.274 1526.403 L
273.823 1525.86 L
275.371 1525.564 L
276.92 1536.591 L
278.469 1570.321 L
280.017 1568.821 L
281.566 1565.213 L
283.114 1566.476 L
284.663 1570.303 L
286.211 1568.384 L
287.76 1568.481 L
289.309 1566.486 L
290.857 1568.706 L
292.406 1567.971 L
293.954 1567.475 L
295.503 1565.45 L
297.051 1550.316 L
298.6 1528.649 L
300.149 1521.25 L
301.697 1523.955 L
303.246 1524.585 L
304.794 1525.137 L
306.343 1525.453 L
307.891 1525.703 L
309.44 1526.193 L
310.989 1525.728 L
312.537 1526.568 L
314.086 1525.298 L
315.634 1526.596 L
317.183 1527.722 L
318.731 1538.599 L
320.28 1544.31 L
321.829 1527.801 L
323.377 1527.979 L
324.926 1528.741 L
326.474 1527.854 L
328.023 1527.916 L
329.571 1527.838 L
331.12 1528.005 L
332.669 1528.876 L
334.217 1528.549 L
335.766 1528.206 L
337.314 1527.336 L
338.863 1530.55 L
340.411 1548.675 L
341.96 1547.283 L
343.509 1524.1 L
345.057 1524.279 L
346.606 1524.602 L
348.154 1525.287 L
349.703 1524.678 L
351.251 1525.315 L
352.8 1524.255 L
354.349 1526.128 L
355.897 1527.355 L
357.446 1526.54 L
358.994 1526.543 L
360.543 1527.043 L
362.091 1534.565 L
363.64 1554.355 L
365.189 1516.708 L
366.737 1519.57 L
368.286 1521.356 L
369.834 1521.985 L
371.383 1523.284 L
372.931 1522.784 L
374.48 1522.669 L
376.029 1523.302 L
377.577 1523.814 L
379.126 1523.249 L
380.674 1522.799 L
382.223 1523.977 L
383.771 1531.988 L
385.32 1548.262 L
386.869 1544.063 L
388.417 1545.025 L
389.966 1545.345 L
391.514 1545.705 L
393.063 1546.984 L
394.611 1547.762 L
396.16 1547.405 L
397.709 1546.903 L
399.257 1546.967 L
400.806 1547.765 L
402.354 1547.909 L
403.903 1547.201 L
405.451 1542.134 L
407 1527.596 L
408.549 1524.443 L
410.097 1526.708 L
411.646 1529.119 L
413.194 1528.704 L
414.743 1528.217 L
416.291 1528.896 L
417.84 1529.772 L
419.389 1529.242 L
420.937 1529.347 L
422.486 1528.826 L
424.034 1529.188 L
425.583 1540.181 L
427.131 1554.499 L
428.68 1555.161 L
430.229 1552.352 L
431.777 1551.081 L
433.326 1551.282 L
434.874 1550.951 L
436.423 1551.293 L
437.971 1550.25 L
439.52 1550.125 L
441.069 1549.17 L
442.617 1549.576 L
444.166 1549.79 L
445.714 1549.439 L
447.263 1544.402 L
448.811 1522.316 L
450.36 1522.029 L
451.909 1521.923 L
453.457 1524.666 L
455.006 1529.015 L
456.554 1525.026 L
458.103 1525.002 L
459.651 1527.907 L
461.2 1529.821 L
462.749 1529.723 L
464.297 1528.812 L
465.846 1530.181 L
467.394 1531.988 L
468.943 1545.767 L
470.491 1557.746 L
472.04 1556.06 L
473.589 1555.629 L
475.137 1555.689 L
476.686 1554.382 L
478.234 1554.807 L
479.783 1552.913 L
481.331 1552.001 L
482.88 1552.937 L
484.429 1552.948 L
485.977 1552.407 L
487.526 1553 L
489.074 1543.205 L
490.623 1518.318 L
492.171 1515.949 L
493.72 1517.586 L
495.269 1519.612 L
496.817 1519.33 L
498.366 1518.387 L
499.914 1519.9 L
501.463 1519.485 L
503.011 1519.761 L
504.56 1520.361 L
506.109 1519.422 L
507.657 1518.832 L
509.206 1519.625 L
510.754 1525.202 L
512.303 1530.381 L
513.851 1514.354 L
515.4 1517.585 L
516.949 1517.781 L
518.497 1518.284 L
520.046 1518.987 L
521.594 1517.957 L
523.143 1518.241 L
524.691 1518.363 L
526.24 1519.064 L
527.789 1518.891 L
529.337 1517.874 L
530.886 1517.821 L
532.434 1527.005 L
533.983 1533.826 L
535.531 1511.794 L
537.08 1512.253 L
538.629 1514.284 L
540.177 1515.115 L
541.726 1515.269 L
543.274 1515.707 L
544.823 1515.634 L
546.371 1515.552 L
547.92 1515.454 L
549.469 1516.511 L
551.017 1516.191 L
552.566 1517.49 L
554.114 1539.111 L
555.663 1540.101 L
557.211 1511.3 L
558.76 1515.456 L
560.309 1515.454 L
561.857 1516.351 L
563.406 1516.588 L
564.954 1517.089 L
566.503 1516.929 L
568.051 1516.894 L
569.6 1516.65 L
571.149 1516.739 L
572.697 1516.661 L
574.246 1518.482 L
575.794 1525.138 L
577.343 1527.578 L
578.891 1520.145 L
580.44 1523.89 L
581.989 1525.619 L
583.537 1526.055 L
585.086 1527.268 L
586.634 1527.628 L
588.183 1528.331 L
589.731 1528.846 L
591.28 1529.31 L
592.829 1529.724 L
594.377 1529.533 L
595.926 1528.251 L
597.474 1516.188 L
599.023 1510.253 L
600.571 1511.241 L
602.12 1511.84 L
603.669 1512.619 L
605.217 1512.994 L
606.766 1512.822 L
608.314 1512.499 L
609.863 1513.355 L
611.411 1513.052 L
612.96 1513.342 L
614.509 1514.025 L
616.057 1513.299 L
617.606 1514.426 L
619.154 1525.805 L
620.703 1537.297 L
622.251 1532.526 L
623.8 1530.404 L
625.349 1530.097 L
626.897 1530.142 L
628.446 1530.579 L
629.994 1531.301 L
631.543 1530.868 L
633.091 1530.266 L
634.64 1529.998 L
636.189 1530.162 L
637.737 1528.089 L
639.286 1518.266 L
640.834 1507.504 L
642.383 1503.409 L
643.931 1504.557 L
645.48 1505.947 L
647.029 1506.41 L
648.577 1507.207 L
650.126 1507.347 L
651.674 1506.868 L
653.223 1507.206 L
654.771 1507.183 L
656.32 1507.389 L
657.869 1507.804 L
659.417 1507.467 L
660.966 1519.104 L
662.514 1547.033 L
664.063 1545.229 L
665.611 1543.146 L
667.16 1543.382 L
668.709 1543.683 L
670.257 1543.408 L
671.806 1543.502 L
673.354 1543.693 L
674.903 1543.45 L
676.451 1543.595 L
678 1542.871 L
679.549 1542.845 L
681.097 1531.728 L
682.646 1512.231 L
684.194 1505.555 L
685.743 1507.834 L
687.291 1508.517 L
688.84 1510.234 L
690.389 1512.097 L
691.937 1511.851 L
693.486 1512.157 L
695.034 1510.208 L
696.583 1510.993 L
698.131 1511.857 L
699.68 1512.408 L
701.229 1513.026 L
702.777 1518.015 L
704.326 1525.601 L
705.874 1506.907 L
707.423 1509.961 L
708.971 1510.368 L
710.52 1511.371 L
712.069 1510.677 L
713.617 1512.48 L
715.166 1511.602 L
716.714 1511.817 L
718.263 1512.561 L
719.811 1512.184 L
721.36 1512.498 L
722.909 1514.451 L
724.457 1528.466 L
726.006 1526.197 L
727.554 1506.411 L
729.103 1508.301 L
730.651 1509.972 L
732.2 1509.815 L
733.749 1509.872 L
735.297 1509.93 L
736.846 1510.349 L
738.394 1510.275 L
739.943 1510.217 L
741.491 1510.174 L
743.04 1509.705 L
744.589 1512.228 L
746.137 1533.956 L
747.686 1534.537 L
749.234 1506.048 L
750.783 1509.235 L
752.331 1510.174 L
753.88 1509.852 L
755.429 1510.881 L
756.977 1511.829 L
758.526 1510.154 L
760.074 1510.45 L
761.623 1510.3 L
763.171 1510.44 L
764.72 1510.887 L
766.269 1514.415 L
767.817 1521.733 L
769.366 1520.767 L
770.914 1522.341 L
772.463 1521.693 L
774.011 1520.542 L
775.56 1520.055 L
777.109 1519.954 L
778.657 1519.693 L
780.206 1519.229 L
781.754 1519.647 L
783.303 1519.187 L
784.851 1520.714 L
786.4 1519.546 L
787.949 1516.988 L
789.497 1503.782 L
791.046 1502.66 L
792.594 1503.436 L
794.143 1505.188 L
795.691 1504.248 L
797.24 1505.283 L
798.789 1505.921 L
800.337 1505.983 L
801.886 1505.165 L
803.434 1505.101 L
804.983 1505.843 L
806.531 1505.986 L
808.08 1505.632 L
809.629 1509.608 L
811.177 1522.32 L
812.726 1527.936 L
814.274 1528.675 L
815.823 1527.784 L
817.371 1525.49 L
818.92 1526.579 L
820.469 1526.956 L
822.017 1527.076 L
823.566 1526.831 L
825.114 1526.865 L
826.663 1527.078 L
828.211 1527.721 L
829.76 1526.247 L
831.309 1514.35 L
832.857 1502.741 L
834.406 1502.576 L
835.954 1502.406 L
837.503 1503.18 L
839.051 1504.207 L
840.6 1503.846 L
842.149 1505.255 L
843.697 1504.907 L
845.246 1505.516 L
846.794 1505.801 L
848.343 1504.97 L
849.891 1505.047 L
851.44 1506.221 L
852.989 1521.92 L
854.537 1539.356 L
856.086 1538.729 L
857.634 1538.655 L
859.183 1538.275 L
860.731 1537.01 L
862.28 1536.953 L
863.829 1536.566 L
865.377 1536.413 L
866.926 1536.027 L
868.474 1535.147 L
870.023 1535.47 L
871.571 1535.015 L
873.12 1522.827 L
874.669 1497.962 L
876.217 1488.888 L
877.766 1491.868 L
879.314 1493.306 L
880.863 1494.278 L
882.411 1493.693 L
883.96 1493.718 L
885.509 1494.228 L
887.057 1494.341 L
888.606 1495.358 L
890.154 1493.848 L
891.703 1494.895 L
893.251 1495.571 L
894.8 1502.654 L
896.349 1509.333 L
897.897 1493.494 L
899.446 1494.647 L
900.994 1495.619 L
902.543 1496.292 L
904.091 1496.643 L
905.64 1496.621 L
907.189 1496.655 L
908.737 1495.86 L
910.286 1497.51 L
911.834 1497.12 L
913.383 1496.045 L
914.931 1497.811 L
916.48 1512.315 L
918.029 1514.132 L
919.577 1495.438 L
921.126 1497.128 L
922.674 1498.29 L
924.223 1498.184 L
925.771 1499.006 L
927.32 1497.655 L
928.869 1497.791 L
930.417 1497.516 L
931.966 1497.84 L
933.514 1497.89 L
935.063 1497.889 L
936.611 1500.986 L
938.16 1511.776 L
939.709 1524.134 L
941.257 1492.105 L
942.806 1493.271 L
944.354 1496.073 L
945.903 1496.028 L
947.451 1497.138 L
949 1497.204 L
950.549 1496.628 L
952.097 1497.476 L
953.646 1497.443 L
955.194 1497.459 L
956.743 1497.256 L
958.291 1499.702 L
959.84 1510.361 L
961.389 1513.204 L
962.937 1515.96 L
964.486 1516.514 L
966.034 1516.154 L
967.583 1516.356 L
969.131 1516.63 L
970.68 1516.026 L
972.229 1516.621 L
973.777 1516.234 L
975.326 1516.383 L
976.874 1516.578 L
978.423 1517.285 L
979.971 1514.31 L
981.52 1504.442 L
983.069 1493.83 L
984.617 1493.892 L
986.166 1495.557 L
987.714 1494.692 L
989.263 1496.294 L
990.811 1496.265 L
992.36 1497.031 L
993.909 1496.507 L
995.457 1496.621 L
997.006 1496.832 L
998.554 1496.27 L
1000.103 1496.762 L
1001.651 1500.674 L
1003.2 1517.405 L
1004.749 1530.362 L
1006.297 1531.745 L
1007.846 1532.9 L
1009.394 1532.209 L
1010.943 1530.982 L
1012.491 1530.177 L
1014.04 1530.576 L
1015.589 1529.565 L
1017.137 1529.034 L
1018.686 1528.588 L
1020.234 1528.687 L
1021.783 1525.993 L
1023.331 1512.612 L
1024.88 1496.915 L
1026.429 1497.001 L
1027.977 1496.769 L
1029.526 1497.58 L
1031.074 1497.387 L
1032.623 1497.668 L
1034.171 1497.947 L
1035.72 1498.306 L
1037.269 1497.972 L
1038.817 1498.286 L
1040.366 1497.582 L
1041.914 1497.906 L
1043.463 1498.652 L
1045.011 1513.12 L
1046.56 1542.131 L
1048.109 1545.472 L
1049.657 1544.748 L
1051.206 1542.791 L
1052.754 1540.973 L
1054.303 1540.189 L
1055.851 1541.167 L
1057.4 1540.427 L
1058.949 1540.057 L
1060.497 1539.681 L
1062.046 1539.638 L
1063.594 1539.392 L
1065.143 1525.956 L
1066.691 1499.571 L
1068.24 1494.601 L
1069.789 1495.814 L
1071.337 1496.125 L
1072.886 1496.55 L
1074.434 1496.456 L
1075.983 1496.401 L
1077.531 1496.024 L
1079.08 1496.901 L
1080.629 1496.744 L
1082.177 1496.108 L
1083.726 1495.603 L
1085.274 1496.492 L
1086.823 1502.373 L
1088.371 1507.687 L
1089.92 1495.062 L
1091.469 1496.337 L
1093.017 1495.796 L
1094.566 1496.49 L
1096.114 1496.824 L
1097.663 1495.884 L
1099.211 1496.368 L
1100.76 1496.12 L
1102.309 1496.26 L
1103.857 1496.104 L
1105.406 1495.979 L
1106.954 1496.672 L
1108.503 1500.497 L
1110.051 1515.893 L
1111.6 1494.222 L
1113.149 1496.896 L
1114.697 1498.673 L
1116.246 1497.311 L
1117.794 1494.836 L
1119.343 1498.519 L
1120.891 1497.341 L
1122.44 1497.181 L
1123.989 1497.343 L
1125.537 1496.852 L
1127.086 1496.686 L
1128.634 1498.187 L
1130.183 1510.234 L
1131.731 1520.072 L
1133.28 1492.186 L
1134.829 1496.195 L
S
GR
GS
[0.3749 0 0 0.37484 43.217 55.33821] CT
1 0 0 RC
1 LJ
1.333 LW
N
137.549 1543.2 M
139.097 1543.063 L
140.646 1544.256 L
142.194 1543.883 L
143.743 1543.598 L
145.291 1543.727 L
146.84 1544.235 L
148.389 1544.453 L
149.937 1544.309 L
151.486 1544.715 L
153.034 1544.552 L
154.583 1544.415 L
156.131 1544.515 L
157.68 1545.372 L
159.229 1544.347 L
160.777 1543.845 L
162.326 1544.024 L
163.874 1543.982 L
165.423 1544.526 L
166.971 1544.59 L
168.52 1544.707 L
170.069 1543.893 L
171.617 1544.457 L
173.166 1544.645 L
174.714 1544.816 L
176.263 1544.297 L
177.811 1544.522 L
179.36 1544.247 L
180.909 1544.203 L
182.457 1544.406 L
184.006 1544.153 L
185.554 1543.713 L
187.103 1543.834 L
188.651 1543.739 L
190.2 1544.43 L
191.749 1562.877 L
193.297 1637.341 L
194.846 1664.592 L
196.394 1665.507 L
197.943 1664.544 L
199.491 1662.769 L
201.04 1662.046 L
202.589 1661.025 L
204.137 1659.089 L
205.686 1658.364 L
207.234 1655.601 L
208.783 1655.247 L
210.331 1654.256 L
211.88 1626.503 L
213.429 1570.264 L
214.977 1516.77 L
216.526 1523.805 L
218.074 1525.823 L
219.623 1526.764 L
221.171 1526.009 L
222.72 1527.1 L
224.269 1526.764 L
225.817 1526.422 L
227.366 1526.29 L
228.914 1525.385 L
230.463 1523.952 L
232.011 1524.166 L
233.56 1565.029 L
235.109 1724.677 L
236.657 1821.451 L
238.206 1812.59 L
239.754 1804.829 L
241.303 1799.025 L
242.851 1795.912 L
244.4 1791.445 L
245.949 1789.215 L
247.497 1786.72 L
249.046 1785.089 L
250.594 1784.82 L
252.143 1783.014 L
253.691 1773.775 L
255.24 1694.109 L
256.789 1586.849 L
258.337 1573.182 L
259.886 1573.702 L
261.434 1572.096 L
262.983 1571.375 L
264.531 1571.726 L
266.08 1571.971 L
267.629 1571.661 L
269.177 1572.361 L
270.726 1571.198 L
272.274 1570.524 L
273.823 1569.749 L
275.371 1569.75 L
276.92 1625.712 L
278.469 1793.34 L
280.017 1816.618 L
281.566 1801.098 L
283.114 1787.965 L
284.663 1775.764 L
286.211 1776.624 L
287.76 1775.036 L
289.309 1772.231 L
290.857 1767.835 L
292.406 1765.743 L
293.954 1766.386 L
295.503 1760.628 L
297.051 1697.831 L
298.6 1594.135 L
300.149 1555.915 L
301.697 1556.121 L
303.246 1556.652 L
304.794 1556.535 L
306.343 1556.988 L
307.891 1556.339 L
309.44 1556.026 L
310.989 1555.673 L
312.537 1555.09 L
314.086 1554.507 L
315.634 1554.124 L
317.183 1558.936 L
318.731 1612.732 L
320.28 1640.475 L
321.829 1570.538 L
323.377 1570.917 L
324.926 1570.578 L
326.474 1568.732 L
328.023 1567.906 L
329.571 1567.348 L
331.12 1567.431 L
332.669 1567.317 L
334.217 1567.133 L
335.766 1567.299 L
337.314 1566.648 L
338.863 1572.614 L
340.411 1655.975 L
341.96 1649.193 L
343.509 1555.625 L
345.057 1552.372 L
346.606 1553.615 L
348.154 1553.82 L
349.703 1552.933 L
351.251 1552.372 L
352.8 1552.593 L
354.349 1553.295 L
355.897 1553.901 L
357.446 1554.701 L
358.994 1554.093 L
360.543 1553.751 L
362.091 1590.395 L
363.64 1672.016 L
365.189 1520.955 L
366.737 1528.609 L
368.286 1533.332 L
369.834 1534.248 L
371.383 1534.226 L
372.931 1535.417 L
374.48 1536.28 L
376.029 1536.21 L
377.577 1536.885 L
379.126 1537.362 L
380.674 1537.335 L
382.223 1539.263 L
383.771 1565.928 L
385.32 1629.522 L
386.869 1619.857 L
388.417 1622.413 L
389.966 1627.374 L
391.514 1629.247 L
393.063 1631.303 L
394.611 1632.329 L
396.16 1632.991 L
397.709 1632.88 L
399.257 1633.133 L
400.806 1632.941 L
402.354 1633.55 L
403.903 1633.872 L
405.451 1618.298 L
407 1574.674 L
408.549 1569.845 L
410.097 1573.363 L
411.646 1575.362 L
413.194 1575.971 L
414.743 1576.562 L
416.291 1576.745 L
417.84 1577.189 L
419.389 1577.07 L
420.937 1576.965 L
422.486 1576.332 L
424.034 1577.485 L
425.583 1609.409 L
427.131 1680.444 L
428.68 1698.377 L
430.229 1692.741 L
431.777 1688.105 L
433.326 1683.646 L
434.874 1681.744 L
436.423 1681.226 L
437.971 1679.828 L
439.52 1680.283 L
441.069 1678.493 L
442.617 1675.981 L
444.166 1675.636 L
445.714 1672.875 L
447.263 1637.996 L
448.811 1560.613 L
450.36 1556.895 L
451.909 1563.54 L
453.457 1563.991 L
455.006 1561.202 L
456.554 1564.668 L
458.103 1569.614 L
459.651 1568.725 L
461.2 1570.053 L
462.749 1570.354 L
464.297 1570.506 L
465.846 1571.731 L
467.394 1590.333 L
468.943 1652.332 L
470.491 1702.357 L
472.04 1699.007 L
473.589 1700.703 L
475.137 1701.446 L
476.686 1698.88 L
478.234 1696.913 L
479.783 1694.699 L
481.331 1690.964 L
482.88 1692.584 L
484.429 1691.761 L
485.977 1691.551 L
487.526 1690.784 L
489.074 1656.886 L
490.623 1573.659 L
492.171 1567.875 L
493.72 1572.592 L
495.269 1573.488 L
496.817 1574.238 L
498.366 1573.446 L
499.914 1573.908 L
501.463 1574.396 L
503.011 1573.501 L
504.56 1573.853 L
506.109 1573.957 L
507.657 1573.49 L
509.206 1574.183 L
510.754 1591.13 L
512.303 1615.381 L
513.851 1568.194 L
515.4 1573.06 L
516.949 1574.545 L
518.497 1575.042 L
520.046 1574.921 L
521.594 1576.013 L
523.143 1575.805 L
524.691 1575.512 L
526.24 1575.306 L
527.789 1574.854 L
529.337 1576.572 L
530.886 1576.262 L
532.434 1610.043 L
533.983 1644.76 L
535.531 1565.536 L
537.08 1569.785 L
538.629 1572.073 L
540.177 1572.078 L
541.726 1572.528 L
543.274 1572.666 L
544.823 1573.567 L
546.371 1573.52 L
547.92 1573.246 L
549.469 1573.67 L
551.017 1573.239 L
552.566 1577.562 L
554.114 1662.622 L
555.663 1675.076 L
557.211 1579.602 L
558.76 1583.684 L
560.309 1584.323 L
561.857 1583.698 L
563.406 1583.114 L
564.954 1583.308 L
566.503 1583.293 L
568.051 1583.506 L
569.6 1583.926 L
571.149 1583.169 L
572.697 1583.497 L
574.246 1584.606 L
575.794 1612.624 L
577.343 1626.141 L
578.891 1601.702 L
580.44 1613.425 L
581.989 1618.907 L
583.537 1621.415 L
585.086 1624.371 L
586.634 1625.234 L
588.183 1626.715 L
589.731 1626.804 L
591.28 1626.068 L
592.829 1627.58 L
594.377 1627.105 L
595.926 1623.14 L
597.474 1588.275 L
599.023 1566.966 L
600.571 1569.098 L
602.12 1570.994 L
603.669 1571.973 L
605.217 1572.305 L
606.766 1572.893 L
608.314 1573.519 L
609.863 1573.577 L
611.411 1574.296 L
612.96 1575.114 L
614.509 1575.13 L
616.057 1575.199 L
617.606 1576.778 L
619.154 1625.027 L
620.703 1674.254 L
622.251 1661.983 L
623.8 1653.684 L
625.349 1650.966 L
626.897 1650.616 L
628.446 1650.706 L
629.994 1649.529 L
631.543 1648.947 L
633.091 1647.998 L
634.64 1648.385 L
636.189 1647.717 L
637.737 1639.402 L
639.286 1606.649 L
640.834 1565.149 L
642.383 1557.036 L
643.931 1558.819 L
645.48 1559.869 L
647.029 1561.267 L
648.577 1561.798 L
650.126 1562.271 L
651.674 1562.344 L
653.223 1562.751 L
654.771 1562.63 L
656.32 1563.25 L
657.869 1563.554 L
659.417 1564.93 L
660.966 1602.08 L
662.514 1713.714 L
664.063 1715.81 L
665.611 1707.295 L
667.16 1704.9 L
668.709 1702.95 L
670.257 1701.408 L
671.806 1698.939 L
673.354 1696.451 L
674.903 1694.836 L
676.451 1694.95 L
678 1694.631 L
679.549 1692.242 L
681.097 1647.961 L
682.646 1584.546 L
684.194 1571.48 L
685.743 1574.362 L
687.291 1575.339 L
688.84 1576.325 L
690.389 1577.814 L
691.937 1577.962 L
693.486 1577.87 L
695.034 1578.288 L
696.583 1578.891 L
698.131 1578.287 L
699.68 1578.02 L
701.229 1578.997 L
702.777 1596.679 L
704.326 1625.439 L
705.874 1567.798 L
707.423 1573.298 L
708.971 1575.313 L
710.52 1577.057 L
712.069 1577.48 L
713.617 1577.678 L
715.166 1577.464 L
716.714 1578.06 L
718.263 1578.471 L
719.811 1578.223 L
721.36 1578.048 L
722.909 1581.668 L
724.457 1628.001 L
726.006 1632.346 L
727.554 1570.035 L
729.103 1573.341 L
730.651 1576.139 L
732.2 1576.508 L
733.749 1576.863 L
735.297 1577.401 L
736.846 1576.888 L
738.394 1576.406 L
739.943 1576.42 L
741.491 1576.012 L
743.04 1576.325 L
744.589 1580.893 L
746.137 1655.638 L
747.686 1675.753 L
749.234 1577.097 L
750.783 1579.105 L
752.331 1580.951 L
753.88 1580.792 L
755.429 1580.906 L
756.977 1581.084 L
758.526 1580.665 L
760.074 1580.696 L
761.623 1580.66 L
763.171 1580.655 L
764.72 1580.656 L
766.269 1585.16 L
767.817 1612.099 L
769.366 1615.449 L
770.914 1615.067 L
772.463 1614.984 L
774.011 1614.975 L
775.56 1614.61 L
777.109 1613.979 L
778.657 1613.285 L
780.206 1613.377 L
781.754 1613.626 L
783.303 1614.177 L
784.851 1614.017 L
786.4 1613.376 L
787.949 1605.55 L
789.497 1569.896 L
791.046 1566.714 L
792.594 1568.981 L
794.143 1569.781 L
795.691 1570.331 L
797.24 1571.615 L
798.789 1572.801 L
800.337 1573.357 L
801.886 1572.841 L
803.434 1572.283 L
804.983 1573.075 L
806.531 1572.796 L
808.08 1573.547 L
809.629 1582.144 L
811.177 1622.652 L
812.726 1645.378 L
814.274 1645.185 L
815.823 1642.672 L
817.371 1641.117 L
818.92 1640.982 L
820.469 1640.817 L
822.017 1640.589 L
823.566 1639.808 L
825.114 1639.552 L
826.663 1639.762 L
828.211 1639.046 L
829.76 1633.6 L
831.309 1602.385 L
832.857 1564.162 L
834.406 1561.913 L
835.954 1563.643 L
837.503 1564.746 L
839.051 1565.658 L
840.6 1567.974 L
842.149 1568.657 L
843.697 1568.866 L
845.246 1568.976 L
846.794 1569.326 L
848.343 1568.834 L
849.891 1569 L
851.44 1573.33 L
852.989 1625.213 L
854.537 1699.718 L
856.086 1698.556 L
857.634 1697.912 L
859.183 1696.917 L
860.731 1695.865 L
862.28 1692.531 L
863.829 1691.573 L
865.377 1690.134 L
866.926 1689.314 L
868.474 1687.807 L
870.023 1687.033 L
871.571 1684.862 L
873.12 1641.892 L
874.669 1573.323 L
876.217 1544.576 L
877.766 1547.059 L
879.314 1548.1 L
880.863 1549.155 L
882.411 1549.441 L
883.96 1549.398 L
885.509 1549.911 L
887.057 1550.001 L
888.606 1551.103 L
890.154 1551.756 L
891.703 1551.723 L
893.251 1552.709 L
894.8 1568.181 L
896.349 1591.369 L
897.897 1546.68 L
899.446 1550.289 L
900.994 1551.777 L
902.543 1553.253 L
904.091 1554.472 L
905.64 1555.288 L
907.189 1555.567 L
908.737 1555.181 L
910.286 1555.837 L
911.834 1555.746 L
913.383 1555.89 L
914.931 1558.311 L
916.48 1596.965 L
918.029 1614.669 L
919.577 1555.13 L
921.126 1558.815 L
922.674 1559.868 L
924.223 1561.092 L
925.771 1560.455 L
927.32 1561.382 L
928.869 1561.089 L
930.417 1561.512 L
931.966 1562.148 L
933.514 1560.78 L
935.063 1561.435 L
936.611 1566.147 L
938.16 1598.935 L
939.709 1653.695 L
941.257 1546.44 L
942.806 1550.791 L
944.354 1553.725 L
945.903 1553.852 L
947.451 1554.958 L
949 1555.596 L
950.549 1555.728 L
952.097 1556.374 L
953.646 1557.736 L
955.194 1557.084 L
956.743 1557.081 L
958.291 1561.353 L
959.84 1588.823 L
961.389 1602.972 L
962.937 1610.141 L
964.486 1611.272 L
966.034 1610.949 L
967.583 1611.468 L
969.131 1611.181 L
970.68 1610.663 L
972.229 1611.648 L
973.777 1611.373 L
975.326 1611.667 L
976.874 1610.774 L
978.423 1611.115 L
979.971 1607.844 L
981.52 1582.158 L
983.069 1552.719 L
984.617 1552.541 L
986.166 1555.259 L
987.714 1555.394 L
989.263 1556.981 L
990.811 1557.88 L
992.36 1560.523 L
993.909 1560.224 L
995.457 1560.245 L
997.006 1560.516 L
998.554 1560.885 L
1000.103 1561.041 L
1001.651 1567.477 L
1003.2 1619.709 L
1004.749 1669.355 L
1006.297 1669.891 L
1007.846 1669.887 L
1009.394 1668.098 L
1010.943 1666.724 L
1012.491 1666.166 L
1014.04 1665.957 L
1015.589 1664.369 L
1017.137 1663.964 L
1018.686 1663.406 L
1020.234 1663.092 L
1021.783 1651.202 L
1023.331 1612.872 L
1024.88 1571.328 L
1026.429 1568.354 L
1027.977 1568.826 L
1029.526 1568.847 L
1031.074 1568.284 L
1032.623 1568.985 L
1034.171 1569.319 L
1035.72 1568.929 L
1037.269 1569.574 L
1038.817 1568.978 L
1040.366 1569.711 L
1041.914 1569.268 L
1043.463 1573.471 L
1045.011 1610.171 L
1046.56 1699.532 L
1048.109 1716.493 L
1049.657 1712.718 L
1051.206 1709.142 L
1052.754 1705.957 L
1054.303 1705.064 L
1055.851 1702.866 L
1057.4 1702.433 L
1058.949 1701.282 L
1060.497 1700.216 L
1062.046 1699.798 L
1063.594 1695.561 L
1065.143 1649.414 L
1066.691 1575.956 L
1068.24 1561.021 L
1069.789 1562.227 L
1071.337 1562.758 L
1072.886 1562.904 L
1074.434 1563.807 L
1075.983 1564.045 L
1077.531 1564.243 L
1079.08 1564.004 L
1080.629 1565.154 L
1082.177 1564.5 L
1083.726 1564.005 L
1085.274 1564.719 L
1086.823 1583.349 L
1088.371 1605.687 L
1089.92 1563.231 L
1091.469 1566.025 L
1093.017 1566.452 L
1094.566 1566.493 L
1096.114 1567.53 L
1097.663 1567.346 L
1099.211 1567.688 L
1100.76 1567.058 L
1102.309 1567.18 L
1103.857 1567.635 L
1105.406 1567.173 L
1106.954 1567.365 L
1108.503 1580.056 L
1110.051 1623.774 L
1111.6 1558.035 L
1113.149 1563.626 L
1114.697 1566.081 L
1116.246 1568.753 L
1117.794 1569.499 L
1119.343 1569.598 L
1120.891 1568.131 L
1122.44 1567.951 L
1123.989 1568.099 L
1125.537 1568.131 L
1127.086 1568.163 L
1128.634 1568.879 L
1130.183 1606.267 L
1131.731 1652.896 L
1133.28 1550.01 L
1134.829 1555.378 L
S
GR
GS
[0.3749 0 0 0.37484 43.217 55.33821] CT
1 GC
N
1201 1837 M
1201 1746 L
1059 1746 L
1059 1837 L
cp
f
GR
GS
[0.3749 0 0 0.37484 475.47749 716.37462] CT
/Helvetica 22.8 F
GS
[1 0 0 1 0 0] CT
0 8.5 moveto 
1 -1 scale
(pitch) t 
GR
GR
GS
[0.3749 0 0 0.37484 43.217 55.33821] CT
0 0 1 RC
1 LJ
1.333 LW
N
1067 1763.5 M
1147 1763.5 L
S
GR
GS
[0.3749 0 0 0.37484 475.47749 726.87024] CT
/Helvetica 22.8 F
GS
[1 0 0 1 0 0] CT
0 8.5 moveto 
1 -1 scale
(roll) t 
GR
GR
GS
[0.3749 0 0 0.37484 43.217 55.33821] CT
0 0.502 0 RC
1 LJ
1.333 LW
N
1067 1791.5 M
1147 1791.5 L
S
GR
GS
[0.3749 0 0 0.37484 475.47749 737.36586] CT
/Helvetica 22.8 F
GS
[1 0 0 1 0 0] CT
0 8.5 moveto 
1 -1 scale
(yaw) t 
GR
GR
GS
[0.3749 0 0 0.37484 43.217 55.33821] CT
1 0 0 RC
1 LJ
1.333 LW
N
1067 1819.5 M
1147 1819.5 L
S
GR
GS
[0.3749 0 0 0.37484 43.217 55.33821] CT
10.0 ML
1.333 LW
N
1059 1837 M
1059 1746 L
1201 1746 L
1201 1837 L
cp
S
GR
showpage
%%Trailer
%%Pages: 1
%%EOF
