{
	"history": {
		"procstep": {
			"descrip": "dicom to nifti import",
			"version": [
				"matlab 9.8.0.1323502 (R2020a)",
				"spm_dicom_convert.m - SPM12 (7771)"
			],
			"procpar": []
		},
		"input": {
			"filename": "AnonymousFileName",
			"history": []
		},
		"output": {
			"imtype": "ORIGINAL\\PRIMARY\\M\\ND\\NORM\\MOSAIC ",
			"units": "a.u."
		}
	},
	"acqpar": [
		{
			"FileMetaInformationGroupLength": 208,
			"FileMetaInformationVersion": [0,1],
			"MediaStorageSOPClassUID": "1.2.840.10008.5.1.4.1.1.4",
			"MediaStorageSOPInstanceUID": "1.3.12.2.1107.5.2.43.67018.2021050415334436813931794",
			"TransferSyntaxUID": "1.2.840.10008.1.2.1",
			"ImplementationClassUID": "1.2.276.0.7230010.3.0.3.6.1",
			"ImplementationVersionName": "OSIRIX_361",
			"Tag_0002_0017": "lavimarch3",
			"SpecificCharacterSet": "ISO_IR 100",
			"ImageType": "ORIGINAL\\PRIMARY\\M\\ND\\NORM\\MOSAIC ",
			"InstanceCreationDate": 738280,
			"InstanceCreationTime": 56027.956,
			"SOPClassUID": "1.2.840.10008.5.1.4.1.1.4",
			"SOPInstanceUID": "1.3.12.2.1107.5.2.43.67018.2021050415334436813931794",
			"StudyDate": 738280,
			"SeriesDate": 738280,
			"AcquisitionDate": 738280,
			"ContentDate": 738280,
			"StudyTime": 54273.882,
			"SeriesTime": 55867.889,
			"AcquisitionTime": 56023.245,
			"ContentTime": 56027.956,
			"Modality": "MR",
			"Manufacturer": "SIEMENS ",
			"InstitutionName": "HUG ",
			"InstitutionAddress": "Av. de la Roseraie 51,Geneve,District,CH,1211 Geneve  14",
			"StationName": "MRAWP67018",
			"StudyDescription": "RECHERCHE_CIBM^Oscar",
			"SeriesDescription": "1_EPI_trainingRL",
			"InstitutionalDepartmentName": "Department",
			"OperatorsName": "Oscar ",
			"ManufacturerModelName": "Prisma_fit",
			"ReferencedPerformedProcedureStepSequence": [
				{
					"ReferencedSOPClassUID": "1.2.840.10008.3.1.2.3.3",
					"ReferencedSOPInstanceUID": "1.3.12.2.1107.5.2.43.67018.30000021050405243772500000008"
				}
			],
			"ReferencedImageSequence": [
				{
					"ReferencedSOPClassUID": "1.2.840.10008.5.1.4.1.1.4",
					"ReferencedSOPInstanceUID": "1.3.12.2.1107.5.2.43.67018.2021050415172268773897337"
				},
				{
					"ReferencedSOPClassUID": "1.2.840.10008.5.1.4.1.1.4",
					"ReferencedSOPInstanceUID": "1.3.12.2.1107.5.2.43.67018.2021050415172270787797361"
				},
				{
					"ReferencedSOPClassUID": "1.2.840.10008.5.1.4.1.1.4",
					"ReferencedSOPInstanceUID": "1.3.12.2.1107.5.2.43.67018.2021050415172274201397388"
				}
			],
			"SourceImageSequence": [
				{
					"ReferencedSOPClassUID": "1.2.840.10008.5.1.4.1.1.4",
					"ReferencedSOPInstanceUID": "1.3.12.2.1107.5.2.43.67018.2021050415334429528231687"
				},
				{
					"ReferencedSOPClassUID": "1.2.840.10008.5.1.4.1.1.4",
					"ReferencedSOPInstanceUID": "1.3.12.2.1107.5.2.43.67018.2021050415334430074631690"
				},
				{
					"ReferencedSOPClassUID": "1.2.840.10008.5.1.4.1.1.4",
					"ReferencedSOPInstanceUID": "1.3.12.2.1107.5.2.43.67018.2021050415334431195231693"
				},
				{
					"ReferencedSOPClassUID": "1.2.840.10008.5.1.4.1.1.4",
					"ReferencedSOPInstanceUID": "1.3.12.2.1107.5.2.43.67018.2021050415334432090531696"
				},
				{
					"ReferencedSOPClassUID": "1.2.840.10008.5.1.4.1.1.4",
					"ReferencedSOPInstanceUID": "1.3.12.2.1107.5.2.43.67018.2021050415334433141331705"
				},
				{
					"ReferencedSOPClassUID": "1.2.840.10008.5.1.4.1.1.4",
					"ReferencedSOPInstanceUID": "1.3.12.2.1107.5.2.43.67018.2021050415334433218331706"
				},
				{
					"ReferencedSOPClassUID": "1.2.840.10008.5.1.4.1.1.4",
					"ReferencedSOPInstanceUID": "1.3.12.2.1107.5.2.43.67018.2021050415334433288631709"
				},
				{
					"ReferencedSOPClassUID": "1.2.840.10008.5.1.4.1.1.4",
					"ReferencedSOPInstanceUID": "1.3.12.2.1107.5.2.43.67018.2021050415334433377231712"
				},
				{
					"ReferencedSOPClassUID": "1.2.840.10008.5.1.4.1.1.4",
					"ReferencedSOPInstanceUID": "1.3.12.2.1107.5.2.43.67018.2021050415334433496131715"
				},
				{
					"ReferencedSOPClassUID": "1.2.840.10008.5.1.4.1.1.4",
					"ReferencedSOPInstanceUID": "1.3.12.2.1107.5.2.43.67018.2021050415334433622831718"
				},
				{
					"ReferencedSOPClassUID": "1.2.840.10008.5.1.4.1.1.4",
					"ReferencedSOPInstanceUID": "1.3.12.2.1107.5.2.43.67018.2021050415334433740631721"
				},
				{
					"ReferencedSOPClassUID": "1.2.840.10008.5.1.4.1.1.4",
					"ReferencedSOPInstanceUID": "1.3.12.2.1107.5.2.43.67018.2021050415334433836231722"
				},
				{
					"ReferencedSOPClassUID": "1.2.840.10008.5.1.4.1.1.4",
					"ReferencedSOPInstanceUID": "1.3.12.2.1107.5.2.43.67018.2021050415334433957031725"
				},
				{
					"ReferencedSOPClassUID": "1.2.840.10008.5.1.4.1.1.4",
					"ReferencedSOPInstanceUID": "1.3.12.2.1107.5.2.43.67018.2021050415334434084831726"
				},
				{
					"ReferencedSOPClassUID": "1.2.840.10008.5.1.4.1.1.4",
					"ReferencedSOPInstanceUID": "1.3.12.2.1107.5.2.43.67018.2021050415334434364631733"
				},
				{
					"ReferencedSOPClassUID": "1.2.840.10008.5.1.4.1.1.4",
					"ReferencedSOPInstanceUID": "1.3.12.2.1107.5.2.43.67018.2021050415334434480831736"
				},
				{
					"ReferencedSOPClassUID": "1.2.840.10008.5.1.4.1.1.4",
					"ReferencedSOPInstanceUID": "1.3.12.2.1107.5.2.43.67018.2021050415334434585631739"
				},
				{
					"ReferencedSOPClassUID": "1.2.840.10008.5.1.4.1.1.4",
					"ReferencedSOPInstanceUID": "1.3.12.2.1107.5.2.43.67018.2021050415334434704631743"
				},
				{
					"ReferencedSOPClassUID": "1.2.840.10008.5.1.4.1.1.4",
					"ReferencedSOPInstanceUID": "1.3.12.2.1107.5.2.43.67018.2021050415334434787031746"
				},
				{
					"ReferencedSOPClassUID": "1.2.840.10008.5.1.4.1.1.4",
					"ReferencedSOPInstanceUID": "1.3.12.2.1107.5.2.43.67018.2021050415334434887331749"
				},
				{
					"ReferencedSOPClassUID": "1.2.840.10008.5.1.4.1.1.4",
					"ReferencedSOPInstanceUID": "1.3.12.2.1107.5.2.43.67018.2021050415334434995731752"
				},
				{
					"ReferencedSOPClassUID": "1.2.840.10008.5.1.4.1.1.4",
					"ReferencedSOPInstanceUID": "1.3.12.2.1107.5.2.43.67018.2021050415334435099231755"
				},
				{
					"ReferencedSOPClassUID": "1.2.840.10008.5.1.4.1.1.4",
					"ReferencedSOPInstanceUID": "1.3.12.2.1107.5.2.43.67018.2021050415334435209331758"
				},
				{
					"ReferencedSOPClassUID": "1.2.840.10008.5.1.4.1.1.4",
					"ReferencedSOPInstanceUID": "1.3.12.2.1107.5.2.43.67018.2021050415334435340731761"
				},
				{
					"ReferencedSOPClassUID": "1.2.840.10008.5.1.4.1.1.4",
					"ReferencedSOPInstanceUID": "1.3.12.2.1107.5.2.43.67018.2021050415334435430731764"
				},
				{
					"ReferencedSOPClassUID": "1.2.840.10008.5.1.4.1.1.4",
					"ReferencedSOPInstanceUID": "1.3.12.2.1107.5.2.43.67018.2021050415334435572531767"
				},
				{
					"ReferencedSOPClassUID": "1.2.840.10008.5.1.4.1.1.4",
					"ReferencedSOPInstanceUID": "1.3.12.2.1107.5.2.43.67018.2021050415334435639031770"
				},
				{
					"ReferencedSOPClassUID": "1.2.840.10008.5.1.4.1.1.4",
					"ReferencedSOPInstanceUID": "1.3.12.2.1107.5.2.43.67018.2021050415334435812431773"
				},
				{
					"ReferencedSOPClassUID": "1.2.840.10008.5.1.4.1.1.4",
					"ReferencedSOPInstanceUID": "1.3.12.2.1107.5.2.43.67018.2021050415334435844831776"
				},
				{
					"ReferencedSOPClassUID": "1.2.840.10008.5.1.4.1.1.4",
					"ReferencedSOPInstanceUID": "1.3.12.2.1107.5.2.43.67018.2021050415334436070331781"
				},
				{
					"ReferencedSOPClassUID": "1.2.840.10008.5.1.4.1.1.4",
					"ReferencedSOPInstanceUID": "1.3.12.2.1107.5.2.43.67018.2021050415334436107631782"
				},
				{
					"ReferencedSOPClassUID": "1.2.840.10008.5.1.4.1.1.4",
					"ReferencedSOPInstanceUID": "1.3.12.2.1107.5.2.43.67018.2021050415334436266831785"
				},
				{
					"ReferencedSOPClassUID": "1.2.840.10008.5.1.4.1.1.4",
					"ReferencedSOPInstanceUID": "1.3.12.2.1107.5.2.43.67018.2021050415334436331231786"
				},
				{
					"ReferencedSOPClassUID": "1.2.840.10008.5.1.4.1.1.4",
					"ReferencedSOPInstanceUID": "1.3.12.2.1107.5.2.43.67018.2021050415334436468631791"
				},
				{
					"ReferencedSOPClassUID": "1.2.840.10008.5.1.4.1.1.4",
					"ReferencedSOPInstanceUID": "1.3.12.2.1107.5.2.43.67018.2021050415334436597631792"
				},
				{
					"ReferencedSOPClassUID": "1.2.840.10008.5.1.4.1.1.4",
					"ReferencedSOPInstanceUID": "1.3.12.2.1107.5.2.43.67018.2021050415334436690331793"
				}
			],
			"PatientName": "Anonymous",
			"PatientID": "MoCoSubject2",
			"PatientSex": "M ",
			"PatientAge": 121.3,
			"PatientSize": 1.9,
			"PatientWeight": 80,
			"BodyPartExamined": "BRAIN ",
			"ScanningSequence": "EP",
			"SequenceVariant": "SK\\OSP",
			"ScanOptions": "FS",
			"MRAcquisitionType": "2D",
			"SequenceName": "*epfid2d1_64",
			"AngioFlag": "N ",
			"SliceThickness": 3,
			"RepetitionTime": 600,
			"EchoTime": 30,
			"NumberOfAverages": 1,
			"ImagingFrequency": 123.25259,
			"ImagedNucleus": "1H",
			"EchoNumbers": 1,
			"MagneticFieldStrength": 3,
			"SpacingBetweenSlices": 3.3000000307024,
			"NumberOfPhaseEncodingSteps": 70,
			"EchoTrainLength": 35,
			"PercentSampling": 100,
			"PercentPhaseFieldOfView": 100,
			"PixelBandwidth": 2230,
			"DeviceSerialNumber": "67018 ",
			"SoftwareVersions": "syngo MR E11",
			"ProtocolName": "1_EPI_trainingRL",
			"TransmitCoilName": "Body",
			"AcquisitionMatrix": [64,0,0,64],
			"InPlanePhaseEncodingDirection": "COL ",
			"FlipAngle": 50,
			"VariableFlipAngleFlag": "N ",
			"SAR": 0.06462781830962,
			"dBdt": 0,
			"PatientPosition": "HFS ",
			"Private_0019_0010": "SIEMENS MR HEADER ",
			"Private_0019_1008": "IMAGE NUM 4 ",
			"Private_0019_1009": "1.0 ",
			"Private_0019_100a": 36,
			"Private_0019_100b": 395000,
			"Private_0019_1011": "No",
			"Private_0019_1012": [0,0,-1250],
			"Private_0019_1013": [0,0,-1250],
			"Private_0019_1014": [0,0,0],
			"Private_0019_1015": [-579.48205301,-580.55103024,-8.210737160000001],
			"Private_0019_1016": 185.0075,
			"Private_0019_1017": 1,
			"Private_0019_1018": 3500,
			"Private_0019_1028": 49.419,
			"Private_0019_1029": [260.00000001,0,322.50000001,65,387.50000001,130,452.50000001,195.00000001,517.50000002,260.00000001,0,322.50000001,65,387.50000001,130,452.50000001,195.00000001,517.50000002,260.00000001,0,322.50000001,65,387.50000001,130,452.50000001,195.00000001,517.50000002,260.00000001,0,322.50000001,65,387.50000001,130,452.50000001,195.00000001,517.50000002],
			"StudyInstanceUID": "1.3.12.2.1107.5.2.43.67018.30000021050405243752800000009",
			"SeriesInstanceUID": "1.3.12.2.1107.5.2.43.67018.2021050415302430859699232.0.0.0",
			"StudyID": "1 ",
			"SeriesNumber": 7,
			"AcquisitionNumber": 296,
			"InstanceNumber": 296,
			"ImagePositionPatient": [-579.48205300744,-580.55103024121,-8.210737159428],
			"ImageOrientationPatient": [0.9987820341531199,-0.0038807115029,0.04918727814373,0.01045954095605,0.99089774216291,-0.1342097708047],
			"FrameOfReferenceUID": "1.3.12.2.1107.5.2.43.67018.1.20210504150433975.0.0.0",
			"SliceLocation": -58.303936082866,
			"ImageComments": "Subject2",
			"SamplesPerPixel": 1,
			"PhotometricInterpretation": "MONOCHROME2 ",
			"Rows": 384,
			"Columns": 384,
			"PixelSpacing": [3,3],
			"BitsAllocated": 16,
			"BitsStored": 12,
			"HighBit": 11,
			"PixelRepresentation": 0,
			"SmallestImagePixelValue": 0,
			"LargestImagePixelValue": 872,
			"WindowCenter": 493,
			"WindowWidth": 1019,
			"WindowCenterWidthExplanation": "Algo1 ",
			"PrivateCreatorCode": "SIEMENS CSA HEADER",
			"AnotherPrivateCreatorCode": "SIEMENS MEDCOM HEADER2",
			"CSAImageHeaderType": "IMAGE NUM 4 ",
			"CSAImageHeaderVersion": "20210504",
			"CSAImageHeaderInfo": {
				"EchoLinePosition": 35,
				"EchoColumnPosition": 32,
				"EchoPartitionPosition": 32,
				"UsedChannelString": "XXXXXXXXXXX",
				"ICE_Dims": "X_1_1_1_296_1_1_19_1_1_1_1_361",
				"ProtocolSliceNumber": 0,
				"RealDwellTime": 3500,
				"SliceMeasurementDuration": 395000,
				"SequenceMask": 134217732,
				"AcquisitionMatrixText": "64*64",
				"MeasuredFourierLines": 0,
				"PhaseEncodingDirectionPositive": 1,
				"NumberOfImagesInMosaic": 36,
				"SliceNormalVector": [-0.04821866,0.13456071,0.9897314699999999],
				"TimeAfterStart": 185.0075,
				"ImaAbsTablePosition": [0,0,-1250],
				"NonPlanarImage": 0,
				"SlicePosition_PCS": [-579.48205301,-580.55103024,-8.210737160000001],
				"MultistepIndex": 0,
				"ImaRelTablePosition": [0,0,0],
				"ImaCoilString": "HE1-4;NE1,2",
				"RFSWDDataType": "predicted",
				"GSWDDataType": "predicted",
				"ImaPATModeText": "p2 s4",
				"BandwidthPerPixelPhaseEncode": 49.419,
				"MosaicRefAcqTimes": [260.00000001,0,322.50000001,65,387.50000001,130,452.50000001,195.00000001,517.50000002,260.00000001,0,322.50000001,65,387.50000001,130,452.50000001,195.00000001,517.50000002,260.00000001,0,322.50000001,65,387.50000001,130,452.50000001,195.00000001,517.50000002,260.00000001,0,322.50000001,65,387.50000001,130,452.50000001,195.00000001,517.50000002],
				"ImageHistory": [
					"ChannelMixing:ND=true_CMM=2_CDM=1",
					"CC:SoS",
					"NormalizeAlgo:PreScan"
				]
			},
			"CSASeriesHeaderType": "MR",
			"CSASeriesHeaderVersion": "20210504",
			"CSASeriesHeaderInfo": {
				"UsedPatientWeight": 80,
				"NumberOfPrescans": 0,
				"TransmitterCalibration": 286.172084,
				"PhaseGradientAmplitude": 0,
				"ReadoutGradientAmplitude": 0,
				"SelectionGradientAmplitude": 0,
				"GradientDelayTime": [35,35,30],
				"RfWatchdogMask": 0,
				"Sed": [1000000,131.49800246,131.49800309],
				"SequenceFileOwner": "SIEMENS",
				"Stim_mon_mode": 2,
				"Operation_mode_flag": 2,
				"dBdt_max": 0,
				"t_puls_max": 0,
				"dBdt_thresh": 0,
				"dBdt_limit": 0,
				"SW_korr_faktor": 1,
				"Stim_max_online": [3.53273869,2.02310061,22.9137516],
				"Stim_max_ges_norm_online": 0.86955917,
				"Stim_lim": [31.19140053,16.97970009,26.8348999],
				"Stim_faktor": 1,
				"CoilForGradient": "void",
				"CoilForGradient2": "AS82",
				"CoilId": [255,0,0,0,0,4868,4867,4865,4866,0,0],
				"MiscSequenceParam": [0,0,0,0,0,0,0,0,0,0,0,0,0,0,0,0,0,0,0,0,0,0,0,0,0,256,0,0,0,0,0,10253,0,0,0,0,0,0],
				"MrProtocolVersion": 51130001,
				"PositivePCSDirections": "+LPH",
				"RelTablePosition": [0,0,0],
				"ReadoutOS": 2,
				"LongModelName": "NUMARIS/4",
				"SliceArrayConcatenations": 1,
				"SliceResolution": 1,
				"AbsTablePosition": -1250,
				"CoilString": "HE1-4;NE1,2",
				"PATModeText": "p2 s4",
				"PatReinPattern": "1;HFS;80.00;21.00;2;0;2;899680125",
				"ProtocolChangeHistory": 0,
				"Isocentered": 0,
				"MrPhoenixProtocol": {
					"ulVersion": 51130001,
					"tSequenceFileName": "%SiemensSeq%\\ep2d_bold",
					"tProtocolName": "1_EPI_trainingRL",
					"tdefaultEVAProt": "%SiemensEvaDefProt%\\BOLD\\t-test_10B10A_moco.evp",
					"tReferenceImage0": "1.3.12.2.1107.5.2.43.67018.2021050415172268773897337",
					"tReferenceImage1": "1.3.12.2.1107.5.2.43.67018.2021050415172270787797361",
					"tReferenceImage2": "1.3.12.2.1107.5.2.43.67018.2021050415172274201397388",
					"lScanRegionPosTra": 0,
					"ucScanRegionPosValid": 1,
					"lPtabAbsStartPosZ": -1250,
					"bPtabAbsStartPosZValid": 1,
					"ucTablePositioningMode": 1,
					"ucEnableNoiseAdjust": 1,
					"lContrasts": 1,
					"lCombinedEchoes": 1,
					"ucDisableChangeStoreImages": 1,
					"ucAAMode": 1,
					"ucAARegionMode": 1,
					"ucAARefMode": 1,
					"ucReconstructionMode": 1,
					"ucOneSeriesForAllMeas": 1,
					"ucPHAPSMode": 1,
					"ulWrapUpMagn": 1,
					"ucWaitForPrepareCompletion": 1,
					"lAverages": 1,
					"dAveragesDouble": 1,
					"lRepetitions": 644,
					"lScanTimeSec": 1,
					"lTotalScanTimeSec": 395,
					"dRefSNR": 76138.08508229999,
					"dRefSNR_VOI": 68631.51331359999,
					"ucMotionCorr": 1,
					"lParadigmPeriodicity": 10,
					"ucCineMode": 1,
					"ucSequenceType": 4,
					"ucCoilCombineMode": 1,
					"ucFlipAngleMode": 1,
					"lTOM": 1,
					"lProtID": -865,
					"lSequenceID": 361,
					"ucReadOutMode": 1,
					"ucBold3dPace": 1,
					"ucForcePositioningOnNDIS": 1,
					"ucInteractiveRealtime": 1,
					"ucInternalTablePosValid": 1,
					"ucTmapB0Correction": 1,
					"ucTmapEval": 1,
					"ucTmapImageType": 1,
					"ulOrganUnderExamination": 1,
					"dTissueT1": 10,
					"dTissueT2": 5,
					"lInvContrasts": 1,
					"ulReaquisitionMode": 1,
					"sProtConsistencyInfo": {
						"tMeasuredBaselineString": "N4_VE11C_LATEST_20160120",
						"tBaselineString": "N4_VE11C_LATEST_20150722",
						"tSystemType": "021",
						"flNominalB0": 2.89362001419,
						"flGMax": 34,
						"flRiseTime": 5,
						"lMaximumNofRxReceiverChannels": 64,
						"ulConvFromVersion": 51130001
					},
					"sGRADSPEC": {
						"ucMode": 8,
						"bShimCurrentValid": 1,
						"ucNoiseReduction": 1,
						"asGPAData": {
							"bEddyCompensationValid": 1,
							"bB0CompensationValid": 1,
							"bCrossTermCompensationValid": 1,
							"lOffsetX": -3460,
							"lOffsetY": -11596,
							"lOffsetZ": 6479,
							"bOffsetValid": 1,
							"lDelayX": 35,
							"lDelayY": 35,
							"lDelayZ": 30,
							"bDelayValid": 1,
							"flSensitivityX": 0.00015954884293,
							"flSensitivityY": 0.000161093092174,
							"flSensitivityZ": 0.00016269616026,
							"bSensitivityValid": 1,
							"sEddyCompensationX": {
								"aflAmplitude": [0.00158525188453,0.00328109948896,0.000262253597612,0.000180460250704,0.000625533226412],
								"aflTimeConstant": [1.16762197018,0.424881488085,0.307704925537,0.00761009613052,0.0006706842104899999]
							},
							"sEddyCompensationY": {
								"aflAmplitude": [0.00123011111282,0.00554311834276,0.000416270748246,0.000290365278488,0.000534182530828],
								"aflTimeConstant": [2.09438920021,0.562724173069,0.362843424082,0.0129494443536,0.000829329772387]
							},
							"sEddyCompensationZ": {
								"aflAmplitude": [-0.000212187238503,-0.00121721101459,-0.000888522248715,-0.00014333598665,2.59981989075e-05],
								"aflTimeConstant": [4.18207454681,0.7441447973250001,0.282248854637,0.0499868765473,0.00199839053676]
							},
							"sB0CompensationX": {
								"aflAmplitude": [0.124026484787,0.0458919666708,0.00795917958021],
								"aflTimeConstant": [0.753392159939,0.238709136844,0.012973183766]
							},
							"sB0CompensationY": {
								"aflAmplitude": [0.0520594678819,0.0169095695019,0.00750783178955],
								"aflTimeConstant": [0.9446877241129999,0.406743407249,0.0231205224991]
							},
							"sB0CompensationZ": {
								"aflAmplitude": [0.00611607497558,0.169787555933,0.0438676141202],
								"aflTimeConstant": [1.99807322025,0.576728403568,0.147952646017]
							},
							"sCrossTermCompensationXY": {
								"aflAmplitude": -0.000347240129486,
								"aflTimeConstant": 0.477422714233
							},
							"sCrossTermCompensationXZ": {
								"aflAmplitude": -0.000121496770589,
								"aflTimeConstant": 0.111108906567
							},
							"sCrossTermCompensationYX": {
								"aflAmplitude": -0.00111903541256,
								"aflTimeConstant": 0.444877833128
							},
							"sCrossTermCompensationYZ": {
								"aflAmplitude": -0.000156149733812,
								"aflTimeConstant": 0.0518034808338
							},
							"sCrossTermCompensationZX": {
								"aflAmplitude": -0.000271301891189,
								"aflTimeConstant": 0.539162993431
							},
							"sCrossTermCompensationZY": {
								"aflAmplitude": 0.000283587229205,
								"aflTimeConstant": 0.447201013565
							}
						},
						"alShimCurrent": [390,-164,-50,60,-125]
					},
					"sTXSPEC": {
						"bTxScaleFactorsValid": 1,
						"lNoOfTraPulses": 3,
						"lBCExcitationMode": 1,
						"lBCSeqExcitationMode": 4,
						"flKDynMagnitudeMin": 0.5,
						"flKDynMagnitudeMax": 1.5,
						"flKDynMagnitudeClipLow": 1,
						"flKDynMagnitudeClipHigh": 1,
						"flKDynPhaseMax": 0.698131978512,
						"flKDynPhaseClip": 0.174532994628,
						"bKDynValid": 1,
						"ucRFPulseType": 2,
						"ucExcitMode": 32,
						"ucSimultaneousExcitation": 1,
						"ucBCExcitationModeValid": 1,
						"lB1ShimMode": 1,
						"asNucleusInfo": [
							{
								"tNucleus": "1H",
								"lCoilSelectIndex": 0,
								"lFrequency": 123252590,
								"bFrequencyValid": 1,
								"flReferenceAmplitude": 286.172088623,
								"bReferenceAmplitudeValid": 1,
								"flCompProtectionRefAmpl": 286.172088623,
								"bCompProtectionRefAmplValid": 1,
								"flCompProtectionB1PlusRefAmpl": 249.400970459,
								"bCompProtectionB1PlusRefAmplValid": 1,
								"flAmplitudeCorrection": 1,
								"bAmplitudeCorrectionValid": 1,
								"bCompProtectionValuesValid": 1,
								"CompProtectionValues": {
									"MaxOfflineTxAmpl": 594.967651367,
									"WorstCasePulseScaleRefAmpl": 286.172088623,
									"WorstCaseMaxOfflineTxAmpl": 594.967651367,
									"DecouplingMatrixValid": 1,
									"ZZMatrixVectorUUID": "ac184512b29b27772d0b374eb25f258a040ffd23",
									"ScatterMatrixValid": 1,
									"MaxOnlineTxAmpl": [432.445739746,429.888549805],
									"WorstCaseMaxOnlineTxAmpl": [432.445739746,429.888549805],
									"adGainVariation": [1.02791559696,1.02183711529],
									"DecouplingMatrix": {
										"Size1": 3,
										"Size2": 3,
										"ComplexData": [
											{
												"dRe": -0.782206540102,
												"dIm": 0.6363878704880001
											},
											{
												"dRe": 9.93236945823e-05,
												"dIm": -0.0307417294908
											},
											{
												"dRe": [],
												"dIm": []
											},
											{
												"dRe": -0.00697766913444,
												"dIm": -0.0330174861361
											},
											{
												"dRe": -1.0145654967,
												"dIm": 0.509156806223
											}
										]
									},
									"ScatterMatrix": {
										"Size1": 2,
										"Size2": 2,
										"ComplexData": [
											{
												"dRe": 0.0587657412215,
												"dIm": -0.269711961737
											},
											{
												"dRe": -0.0248003021191,
												"dIm": 0.0702364453076
											},
											{
												"dRe": -0.0244149795171,
												"dIm": 0.0702996167661
											},
											{
												"dRe": 0.433986948343,
												"dIm": 0.237302480539
											}
										]
									}
								}
							},
							{
								"tNucleus": [],
								"lCoilSelectIndex": -1,
								"lFrequency": [],
								"bFrequencyValid": [],
								"flReferenceAmplitude": [],
								"bReferenceAmplitudeValid": [],
								"flCompProtectionRefAmpl": [],
								"bCompProtectionRefAmplValid": [],
								"flCompProtectionB1PlusRefAmpl": [],
								"bCompProtectionB1PlusRefAmplValid": [],
								"flAmplitudeCorrection": [],
								"bAmplitudeCorrectionValid": [],
								"bCompProtectionValuesValid": [],
								"CompProtectionValues": []
							}
						],
						"aRFPULSE": [
							{
								"tName": "SincRFPulseMB",
								"flAmplitude": 150.072860718,
								"flAmplitudeNL": 150.072860718,
								"bAmplitudeValid": 1
							},
							{
								"tName": "SincRFPulse",
								"flAmplitude": 60.7735214233,
								"flAmplitudeNL": 60.7735214233,
								"bAmplitudeValid": 1
							},
							{
								"tName": "SLoopFCSatNS",
								"flAmplitude": 70.5444641113,
								"flAmplitudeNL": 70.5444641113,
								"bAmplitudeValid": 1
							}
						],
						"aTxScaleFactor": [
							{
								"dRe": 0.707099974155,
								"dIm": []
							},
							{
								"dRe": [],
								"dIm": 0.707099974155
							},
							{
								"dRe": 1,
								"dIm": []
							},
							{
								"dRe": 1,
								"dIm": []
							},
							{
								"dRe": 1,
								"dIm": []
							},
							{
								"dRe": 1,
								"dIm": []
							},
							{
								"dRe": 1,
								"dIm": []
							},
							{
								"dRe": 1,
								"dIm": []
							},
							{
								"dRe": 1,
								"dIm": []
							},
							{
								"dRe": 1,
								"dIm": []
							}
						],
						"aPTXRFPulse": {
							"lPulseType": 1,
							"lTrajectoryType": 1,
							"lB1ShimType": 1,
							"lB0CorrectionType": 1,
							"dPulseAcceleration": 1
						},
						"B1CorrectionParameters": {
							"bValid": 1,
							"bActive": 0,
							"flCorrectionFactorMax": 1,
							"flPeakReserveFactor": 0
						}
					},
					"sRXSPEC": {
						"lGain": 1,
						"bGainValid": 1,
						"UseDoubleDataRate": 0,
						"asNucleusInfo": [
							{
								"tNucleus": "1H",
								"lCoilSelectIndex": 0
							},
							{
								"tNucleus": [],
								"lCoilSelectIndex": -1
							}
						],
						"alDwellTime": 3500
					},
					"sAdjData": {
						"uiAdjFreMode": 1,
						"uiAdjShimMode": 2,
						"uiAdjWatSupMode": 1,
						"uiAdjRFMapMode": 1,
						"uiAdjMDSMode": 1,
						"uiAdjTableTolerance": 1,
						"uiAdjProtID": 151,
						"uiAdjFreProtRelated": 1,
						"lCoupleAdjVolTo": 1,
						"uiAdjB0AcqMode": 1,
						"uiAdjB1AcqMode": 1,
						"sAdjVolume": {
							"dThickness": 119,
							"dPhaseFOV": 192,
							"dReadoutFOV": 192,
							"dInPlaneRot": 0.010471975512,
							"sPosition": {
								"dSag": -0.943537355265,
								"dCor": -4.25833512428,
								"dTra": -0.0266999270095
							},
							"sNormal": {
								"dSag": -0.04821872995,
								"dCor": 0.1345607847,
								"dTra": 0.9897314531
							}
						}
					},
					"alTR": 600000,
					"alTE": 30000,
					"acFlowComp": 1,
					"sSliceArray": {
						"lSize": 36,
						"lConc": 1,
						"ucMode": 4,
						"ucAnatomicalSliceMode": 4,
						"asSlice": [
							{
								"dThickness": 3,
								"dPhaseFOV": 192,
								"dReadoutFOV": 192,
								"dInPlaneRot": 0.010471975512,
								"sPosition": {
									"dSag": 1.84109429935,
									"dCor": -12.0292204407,
									"dTra": -57.1836913435
								},
								"sNormal": {
									"dSag": -0.04821872995,
									"dCor": 0.1345607847,
									"dTra": 0.9897314531
								}
							},
							{
								"dThickness": 3,
								"dPhaseFOV": 192,
								"dReadoutFOV": 192,
								"dInPlaneRot": 0.010471975512,
								"sPosition": {
									"dSag": 1.68197249051,
									"dCor": -11.5851698512,
									"dTra": -53.9175775483
								},
								"sNormal": {
									"dSag": -0.04821872995,
									"dCor": 0.1345607847,
									"dTra": 0.9897314531
								}
							},
							{
								"dThickness": 3,
								"dPhaseFOV": 192,
								"dReadoutFOV": 192,
								"dInPlaneRot": 0.010471975512,
								"sPosition": {
									"dSag": 1.52285068168,
									"dCor": -11.1411192617,
									"dTra": -50.6514637531
								},
								"sNormal": {
									"dSag": -0.04821872995,
									"dCor": 0.1345607847,
									"dTra": 0.9897314531
								}
							},
							{
								"dThickness": 3,
								"dPhaseFOV": 192,
								"dReadoutFOV": 192,
								"dInPlaneRot": 0.010471975512,
								"sPosition": {
									"dSag": 1.36372887284,
									"dCor": -10.6970686722,
									"dTra": -47.3853499578
								},
								"sNormal": {
									"dSag": -0.04821872995,
									"dCor": 0.1345607847,
									"dTra": 0.9897314531
								}
							},
							{
								"dThickness": 3,
								"dPhaseFOV": 192,
								"dReadoutFOV": 192,
								"dInPlaneRot": 0.010471975512,
								"sPosition": {
									"dSag": 1.20460706401,
									"dCor": -10.2530180827,
									"dTra": -44.1192361626
								},
								"sNormal": {
									"dSag": -0.04821872995,
									"dCor": 0.1345607847,
									"dTra": 0.9897314531
								}
							},
							{
								"dThickness": 3,
								"dPhaseFOV": 192,
								"dReadoutFOV": 192,
								"dInPlaneRot": 0.010471975512,
								"sPosition": {
									"dSag": 1.04548525517,
									"dCor": -9.808967493160001,
									"dTra": -40.8531223674
								},
								"sNormal": {
									"dSag": -0.04821872995,
									"dCor": 0.1345607847,
									"dTra": 0.9897314531
								}
							},
							{
								"dThickness": 3,
								"dPhaseFOV": 192,
								"dReadoutFOV": 192,
								"dInPlaneRot": 0.010471975512,
								"sPosition": {
									"dSag": 0.886363446337,
									"dCor": -9.36491690365,
									"dTra": -37.5870085722
								},
								"sNormal": {
									"dSag": -0.04821872995,
									"dCor": 0.1345607847,
									"dTra": 0.9897314531
								}
							},
							{
								"dThickness": 3,
								"dPhaseFOV": 192,
								"dReadoutFOV": 192,
								"dInPlaneRot": 0.010471975512,
								"sPosition": {
									"dSag": 0.727241637502,
									"dCor": -8.92086631414,
									"dTra": -34.3208947769
								},
								"sNormal": {
									"dSag": -0.04821872995,
									"dCor": 0.1345607847,
									"dTra": 0.9897314531
								}
							},
							{
								"dThickness": 3,
								"dPhaseFOV": 192,
								"dReadoutFOV": 192,
								"dInPlaneRot": 0.010471975512,
								"sPosition": {
									"dSag": 0.5681198286669999,
									"dCor": -8.476815724630001,
									"dTra": -31.0547809817
								},
								"sNormal": {
									"dSag": -0.04821872995,
									"dCor": 0.1345607847,
									"dTra": 0.9897314531
								}
							},
							{
								"dThickness": 3,
								"dPhaseFOV": 192,
								"dReadoutFOV": 192,
								"dInPlaneRot": 0.010471975512,
								"sPosition": {
									"dSag": 0.408998019832,
									"dCor": -8.03276513512,
									"dTra": -27.7886671865
								},
								"sNormal": {
									"dSag": -0.04821872995,
									"dCor": 0.1345607847,
									"dTra": 0.9897314531
								}
							},
							{
								"dThickness": 3,
								"dPhaseFOV": 192,
								"dReadoutFOV": 192,
								"dInPlaneRot": 0.010471975512,
								"sPosition": {
									"dSag": 0.249876210997,
									"dCor": -7.58871454561,
									"dTra": -24.5225533912
								},
								"sNormal": {
									"dSag": -0.04821872995,
									"dCor": 0.1345607847,
									"dTra": 0.9897314531
								}
							},
							{
								"dThickness": 3,
								"dPhaseFOV": 192,
								"dReadoutFOV": 192,
								"dInPlaneRot": 0.010471975512,
								"sPosition": {
									"dSag": 0.0907544021625,
									"dCor": -7.1446639561,
									"dTra": -21.256439596
								},
								"sNormal": {
									"dSag": -0.04821872995,
									"dCor": 0.1345607847,
									"dTra": 0.9897314531
								}
							},
							{
								"dThickness": 3,
								"dPhaseFOV": 192,
								"dReadoutFOV": 192,
								"dInPlaneRot": 0.010471975512,
								"sPosition": {
									"dSag": -0.06836740667250001,
									"dCor": -6.70061336659,
									"dTra": -17.9903258008
								},
								"sNormal": {
									"dSag": -0.04821872995,
									"dCor": 0.1345607847,
									"dTra": 0.9897314531
								}
							},
							{
								"dThickness": 3,
								"dPhaseFOV": 192,
								"dReadoutFOV": 192,
								"dInPlaneRot": 0.010471975512,
								"sPosition": {
									"dSag": -0.227489215508,
									"dCor": -6.25656277708,
									"dTra": -14.7242120055
								},
								"sNormal": {
									"dSag": -0.04821872995,
									"dCor": 0.1345607847,
									"dTra": 0.9897314531
								}
							},
							{
								"dThickness": 3,
								"dPhaseFOV": 192,
								"dReadoutFOV": 192,
								"dInPlaneRot": 0.010471975512,
								"sPosition": {
									"dSag": -0.386611024343,
									"dCor": -5.81251218757,
									"dTra": -11.4580982103
								},
								"sNormal": {
									"dSag": -0.04821872995,
									"dCor": 0.1345607847,
									"dTra": 0.9897314531
								}
							},
							{
								"dThickness": 3,
								"dPhaseFOV": 192,
								"dReadoutFOV": 192,
								"dInPlaneRot": 0.010471975512,
								"sPosition": {
									"dSag": -0.5457328331770001,
									"dCor": -5.36846159806,
									"dTra": -8.19198441508
								},
								"sNormal": {
									"dSag": -0.04821872995,
									"dCor": 0.1345607847,
									"dTra": 0.9897314531
								}
							},
							{
								"dThickness": 3,
								"dPhaseFOV": 192,
								"dReadoutFOV": 192,
								"dInPlaneRot": 0.010471975512,
								"sPosition": {
									"dSag": -0.704854642013,
									"dCor": -4.92441100855,
									"dTra": -4.92587061985
								},
								"sNormal": {
									"dSag": -0.04821872995,
									"dCor": 0.1345607847,
									"dTra": 0.9897314531
								}
							},
							{
								"dThickness": 3,
								"dPhaseFOV": 192,
								"dReadoutFOV": 192,
								"dInPlaneRot": 0.010471975512,
								"sPosition": {
									"dSag": -0.863976450848,
									"dCor": -4.48036041904,
									"dTra": -1.65975682462
								},
								"sNormal": {
									"dSag": -0.04821872995,
									"dCor": 0.1345607847,
									"dTra": 0.9897314531
								}
							},
							{
								"dThickness": 3,
								"dPhaseFOV": 192,
								"dReadoutFOV": 192,
								"dInPlaneRot": 0.010471975512,
								"sPosition": {
									"dSag": -1.02309825968,
									"dCor": -4.03630982953,
									"dTra": 1.60635697061
								},
								"sNormal": {
									"dSag": -0.04821872995,
									"dCor": 0.1345607847,
									"dTra": 0.9897314531
								}
							},
							{
								"dThickness": 3,
								"dPhaseFOV": 192,
								"dReadoutFOV": 192,
								"dInPlaneRot": 0.010471975512,
								"sPosition": {
									"dSag": -1.18222006852,
									"dCor": -3.59225924002,
									"dTra": 4.87247076584
								},
								"sNormal": {
									"dSag": -0.04821872995,
									"dCor": 0.1345607847,
									"dTra": 0.9897314531
								}
							},
							{
								"dThickness": 3,
								"dPhaseFOV": 192,
								"dReadoutFOV": 192,
								"dInPlaneRot": 0.010471975512,
								"sPosition": {
									"dSag": -1.34134187735,
									"dCor": -3.14820865051,
									"dTra": 8.138584561069999
								},
								"sNormal": {
									"dSag": -0.04821872995,
									"dCor": 0.1345607847,
									"dTra": 0.9897314531
								}
							},
							{
								"dThickness": 3,
								"dPhaseFOV": 192,
								"dReadoutFOV": 192,
								"dInPlaneRot": 0.010471975512,
								"sPosition": {
									"dSag": -1.50046368619,
									"dCor": -2.704158061,
									"dTra": 11.4046983563
								},
								"sNormal": {
									"dSag": -0.04821872995,
									"dCor": 0.1345607847,
									"dTra": 0.9897314531
								}
							},
							{
								"dThickness": 3,
								"dPhaseFOV": 192,
								"dReadoutFOV": 192,
								"dInPlaneRot": 0.010471975512,
								"sPosition": {
									"dSag": -1.65958549502,
									"dCor": -2.26010747149,
									"dTra": 14.6708121515
								},
								"sNormal": {
									"dSag": -0.04821872995,
									"dCor": 0.1345607847,
									"dTra": 0.9897314531
								}
							},
							{
								"dThickness": 3,
								"dPhaseFOV": 192,
								"dReadoutFOV": 192,
								"dInPlaneRot": 0.010471975512,
								"sPosition": {
									"dSag": -1.81870730386,
									"dCor": -1.81605688198,
									"dTra": 17.9369259468
								},
								"sNormal": {
									"dSag": -0.04821872995,
									"dCor": 0.1345607847,
									"dTra": 0.9897314531
								}
							},
							{
								"dThickness": 3,
								"dPhaseFOV": 192,
								"dReadoutFOV": 192,
								"dInPlaneRot": 0.010471975512,
								"sPosition": {
									"dSag": -1.97782911269,
									"dCor": -1.37200629247,
									"dTra": 21.203039742
								},
								"sNormal": {
									"dSag": -0.04821872995,
									"dCor": 0.1345607847,
									"dTra": 0.9897314531
								}
							},
							{
								"dThickness": 3,
								"dPhaseFOV": 192,
								"dReadoutFOV": 192,
								"dInPlaneRot": 0.010471975512,
								"sPosition": {
									"dSag": -2.13695092153,
									"dCor": -0.927955702957,
									"dTra": 24.4691535372
								},
								"sNormal": {
									"dSag": -0.04821872995,
									"dCor": 0.1345607847,
									"dTra": 0.9897314531
								}
							},
							{
								"dThickness": 3,
								"dPhaseFOV": 192,
								"dReadoutFOV": 192,
								"dInPlaneRot": 0.010471975512,
								"sPosition": {
									"dSag": -2.29607273036,
									"dCor": -0.483905113447,
									"dTra": 27.7352673324
								},
								"sNormal": {
									"dSag": -0.04821872995,
									"dCor": 0.1345607847,
									"dTra": 0.9897314531
								}
							},
							{
								"dThickness": 3,
								"dPhaseFOV": 192,
								"dReadoutFOV": 192,
								"dInPlaneRot": 0.010471975512,
								"sPosition": {
									"dSag": -2.4551945392,
									"dCor": -0.0398545239373,
									"dTra": 31.0013811277
								},
								"sNormal": {
									"dSag": -0.04821872995,
									"dCor": 0.1345607847,
									"dTra": 0.9897314531
								}
							},
							{
								"dThickness": 3,
								"dPhaseFOV": 192,
								"dReadoutFOV": 192,
								"dInPlaneRot": 0.010471975512,
								"sPosition": {
									"dSag": -2.61431634803,
									"dCor": 0.404196065573,
									"dTra": 34.2674949229
								},
								"sNormal": {
									"dSag": -0.04821872995,
									"dCor": 0.1345607847,
									"dTra": 0.9897314531
								}
							},
							{
								"dThickness": 3,
								"dPhaseFOV": 192,
								"dReadoutFOV": 192,
								"dInPlaneRot": 0.010471975512,
								"sPosition": {
									"dSag": -2.77343815687,
									"dCor": 0.848246655083,
									"dTra": 37.5336087181
								},
								"sNormal": {
									"dSag": -0.04821872995,
									"dCor": 0.1345607847,
									"dTra": 0.9897314531
								}
							},
							{
								"dThickness": 3,
								"dPhaseFOV": 192,
								"dReadoutFOV": 192,
								"dInPlaneRot": 0.010471975512,
								"sPosition": {
									"dSag": -2.9325599657,
									"dCor": 1.29229724459,
									"dTra": 40.7997225134
								},
								"sNormal": {
									"dSag": -0.04821872995,
									"dCor": 0.1345607847,
									"dTra": 0.9897314531
								}
							},
							{
								"dThickness": 3,
								"dPhaseFOV": 192,
								"dReadoutFOV": 192,
								"dInPlaneRot": 0.010471975512,
								"sPosition": {
									"dSag": -3.09168177454,
									"dCor": 1.7363478341,
									"dTra": 44.0658363086
								},
								"sNormal": {
									"dSag": -0.04821872995,
									"dCor": 0.1345607847,
									"dTra": 0.9897314531
								}
							},
							{
								"dThickness": 3,
								"dPhaseFOV": 192,
								"dReadoutFOV": 192,
								"dInPlaneRot": 0.010471975512,
								"sPosition": {
									"dSag": -3.25080358337,
									"dCor": 2.18039842361,
									"dTra": 47.3319501038
								},
								"sNormal": {
									"dSag": -0.04821872995,
									"dCor": 0.1345607847,
									"dTra": 0.9897314531
								}
							},
							{
								"dThickness": 3,
								"dPhaseFOV": 192,
								"dReadoutFOV": 192,
								"dInPlaneRot": 0.010471975512,
								"sPosition": {
									"dSag": -3.40992539221,
									"dCor": 2.62444901312,
									"dTra": 50.5980638991
								},
								"sNormal": {
									"dSag": -0.04821872995,
									"dCor": 0.1345607847,
									"dTra": 0.9897314531
								}
							},
							{
								"dThickness": 3,
								"dPhaseFOV": 192,
								"dReadoutFOV": 192,
								"dInPlaneRot": 0.010471975512,
								"sPosition": {
									"dSag": -3.56904720104,
									"dCor": 3.06849960263,
									"dTra": 53.8641776943
								},
								"sNormal": {
									"dSag": -0.04821872995,
									"dCor": 0.1345607847,
									"dTra": 0.9897314531
								}
							},
							{
								"dThickness": 3,
								"dPhaseFOV": 192,
								"dReadoutFOV": 192,
								"dInPlaneRot": 0.010471975512,
								"sPosition": {
									"dSag": -3.72816900988,
									"dCor": 3.51255019214,
									"dTra": 57.1302914895
								},
								"sNormal": {
									"dSag": -0.04821872995,
									"dCor": 0.1345607847,
									"dTra": 0.9897314531
								}
							}
						],
						"alSliceAcqOrder": [0,1,2,3,4,5,6,7,8,9,10,11,12,13,14,15,16,17,18,19,20,21,22,23,24,25,26,27,28,29,30,31,32,33,34,35],
						"anAsc": [0,1,2,3,4,5,6,7,8,9,10,11,12,13,14,15,16,17,18,19,20,21,22,23,24,25,26,27,28,29,30,31,32,33,34,35],
						"anPos": [0,1,2,3,4,5,6,7,8,9,10,11,12,13,14,15,16,17,18,19,20,21,22,23,24,25,26,27,28,29,30,31,32,33,34,35],
						"sTSat": {
							"dThickness": 50,
							"ulShape": 1
						}
					},
					"sGroupArray": {
						"lSize": 1,
						"asGroup": {
							"nSize": 36,
							"dDistFact": 0.1
						},
						"anMember": [0,1,2,3,4,5,6,7,8,9,10,11,12,13,14,15,16,17,18,19,20,21,22,23,24,25,26,27,28,29,30,31,32,33,34,35,-1],
						"sPSat": {
							"dThickness": 50,
							"dGap": 10,
							"ulShape": 1
						}
					},
					"sRSatArray": {
						"asElm": [
							{
								"ulShape": 1
							},
							{
								"ulShape": 1
							},
							{
								"ulShape": 1
							},
							{
								"ulShape": 1
							},
							{
								"ulShape": 1
							},
							{
								"ulShape": 1
							},
							{
								"ulShape": 1
							},
							{
								"ulShape": 1
							}
						]
					},
					"sAutoAlign": {
						"dAAMatrix": [1,0,0,0,0,1,0,0,0,0,1,0,0,0,0,1]
					},
					"sNavigatorPara": {
						"lBreathHoldDuration_us": 15000000,
						"lBreathHoldMeas": 1,
						"lRespComp": 4
					},
					"sBladePara": {
						"dBladeCoverage": 100,
						"ucMotionCorr": 2
					},
					"sPrepPulses": {
						"ucFatSat": 1,
						"ucWaterSat": 4,
						"ucInversion": 4,
						"ucSatRecovery": 1,
						"ucT2Prep": 1,
						"ucTIScout": 1,
						"ucFatSatMode": 2,
						"dDarkBloodThickness": 200,
						"dDarkBloodFlipAngle": 200,
						"dIRPulseThicknessFactor": 0.77,
						"ucBloodSuppression": 1,
						"lPhaseCorrectionMode": 1,
						"ucIRScheme": 1,
						"lFatSupOpt": 1,
						"adT2PrepDuration": 40
					},
					"sKSpace": {
						"dPhaseResolution": 1,
						"dPhaseOversamplingForDialog": 0.1,
						"dSliceResolution": 1,
						"dAngioDynCentralRegionA": 20,
						"dAngioDynSamplingDensityB": 25,
						"dSeqPhasePartialFourierForSNR": 1,
						"lBaseResolution": 64,
						"lPhaseEncodingLines": 71,
						"lPartitions": 64,
						"lImagesPerSlab": 64,
						"lRadialViews": 64,
						"lRadialInterleavesPerImage": 2,
						"lLinesPerShot": 1,
						"unReordering": 1,
						"ucPhasePartialFourier": 16,
						"ucSlicePartialFourier": 16,
						"ucAveragingMode": 2,
						"ucMultiSliceMode": 2,
						"ucDimension": 2,
						"ucTrajectory": 1,
						"ucViewSharing": 1,
						"ucAsymmetricEchoMode": 1,
						"ucPOCS": 1,
						"ucReadoutPartialFourier": 16
					},
					"sFastImaging": {
						"lEPIFactor": 128,
						"lTurboFactor": 1,
						"lSliceTurboFactor": 1,
						"lSegments": 1,
						"ucPhaseEncRE": 0,
						"ucSegmentationMode": 1,
						"lShots": 1,
						"lEchoTrainDuration": 700
					},
					"sPhysioImaging": {
						"lSignal1": 1,
						"lMethod1": 1,
						"lSignal2": 1,
						"lMethod2": 1,
						"lPhases": 1,
						"lRetroGatedImages": 16,
						"lDummyHeartbeats": 0,
						"sPhysioECG": {
							"lTriggerPulses": 1,
							"lTriggerWindow": 5,
							"lArrhythmiaDetection": 1,
							"lCardiacGateOnThreshold": 100000,
							"lCardiacGateOffThreshold": 700000,
							"lTriggerIntervals": 1
						},
						"sPhysioPulse": {
							"lTriggerPulses": 1,
							"lTriggerWindow": 5,
							"lArrhythmiaDetection": 1,
							"lCardiacGateOnThreshold": 100000,
							"lCardiacGateOffThreshold": 700000,
							"lTriggerIntervals": 1
						},
						"sPhysioExt": {
							"lTriggerPulses": 1,
							"lTriggerWindow": 5,
							"lArrhythmiaDetection": 1,
							"lCardiacGateOnThreshold": 100000,
							"lCardiacGateOffThreshold": 700000,
							"lTriggerIntervals": 1
						},
						"sPhysioExt2": {
							"lTriggerIntervals": 1
						},
						"sPhysioResp": {
							"lRespGateThreshold": 20,
							"lRespGatePhase": 2,
							"dGatingRatio": 0.3
						},
						"sPhysioNative": {
							"ucMode": 1,
							"ucFlowSenMode": 1
						}
					},
					"sSpecPara": {
						"lPhaseCyclingType": 1,
						"lPhaseEncodingType": 1,
						"lRFExcitationBandwidth": 1,
						"ucRemoveOversampling": 1,
						"lAutoRefScanMode": 1,
						"lAutoRefScanNo": 1,
						"lDecouplingType": 1,
						"lNOEType": 1,
						"lExcitationType": 1,
						"lSpecAppl": 1,
						"lSpectralSuppression": 1
					},
					"sDiffusion": {
						"ulMode": 1,
						"dsScheme": 1,
						"ulQSpaceCoverage": 1,
						"ulQSpaceSampling": 1,
						"lQSpaceSteps": 1,
						"sFreeDiffusionData": {
							"ulCoordinateSystem": 1,
							"ulNormalization": 1
						}
					},
					"sAngio": {
						"ucPCFlowMode": 2,
						"ucTOFInflow": 4,
						"lDynamicReconMode": 1,
						"lTemporalInterpolation": 1
					},
					"sPreScanNormalizeFilter": {
						"ucOn": 1,
						"ucMode": 2
					},
					"sRawFilter": {
						"lSlope_256": 25,
						"ucOn": 1,
						"ucMode": 1
					},
					"sDistortionCorrFilter": {
						"ucMode": 1
					},
					"sNoiseDecorrData": {
						"lNoiseDecorrDefaultMode": 4
					},
					"sPat": {
						"lAccelFactPE": 2,
						"lAccelFact3D": 1,
						"lRefLinesPE": 24,
						"ucPATMode": 32,
						"ucRefScanMode": 256,
						"ucTPatAverageAllFrames": 1,
						"ulCaipirinhaMode": 1
					},
					"sMds": {
						"ulMdsModeMask": 1,
						"ulMdsVariableResolution": 1,
						"lTableSpeedNumerator": 1,
						"lmdsLinesPerSegment": 15,
						"lMdsPtabAbsStartPosZ": 0,
						"bMdsPtabAbsStartPosZValid": 0,
						"lMdsPtabAbsEndPosZ": 0,
						"bMdsPtabAbsEndPosZValid": 0,
						"ulMdsReconMode": 1,
						"dMdsRangeExtension": 600,
						"lSweeps": 1,
						"ucSweepMode": 1,
						"dDCSIlluminationScale": 2,
						"ucExcitDir": 1,
						"ucFreqShimPerSlice": 1,
						"ucSliceFollowing": 1,
						"ucDynamicCoilSwitching": 1,
						"ucPhaseNav": 0,
						"sMdsEndPosSBCS_mm": {
							"dTra": 600
						},
						"sMdsPreScanNormalize": {
							"ucMode": 2,
							"ucStackMode": 4,
							"lNPELin": 18
						}
					},
					"sAAInitialOffset": {
						"Laterality": 0,
						"SliceInformation": {
							"dInPlaneRot": 0.010471975512,
							"sPosition": {
								"dSag": -0.943537355265,
								"dCor": -4.25833512428,
								"dTra": -0.0266999270095
							},
							"sNormal": {
								"dSag": -0.0482187299511,
								"dCor": 0.134560784703,
								"dTra": 0.989731453124
							}
						}
					},
					"adFlipAngleDegree": 50,
					"sCoilSelectMeas": {
						"dOverallImageScaleFactor": 0.534167970788,
						"dOverallImageScaleCorrectionFactor": 1,
						"sCoilStringForConversion": "HE1-4;NE1,2",
						"dAutoCoilSelectIlluRangeScale": 0.7,
						"aRxCoilSelectData": [
							{
								"ucNoiseDecorrMode": 1,
								"tNucleus": "1H",
								"iUsedRFactor": 3,
								"IgnoreCoilGroups": 0,
								"BCCombineMode": 1,
								"bSuppressMandatoryProperties": 0,
								"asList": [
									{
										"lElementSelected": 1,
										"lMuxChannelConnected": 53,
										"lRxChannelConnected": 9,
										"lADCChannelConnected": 18,
										"uiInsertionTime": 34169,
										"sCoilElementID": {
											"tCoilID": "HeadNeck_20",
											"lCoilCopy": 1,
											"tElement": "N11",
											"tCoilClass": "Head_Rx",
											"ulUniqueKey": 222202028
										},
										"sCoilProperties": {
											"eCoilType": 4
										}
									},
									{
										"lElementSelected": 1,
										"lMuxChannelConnected": 53,
										"lRxChannelConnected": 9,
										"lADCChannelConnected": 17,
										"uiInsertionTime": 34169,
										"sCoilElementID": {
											"tCoilID": "HeadNeck_20",
											"lCoilCopy": 1,
											"tElement": "N12",
											"ulUniqueKey": 1251930748
										},
										"sCoilProperties": {
											"eCoilType": 4
										}
									},
									{
										"lElementSelected": 1,
										"lMuxChannelConnected": 65,
										"lRxChannelConnected": 25,
										"lADCChannelConnected": 50,
										"uiInsertionTime": 34168,
										"sCoilElementID": {
											"tCoilID": "HeadNeck_20",
											"lCoilCopy": 1,
											"tElement": "N21",
											"tCoilClass": "Head_Rx",
											"ulUniqueKey": -1951729150
										},
										"sCoilProperties": {
											"eCoilType": 4
										}
									},
									{
										"lElementSelected": 1,
										"lMuxChannelConnected": 65,
										"lRxChannelConnected": 25,
										"lADCChannelConnected": 49,
										"uiInsertionTime": 34168,
										"sCoilElementID": {
											"tCoilID": "HeadNeck_20",
											"lCoilCopy": 1,
											"tElement": "N22",
											"ulUniqueKey": -871726894
										},
										"sCoilProperties": {
											"eCoilType": 4
										}
									},
									{
										"lElementSelected": 1,
										"lMuxChannelConnected": 49,
										"lRxChannelConnected": 17,
										"lADCChannelConnected": 34,
										"uiInsertionTime": 34167,
										"sCoilElementID": {
											"tCoilID": "HeadNeck_20",
											"lCoilCopy": 1,
											"tElement": "H11",
											"tCoilClass": "Head_Rx",
											"ulUniqueKey": 1861139862
										},
										"sCoilProperties": {
											"eCoilType": 4
										}
									},
									{
										"lElementSelected": 1,
										"lMuxChannelConnected": 49,
										"lRxChannelConnected": 17,
										"lADCChannelConnected": 33,
										"uiInsertionTime": 34167,
										"sCoilElementID": {
											"tCoilID": "HeadNeck_20",
											"lCoilCopy": 1,
											"tElement": "H12",
											"ulUniqueKey": 693028678
										},
										"sCoilProperties": {
											"eCoilType": 4
										}
									},
									{
										"lElementSelected": 1,
										"lMuxChannelConnected": 50,
										"lRxChannelConnected": 11,
										"lADCChannelConnected": 22,
										"uiInsertionTime": 34167,
										"sCoilElementID": {
											"tCoilID": "HeadNeck_20",
											"lCoilCopy": 1,
											"tElement": "H13",
											"ulUniqueKey": 338620150
										},
										"sCoilProperties": {
											"eCoilType": 4
										}
									},
									{
										"lElementSelected": 1,
										"lMuxChannelConnected": 50,
										"lRxChannelConnected": 11,
										"lADCChannelConnected": 21,
										"uiInsertionTime": 34167,
										"sCoilElementID": {
											"tCoilID": "HeadNeck_20",
											"lCoilCopy": 1,
											"tElement": "H14",
											"ulUniqueKey": -1509018906
										},
										"sCoilProperties": {
											"eCoilType": 4
										}
									},
									{
										"lElementSelected": 1,
										"lMuxChannelConnected": 61,
										"lRxChannelConnected": 27,
										"lADCChannelConnected": 53,
										"uiInsertionTime": 34166,
										"sCoilElementID": {
											"tCoilID": "HeadNeck_20",
											"lCoilCopy": 1,
											"tElement": "H21",
											"tCoilClass": "Head_Rx",
											"ulUniqueKey": -394604744
										},
										"sCoilProperties": {
											"eCoilType": 4
										}
									},
									{
										"lElementSelected": 1,
										"lMuxChannelConnected": 61,
										"lRxChannelConnected": 27,
										"lADCChannelConnected": 54,
										"uiInsertionTime": 34166,
										"sCoilElementID": {
											"tCoilID": "HeadNeck_20",
											"lCoilCopy": 1,
											"tElement": "H22",
											"ulUniqueKey": -1344621080
										},
										"sCoilProperties": {
											"eCoilType": 4
										}
									},
									{
										"lElementSelected": 1,
										"lMuxChannelConnected": 62,
										"lRxChannelConnected": 13,
										"lADCChannelConnected": 25,
										"uiInsertionTime": 34166,
										"sCoilElementID": {
											"tCoilID": "HeadNeck_20",
											"lCoilCopy": 1,
											"tElement": "H23",
											"ulUniqueKey": -1833264040
										},
										"sCoilProperties": {
											"eCoilType": 4
										}
									},
									{
										"lElementSelected": 1,
										"lMuxChannelConnected": 62,
										"lRxChannelConnected": 13,
										"lADCChannelConnected": 26,
										"uiInsertionTime": 34166,
										"sCoilElementID": {
											"tCoilID": "HeadNeck_20",
											"lCoilCopy": 1,
											"tElement": "H24",
											"ulUniqueKey": 546979912
										},
										"sCoilProperties": {
											"eCoilType": 4
										}
									},
									{
										"lElementSelected": 1,
										"lMuxChannelConnected": 63,
										"lRxChannelConnected": 19,
										"lADCChannelConnected": 38,
										"uiInsertionTime": 34165,
										"sCoilElementID": {
											"tCoilID": "HeadNeck_20",
											"lCoilCopy": 1,
											"tElement": "H41",
											"tCoilClass": "Head_Rx",
											"ulUniqueKey": 1042492453
										},
										"sCoilProperties": {
											"eCoilType": 4
										}
									},
									{
										"lElementSelected": 1,
										"lMuxChannelConnected": 63,
										"lRxChannelConnected": 19,
										"lADCChannelConnected": 37,
										"uiInsertionTime": 34165,
										"sCoilElementID": {
											"tCoilID": "HeadNeck_20",
											"lCoilCopy": 1,
											"tElement": "H42",
											"ulUniqueKey": 2038650613
										},
										"sCoilProperties": {
											"eCoilType": 4
										}
									},
									{
										"lElementSelected": 1,
										"lMuxChannelConnected": 64,
										"lRxChannelConnected": 21,
										"lADCChannelConnected": 42,
										"uiInsertionTime": 34165,
										"sCoilElementID": {
											"tCoilID": "HeadNeck_20",
											"lCoilCopy": 1,
											"tElement": "H43",
											"ulUniqueKey": 1155759941
										},
										"sCoilProperties": {
											"eCoilType": 4
										}
									},
									{
										"lElementSelected": 1,
										"lMuxChannelConnected": 64,
										"lRxChannelConnected": 21,
										"lADCChannelConnected": 41,
										"uiInsertionTime": 34165,
										"sCoilElementID": {
											"tCoilID": "HeadNeck_20",
											"lCoilCopy": 1,
											"tElement": "H44",
											"ulUniqueKey": -154950827
										},
										"sCoilProperties": {
											"eCoilType": 4
										}
									},
									{
										"lElementSelected": 1,
										"lMuxChannelConnected": 51,
										"lRxChannelConnected": 15,
										"lADCChannelConnected": 30,
										"uiInsertionTime": 34164,
										"sCoilElementID": {
											"tCoilID": "HeadNeck_20",
											"lCoilCopy": 1,
											"tElement": "H31",
											"tCoilClass": "Head_Rx",
											"ulUniqueKey": 589700253
										},
										"sCoilProperties": {
											"eCoilType": 4
										}
									},
									{
										"lElementSelected": 1,
										"lMuxChannelConnected": 51,
										"lRxChannelConnected": 15,
										"lADCChannelConnected": 29,
										"uiInsertionTime": 34164,
										"sCoilElementID": {
											"tCoilID": "HeadNeck_20",
											"lCoilCopy": 1,
											"tElement": "H32",
											"ulUniqueKey": 1686529613
										},
										"sCoilProperties": {
											"eCoilType": 4
										}
									},
									{
										"lElementSelected": 1,
										"lMuxChannelConnected": 52,
										"lRxChannelConnected": 23,
										"lADCChannelConnected": 46,
										"uiInsertionTime": 34164,
										"sCoilElementID": {
											"tCoilID": "HeadNeck_20",
											"lCoilCopy": 1,
											"tElement": "H33",
											"ulUniqueKey": 1508265981
										},
										"sCoilProperties": {
											"eCoilType": 4
										}
									},
									{
										"lElementSelected": 1,
										"lMuxChannelConnected": 52,
										"lRxChannelConnected": 23,
										"lADCChannelConnected": 45,
										"uiInsertionTime": 34164,
										"sCoilElementID": {
											"tCoilID": "HeadNeck_20",
											"lCoilCopy": 1,
											"tElement": "H34",
											"ulUniqueKey": -339307539
										},
										"sCoilProperties": {
											"eCoilType": 4
										}
									}
								],
								"aFFT_SCALE": [
									{
										"flFactor": 8.904000282289999,
										"lADCChannel": 18,
										"bValid": 1
									},
									{
										"flFactor": 8.06052494049,
										"lADCChannel": 17,
										"bValid": 1
									},
									{
										"flFactor": 8.93973827362,
										"lADCChannel": 50,
										"bValid": 1
									},
									{
										"flFactor": 7.8997335434,
										"lADCChannel": 49,
										"bValid": 1
									},
									{
										"flFactor": 9.0445318222,
										"lADCChannel": 34,
										"bValid": 1
									},
									{
										"flFactor": 8.34425449371,
										"lADCChannel": 33,
										"bValid": 1
									},
									{
										"flFactor": 8.47010135651,
										"lADCChannel": 22,
										"bValid": 1
									},
									{
										"flFactor": 8.26989269257,
										"lADCChannel": 21,
										"bValid": 1
									},
									{
										"flFactor": 7.88276672363,
										"lADCChannel": 53,
										"bValid": 1
									},
									{
										"flFactor": 9.02242660522,
										"lADCChannel": 54,
										"bValid": 1
									},
									{
										"flFactor": 8.104558944700001,
										"lADCChannel": 25,
										"bValid": 1
									},
									{
										"flFactor": 8.43470954895,
										"lADCChannel": 26,
										"bValid": 1
									},
									{
										"flFactor": 9.08739566803,
										"lADCChannel": 38,
										"bValid": 1
									},
									{
										"flFactor": 8.21622371674,
										"lADCChannel": 37,
										"bValid": 1
									},
									{
										"flFactor": 9.040085792539999,
										"lADCChannel": 42,
										"bValid": 1
									},
									{
										"flFactor": 8.146689414980001,
										"lADCChannel": 41,
										"bValid": 1
									},
									{
										"flFactor": 8.381203651430001,
										"lADCChannel": 30,
										"bValid": 1
									},
									{
										"flFactor": 8.08487606049,
										"lADCChannel": 29,
										"bValid": 1
									},
									{
										"flFactor": 8.97123241425,
										"lADCChannel": 46,
										"bValid": 1
									},
									{
										"flFactor": 8.254699707029999,
										"lADCChannel": 45,
										"bValid": 1
									}
								]
							},
							{
								"ucNoiseDecorrMode": [],
								"tNucleus": [],
								"iUsedRFactor": [],
								"IgnoreCoilGroups": 0,
								"BCCombineMode": 1,
								"bSuppressMandatoryProperties": 0,
								"asList": [],
								"aFFT_SCALE": []
							}
						],
						"aTxCoilSelectData": {
							"tNucleus": "1H",
							"asList": [
								{
									"lElementSelected": 1,
									"sCoilElementID": {
										"tCoilID": "Body",
										"lCoilCopy": 1,
										"tElement": "BC",
										"ulUniqueKey": 776254261
									},
									"sTxScaleFactorCP": {
										"dRe": 0.7071
									},
									"sTxScaleFactorEP": {
										"dRe": 0.4752
									},
									"sCoilProperties": {
										"eCoilType": 1,
										"tCoilManufacturer": "Siemens"
									},
									"lTxChannelConnected": []
								},
								{
									"lElementSelected": 1,
									"sCoilElementID": {
										"tCoilID": "Body",
										"lCoilCopy": 1,
										"tElement": "BC2",
										"ulUniqueKey": -626865618
									},
									"sTxScaleFactorCP": {
										"dIm": 0.7071
									},
									"sTxScaleFactorEP": {
										"dRe": -0.5659999999999999,
										"dIm": 0.6743
									},
									"sCoilProperties": {
										"eCoilType": 1,
										"tCoilManufacturer": "Siemens"
									},
									"lTxChannelConnected": 1
								}
							]
						},
						"CoilPlugs": {
							"Plug": [
								{
									"IdPart": 255
								},
								{
									"IdPart": []
								},
								{
									"IdPart": []
								},
								{
									"IdPart": []
								},
								{
									"IdPart": []
								},
								{
									"IdPart": [4868,4869]
								},
								{
									"IdPart": 4867
								},
								{
									"IdPart": 4865
								},
								{
									"IdPart": 4866
								}
							]
						}
					},
					"sCoilSelectUI": {
						"dOverallImageScaleFactor": 1,
						"dOverallImageScaleCorrectionFactor": 1,
						"dAutoCoilSelectIlluRangeScale": 0.7,
						"aRxCoilSelectData": [
							{
								"IgnoreCoilGroups": 0,
								"BCCombineMode": 1,
								"bSuppressMandatoryProperties": 0
							},
							{
								"IgnoreCoilGroups": 0,
								"BCCombineMode": 1,
								"bSuppressMandatoryProperties": 0
							}
						]
					},
					"ucBOLDParadigmArray": [85,85,89,85,149,85,85,89,85,149,85,85,89,85,149,85,85,89,85,149,85,85,89,85,149,85,85,89,85,149,85,85,89,85,149,85,85,89,85,149,85,85,89,85,149,85,85,89,85,149,85,85,89,85,149,85,85,89,85,149,85,85,89,85,149,85,85,89,85,149,85,85,89,85,149,85,85,89,85,149,85,85,89,85,149,85,85,89,85,149,85,85,89,85,149,85,85,89,85,149,85,85,89,85,149,85,85,89,85,149,85,85,89,85,149,85,85,89,85,149,85,85,89,85,149,85,85,89,85,149,85,85,89,85,149,85,85,89,85,149,85,85,89,85,149,85,85,89,85,149,85,85,89,85,149,85,85,89,85,149,85,1],
					"sParametricMapping": {
						"ucParametricMap": 1
					},
					"sAsl": {
						"ulMode": 1
					},
					"sWorkflow": {
						"ucWaitForUserStart": 1,
						"eConflictSolverStrategy": 1,
						"ucDotVoiceSettingsOverride": 1,
						"ucDotPauseSettingsOverride": 1
					},
					"sDynDistCorrFilter": {
						"ucMode": 1
					},
					"sChannelMatrix": {
						"ucChannelMixingMode": 2,
						"ucChannelDiscardMode": 1
					},
					"sPTXData": {
						"uiPTXTargetMagMode": 1,
						"sPTXMPRSliceArray": {
							"sTSat": {
								"ulShape": 1
							}
						},
						"sPTXMPRGroupArray": {
							"sPSat": {
								"ulShape": 1
							}
						}
					},
					"sInlineCardioEval": {
						"lInlineEvaMode": 1,
						"lNoOfPreps": 1,
						"alRecoveryDuration": 1,
						"alSamplingDuration": 1
					},
					"sInteractive": {
						"ucTracking": 0,
						"ucSliceFollowing": 1,
						"ucSliceFollowingMode": 1,
						"lTrackingBackgroundSuppr": 5,
						"lTrackingSensitivity": 1,
						"lTrackingFlipAngle": 10,
						"ucPause": 0,
						"ucMosaic": 0,
						"ucSkipPhysioTrigger": 0
					},
					"sDixonData": {
						"ucDixon": 0,
						"ucDixonEvaluation": 0,
						"ucFastDixon": 0,
						"sMrDixonOptions": {
							"ucDixonFat": 0,
							"ucDixonWater": 0,
							"ucDixonInPhase": 0,
							"ucDixonOpposedPhase": 0,
							"ucDixonOriginalEchoes": 1
						},
						"sMrDixonEvaluationOptions": {
							"ucDixonEvaWaterFraction": 0,
							"ucDixonEvaFatFraction": 0,
							"ucDixonEvaT2Star": 0,
							"ucDixonEvaR2Star": 0,
							"ucDixonEvaReport": 0
						}
					},
					"sSliceAcceleration": {
						"lMultiBandFactor": 4
					}
				},
				"GradientMode": "",
				"FlowCompensation": "No",
				"RFSWDOperationMode": 0,
				"RFSWDMostCriticalAspect": "Head",
				"SARMostCriticalAspect": [3.2,0.32550959,0],
				"TablePositionOrigin": [0,0,-1250],
				"B1rms": [100,0.79252604],
				"B1rmsSupervision": "NO",
				"TalesReferencePower": 1509.120775,
				"PhaseSliceOversampling": "2D",
				"SafetyStandard": "IEC",
				"DICOMImageFlavor": "",
				"DICOMAcquisitionContrast": "",
				"EchoTrainLength": 35,
				"RFEchoTrainLength": 0,
				"GradientEchoTrainLength": 35,
				"Laterality4MF": "U"
			},
			"Private_0029_1160": "com ",
			"StudyComments": "Subject2",
			"PerformedProcedureStepStartDate": 738280,
			"PerformedProcedureStepStartTime": 54273.928,
			"PerformedProcedureStepID": "MR20210504150433",
			"PerformedProcedureStepDescription": "RECHERCHE_CIBM^Oscar",
			"Private_0051_0010": "SIEMENS MR HEADER ",
			"Private_0051_1008": "IMAGE NUM 4 ",
			"Private_0051_1009": "1.0 ",
			"Private_0051_100a": "TA 06:35",
			"Private_0051_100b": "64*64 ",
			"Private_0051_100c": "FoV 1152*1152 ",
			"Private_0051_100e": "Tra>Cor(-7.7)>Sag(2.8)",
			"Private_0051_100f": "HE1-4;NE1,2 ",
			"Private_0051_1011": "p2 s4 ",
			"Private_0051_1012": "TP 0",
			"Private_0051_1013": "+LPH",
			"Private_0051_1015": "R ",
			"Private_0051_1016": "p2 s4 M/ND/NORM/MOSAIC",
			"Private_0051_1017": "SL 3.0",
			"Private_0051_1019": "A1/FS ",
			"StartOfPixelData": 143318,
			"SizeOfPixelData": 294912,
			"VROfPixelData": "OW"
		}
	]
}