{
    "id": "d4b7988e-664e-480a-9b50-30e9841c267e",
    "title": "Brazil Sea Ports (OpenStreetMap Export)",
    "name": "hotosm_bra_sea_ports",
    "notes": "OpenStreetMap exports for use in GIS applications. This theme includes all OpenStreetMap features in this area matching ( Learn what tags means here ) : tags['amenity'] = 'ferry_terminal' OR tags['building'] = 'ferry_terminal' OR tags['port'] IS NOT NULL Features may have these attributes:  name name:en amenity building port operator:type addr:full addr:city source name:pt  This dataset is one of many OpenStreetMap exports on HDX. See the Humanitarian OpenStreetMap Team website for more information.",
    "dataset_source": "OpenStreetMap contributors",
    "organization": "Humanitarian OpenStreetMap Team (HOT)",
    "dataset_date": "[2024-04-05T00:00:00 TO 2024-04-05T23:59:59]",
    "last_modified": "2024-04-05T15:57:14.396582",
    "data_update_frequency": "Every month",
    "groups": [
        "Brazil"
    ],
    "license_title": "Open Database License (ODC-ODbL)",
    "methodology": "Other",
    "methodology_other": "Volunteered geographic information",
    "caveats": "OpenStreetMap data is crowd sourced and cannot be considered to be exhaustive",
    "tags": [
        "facilities-infrastructure",
        "geodata",
        "ports"
    ],
    "resources": [
        {
            "created": "2024-04-05T15:57:14.417233",
            "description": "ESRI Shapefile",
            "format": "SHP",
            "download_url": "https://s3.dualstack.us-east-1.amazonaws.com/production-raw-data-api/ISO3/BRA/sea_ports/points/hotosm_bra_sea_ports_points_shp.zip",
            "id": "884d0019-2bbf-40ac-aa4b-1a6f424c6f14",
            "last_modified": "2024-04-05T15:57:14.394849",
            "metadata_modified": "2024-04-05T15:59:19.139161",
            "microdata": false,
            "dataset_id": "d4b7988e-664e-480a-9b50-30e9841c267e",
            "resource_type": "api",
            "name": "hotosm_bra_sea_ports_points_shp.zip",
            "mimetype": null,
            "size": "54.5K"
        },
        {
            "created": "2024-04-05T15:57:14.417238",
            "description": "KML",
            "format": "KML",
            "download_url": "https://s3.dualstack.us-east-1.amazonaws.com/production-raw-data-api/ISO3/BRA/sea_ports/points/hotosm_bra_sea_ports_points_kml.zip",
            "id": "8aba1166-9761-4da6-95c9-5ceb5d139e86",
            "last_modified": "2024-04-05T15:57:14.395114",
            "metadata_modified": "2024-04-05T15:59:21.907037",
            "microdata": false,
            "dataset_id": "d4b7988e-664e-480a-9b50-30e9841c267e",
            "resource_type": "api",
            "name": "hotosm_bra_sea_ports_points_kml.zip",
            "mimetype": null,
            "size": "39.1K"
        },
        {
            "created": "2024-04-05T15:57:14.417242",
            "description": "GeoJSON",
            "format": "GeoJSON",
            "download_url": "https://s3.dualstack.us-east-1.amazonaws.com/production-raw-data-api/ISO3/BRA/sea_ports/points/hotosm_bra_sea_ports_points_geojson.zip",
            "id": "94cf4f60-1a66-40e7-880f-0485d00efd59",
            "last_modified": "2024-04-05T15:57:14.395263",
            "metadata_modified": "2024-04-05T15:59:38.187710",
            "microdata": false,
            "dataset_id": "d4b7988e-664e-480a-9b50-30e9841c267e",
            "resource_type": "api",
            "name": "hotosm_bra_sea_ports_points_geojson.zip",
            "mimetype": null,
            "size": "39.2K"
        },
        {
            "created": "2024-04-05T15:57:14.417245",
            "description": "GPKG",
            "format": "Geopackage",
            "download_url": "https://s3.dualstack.us-east-1.amazonaws.com/production-raw-data-api/ISO3/BRA/sea_ports/points/hotosm_bra_sea_ports_points_gpkg.zip",
            "id": "c577cb5a-379c-4b4b-af87-22684df5224b",
            "last_modified": "2024-04-05T15:57:14.395388",
            "metadata_modified": "2024-04-05T15:59:19.139494",
            "microdata": false,
            "dataset_id": "d4b7988e-664e-480a-9b50-30e9841c267e",
            "resource_type": "api",
            "name": "hotosm_bra_sea_ports_points_gpkg.zip",
            "mimetype": null,
            "size": "51.9K"
        },
        {
            "created": "2024-04-05T15:57:14.417248",
            "description": "ESRI Shapefile",
            "format": "SHP",
            "download_url": "https://s3.dualstack.us-east-1.amazonaws.com/production-raw-data-api/ISO3/BRA/sea_ports/lines/hotosm_bra_sea_ports_lines_shp.zip",
            "id": "c7488839-2c83-44e0-a859-2b20b86db0f5",
            "last_modified": "2024-04-05T15:57:14.395529",
            "metadata_modified": "2024-04-05T15:59:46.371014",
            "microdata": false,
            "dataset_id": "d4b7988e-664e-480a-9b50-30e9841c267e",
            "resource_type": "api",
            "name": "hotosm_bra_sea_ports_lines_shp.zip",
            "mimetype": null,
            "size": "1.1K"
        },
        {
            "created": "2024-04-05T15:57:14.417252",
            "description": "KML",
            "format": "KML",
            "download_url": "https://s3.dualstack.us-east-1.amazonaws.com/production-raw-data-api/ISO3/BRA/sea_ports/lines/hotosm_bra_sea_ports_lines_kml.zip",
            "id": "aeb00387-a474-4c48-b2d1-a852e92fd304",
            "last_modified": "2024-04-05T15:57:14.395650",
            "metadata_modified": "2024-04-05T15:59:49.851996",
            "microdata": false,
            "dataset_id": "d4b7988e-664e-480a-9b50-30e9841c267e",
            "resource_type": "api",
            "name": "hotosm_bra_sea_ports_lines_kml.zip",
            "mimetype": null,
            "size": "695.0B"
        },
        {
            "created": "2024-04-05T15:57:14.417255",
            "description": "GeoJSON",
            "format": "GeoJSON",
            "download_url": "https://s3.dualstack.us-east-1.amazonaws.com/production-raw-data-api/ISO3/BRA/sea_ports/lines/hotosm_bra_sea_ports_lines_geojson.zip",
            "id": "87697f9d-bc0b-4bcd-8318-e06a265c7681",
            "last_modified": "2024-04-05T15:57:14.395824",
            "metadata_modified": "2024-04-05T15:59:58.515618",
            "microdata": false,
            "dataset_id": "d4b7988e-664e-480a-9b50-30e9841c267e",
            "resource_type": "api",
            "name": "hotosm_bra_sea_ports_lines_geojson.zip",
            "mimetype": null,
            "size": "647.0B"
        },
        {
            "created": "2024-04-05T15:57:14.417258",
            "description": "GPKG",
            "format": "Geopackage",
            "download_url": "https://s3.dualstack.us-east-1.amazonaws.com/production-raw-data-api/ISO3/BRA/sea_ports/lines/hotosm_bra_sea_ports_lines_gpkg.zip",
            "id": "3e29e723-a2e9-4674-830a-d245c51a613f",
            "last_modified": "2024-04-05T15:57:14.396056",
            "metadata_modified": "2024-04-05T15:59:19.139857",
            "microdata": false,
            "dataset_id": "d4b7988e-664e-480a-9b50-30e9841c267e",
            "resource_type": "api",
            "name": "hotosm_bra_sea_ports_lines_gpkg.zip",
            "mimetype": null,
            "size": "3.8K"
        },
        {
            "created": "2024-04-05T15:57:14.417261",
            "description": "ESRI Shapefile",
            "format": "SHP",
            "download_url": "https://s3.dualstack.us-east-1.amazonaws.com/production-raw-data-api/ISO3/BRA/sea_ports/polygons/hotosm_bra_sea_ports_polygons_shp.zip",
            "id": "4697126c-63e7-4591-9b35-857e925d6044",
            "last_modified": "2024-04-05T15:57:14.396206",
            "metadata_modified": "2024-04-05T16:00:10.320208",
            "microdata": false,
            "dataset_id": "d4b7988e-664e-480a-9b50-30e9841c267e",
            "resource_type": "api",
            "name": "hotosm_bra_sea_ports_polygons_shp.zip",
            "mimetype": null,
            "size": "17.2K"
        },
        {
            "created": "2024-04-05T15:57:14.417265",
            "description": "KML",
            "format": "KML",
            "download_url": "https://s3.dualstack.us-east-1.amazonaws.com/production-raw-data-api/ISO3/BRA/sea_ports/polygons/hotosm_bra_sea_ports_polygons_kml.zip",
            "id": "cc456db3-7cec-4a6b-a5b5-be7a94da03e3",
            "last_modified": "2024-04-05T15:57:14.396331",
            "metadata_modified": "2024-04-05T16:00:13.366886",
            "microdata": false,
            "dataset_id": "d4b7988e-664e-480a-9b50-30e9841c267e",
            "resource_type": "api",
            "name": "hotosm_bra_sea_ports_polygons_kml.zip",
            "mimetype": null,
            "size": "11.2K"
        },
        {
            "created": "2024-04-05T15:57:14.417268",
            "description": "GeoJSON",
            "format": "GeoJSON",
            "download_url": "https://s3.dualstack.us-east-1.amazonaws.com/production-raw-data-api/ISO3/BRA/sea_ports/polygons/hotosm_bra_sea_ports_polygons_geojson.zip",
            "id": "c330c5d8-0191-4648-9c5f-e36eaa23fb30",
            "last_modified": "2024-04-05T15:57:14.396464",
            "metadata_modified": "2024-04-05T16:00:21.985321",
            "microdata": false,
            "dataset_id": "d4b7988e-664e-480a-9b50-30e9841c267e",
            "resource_type": "api",
            "name": "hotosm_bra_sea_ports_polygons_geojson.zip",
            "mimetype": null,
            "size": "11.1K"
        },
        {
            "created": "2024-04-05T15:57:14.417270",
            "description": "GPKG",
            "format": "Geopackage",
            "download_url": "https://s3.dualstack.us-east-1.amazonaws.com/production-raw-data-api/ISO3/BRA/sea_ports/polygons/hotosm_bra_sea_ports_polygons_gpkg.zip",
            "id": "61564d3a-c83a-4630-9689-cf5b9f152c92",
            "last_modified": "2024-04-05T15:57:14.396582",
            "metadata_modified": "2024-04-05T15:59:19.140212",
            "microdata": false,
            "dataset_id": "d4b7988e-664e-480a-9b50-30e9841c267e",
            "resource_type": "api",
            "name": "hotosm_bra_sea_ports_polygons_gpkg.zip",
            "mimetype": null,
            "size": "20.3K"
        }
    ]
}