{
    "id": "027df1ae-46bc-426c-ab8e-e807810171ce",
    "title": "HOTOSM Brazil (South2) Health Facilities (OpenStreetMap Export)",
    "name": "hotosm_bra_south2_health_facilities",
    "notes": "OpenStreetMap exports for use in GIS applications. This theme includes all OpenStreetMap features in this area matching: healthcare IS NOT NULL OR amenity IN ('doctors','dentist','clinic','hospital','pharmacy') Features may have these attributes:  addr:city addr:full healthcare:speciality amenity capacity:persons healthcare operator:type source name building  This dataset is one of many OpenStreetMap exports on HDX. See the Humanitarian OpenStreetMap Team website for more information.",
    "dataset_source": "OpenStreetMap contributors",
    "organization": "Humanitarian OpenStreetMap Team (HOT)",
    "dataset_date": "[2023-03-04T00:00:00 TO 2023-03-04T23:59:59]",
    "last_modified": "2020-06-09T22:01:45.370621",
    "data_update_frequency": "Every month",
    "groups": [
        "Brazil"
    ],
    "license_title": "Open Database License (ODC-ODbL)",
    "methodology": "Other",
    "methodology_other": "Volunteered geographic information",
    "caveats": "OpenStreetMap data is crowd sourced and cannot be considered to be exhaustive",
    "tags": [
        "geodata",
        "health",
        "health facilities"
    ],
    "resources": [
        {
            "created": "2019-12-06T14:44:11.940772",
            "description": "ESRI Shapefile",
            "format": "SHP",
            "download_url": "https://export.hotosm.org/downloads/f4949888-ebbb-4642-9717-549832e1e9b8/hotosm_bra_south2_health_facilities_points_shp.zip",
            "id": "b3111724-6e4a-4e91-ab2d-3453a7ebb5f8",
            "last_modified": "2020-06-09T22:01:45.370621",
            "metadata_modified": "2024-01-26T05:22:03.153540",
            "microdata": false,
            "dataset_id": "027df1ae-46bc-426c-ab8e-e807810171ce",
            "resource_type": "api",
            "name": "hotosm_bra_south2_health_facilities_points_shp.zip",
            "mimetype": null,
            "size": "0.0B"
        },
        {
            "created": "2019-12-06T14:44:11.940782",
            "description": "ESRI Shapefile",
            "format": "SHP",
            "download_url": "https://export.hotosm.org/downloads/f4949888-ebbb-4642-9717-549832e1e9b8/hotosm_bra_south2_health_facilities_polygons_shp.zip",
            "id": "ce02f23a-ee1e-4991-8917-c75ef7804978",
            "last_modified": "2020-06-09T22:01:45.370621",
            "metadata_modified": "2024-01-26T05:22:04.047078",
            "microdata": false,
            "dataset_id": "027df1ae-46bc-426c-ab8e-e807810171ce",
            "resource_type": "api",
            "name": "hotosm_bra_south2_health_facilities_polygons_shp.zip",
            "mimetype": null,
            "size": "0.0B"
        },
        {
            "created": "2019-12-06T14:44:11.940787",
            "description": "Geopackage, SQLite compatible",
            "format": "Geopackage",
            "download_url": "https://export.hotosm.org/downloads/f4949888-ebbb-4642-9717-549832e1e9b8/hotosm_bra_south2_health_facilities_gpkg.zip",
            "id": "edb70af1-a1f9-4118-9c98-33ead16df318",
            "last_modified": "2020-06-09T22:01:45.370621",
            "metadata_modified": "2023-03-04T20:16:45.623446",
            "microdata": false,
            "dataset_id": "027df1ae-46bc-426c-ab8e-e807810171ce",
            "resource_type": "api",
            "name": "hotosm_bra_south2_health_facilities_gpkg.zip",
            "mimetype": null,
            "size": null
        },
        {
            "created": "2019-12-06T14:44:11.940816",
            "description": "Google Earth .KML",
            "format": "KML",
            "download_url": "https://export.hotosm.org/downloads/f4949888-ebbb-4642-9717-549832e1e9b8/hotosm_bra_south2_health_facilities_points_kml.zip",
            "id": "4b58c060-9e89-4817-8916-a0903e05bc25",
            "last_modified": "2020-06-09T22:01:45.370621",
            "metadata_modified": "2024-01-26T05:22:00.982884",
            "microdata": false,
            "dataset_id": "027df1ae-46bc-426c-ab8e-e807810171ce",
            "resource_type": "api",
            "name": "hotosm_bra_south2_health_facilities_points_kml.zip",
            "mimetype": null,
            "size": "0.0B"
        },
        {
            "created": "2019-12-06T14:44:11.940825",
            "description": "Google Earth .KML",
            "format": "KML",
            "download_url": "https://export.hotosm.org/downloads/f4949888-ebbb-4642-9717-549832e1e9b8/hotosm_bra_south2_health_facilities_polygons_kml.zip",
            "id": "f3f7bf18-3457-405a-a0ca-4c13726738c8",
            "last_modified": "2020-06-09T22:01:45.370621",
            "metadata_modified": "2024-01-26T05:22:02.041475",
            "microdata": false,
            "dataset_id": "027df1ae-46bc-426c-ab8e-e807810171ce",
            "resource_type": "api",
            "name": "hotosm_bra_south2_health_facilities_polygons_kml.zip",
            "mimetype": null,
            "size": "0.0B"
        },
        {
            "created": "2019-12-06T14:44:11.940829",
            "description": ".IMG for Garmin GPS Devices (All OSM layers for area)",
            "format": "Garmin IMG",
            "download_url": "https://export.hotosm.org/downloads/f4949888-ebbb-4642-9717-549832e1e9b8/hotosm_bra_south2_gmapsupp_img.zip",
            "id": "e8a5bdde-75f8-4e3f-96f6-28c0c785a118",
            "last_modified": "2020-06-09T22:01:45.370621",
            "metadata_modified": "2023-03-04T20:16:45.623744",
            "microdata": false,
            "dataset_id": "027df1ae-46bc-426c-ab8e-e807810171ce",
            "resource_type": "api",
            "name": "hotosm_bra_south2_gmapsupp_img.zip",
            "mimetype": null,
            "size": "0.0B"
        }
    ]
}