{
    "id": "ec96f43d-ac9f-40be-846a-da02adec34e1",
    "title": "HOTOSM Brazil (North) Populated Places (OpenStreetMap Export)",
    "name": "hotosm_bra_north_populated_places",
    "notes": "OpenStreetMap exports for use in GIS applications. This theme includes all OpenStreetMap features in this area matching: place IN ('isolated_dwelling','town','village','hamlet','city') Features may have these attributes:  name source population place is_in  This dataset is one of many OpenStreetMap exports on HDX. See the Humanitarian OpenStreetMap Team website for more information.",
    "dataset_source": "OpenStreetMap contributors",
    "organization": "Humanitarian OpenStreetMap Team (HOT)",
    "dataset_date": "[2023-03-07T00:00:00 TO 2023-03-07T23:59:59]",
    "last_modified": "2020-06-10T22:01:52.425613",
    "data_update_frequency": "Every month",
    "groups": [
        "Brazil"
    ],
    "license_title": "Open Database License (ODC-ODbL)",
    "methodology": "Other",
    "methodology_other": "Volunteered geographic information",
    "caveats": "OpenStreetMap data is crowd sourced and cannot be considered to be exhaustive",
    "tags": [
        "geodata",
        "populated places-settlements"
    ],
    "resources": [
        {
            "created": "2019-12-07T00:40:39.446251",
            "description": "ESRI Shapefile",
            "format": "SHP",
            "download_url": "https://export.hotosm.org/downloads/e5c67b43-9def-4dda-a17e-893d326d5549/hotosm_bra_north_populated_places_points_shp.zip",
            "id": "582abee6-5551-4861-87d8-06517b158f4f",
            "last_modified": "2020-06-10T22:01:52.425613",
            "metadata_modified": "2024-01-26T05:46:55.890802",
            "microdata": false,
            "dataset_id": "ec96f43d-ac9f-40be-846a-da02adec34e1",
            "resource_type": "api",
            "name": "hotosm_bra_north_populated_places_points_shp.zip",
            "mimetype": null,
            "size": "0.0B"
        },
        {
            "created": "2019-12-07T00:40:39.446263",
            "description": "ESRI Shapefile",
            "format": "SHP",
            "download_url": "https://export.hotosm.org/downloads/e5c67b43-9def-4dda-a17e-893d326d5549/hotosm_bra_north_populated_places_polygons_shp.zip",
            "id": "eee5e06b-8675-4bfa-a7bd-d86322272752",
            "last_modified": "2020-06-10T22:01:52.425613",
            "metadata_modified": "2024-01-26T05:46:29.484209",
            "microdata": false,
            "dataset_id": "ec96f43d-ac9f-40be-846a-da02adec34e1",
            "resource_type": "api",
            "name": "hotosm_bra_north_populated_places_polygons_shp.zip",
            "mimetype": null,
            "size": "0.0B"
        },
        {
            "created": "2019-12-07T00:40:39.446268",
            "description": "Geopackage, SQLite compatible",
            "format": "Geopackage",
            "download_url": "https://export.hotosm.org/downloads/e5c67b43-9def-4dda-a17e-893d326d5549/hotosm_bra_north_populated_places_gpkg.zip",
            "id": "3a3483f8-9613-4c46-a924-3fd79b07247d",
            "last_modified": "2020-06-10T22:01:52.425613",
            "metadata_modified": "2023-03-07T01:02:51.230458",
            "microdata": false,
            "dataset_id": "ec96f43d-ac9f-40be-846a-da02adec34e1",
            "resource_type": "api",
            "name": "hotosm_bra_north_populated_places_gpkg.zip",
            "mimetype": null,
            "size": null
        },
        {
            "created": "2019-12-07T00:40:39.446272",
            "description": "Google Earth .KML",
            "format": "KML",
            "download_url": "https://export.hotosm.org/downloads/e5c67b43-9def-4dda-a17e-893d326d5549/hotosm_bra_north_populated_places_points_kml.zip",
            "id": "1ea1a6f9-7585-495a-a4a0-0d866323ea28",
            "last_modified": "2020-06-10T22:01:52.425613",
            "metadata_modified": "2024-01-26T05:46:30.608850",
            "microdata": false,
            "dataset_id": "ec96f43d-ac9f-40be-846a-da02adec34e1",
            "resource_type": "api",
            "name": "hotosm_bra_north_populated_places_points_kml.zip",
            "mimetype": null,
            "size": "0.0B"
        },
        {
            "created": "2019-12-07T00:40:39.446276",
            "description": "Google Earth .KML",
            "format": "KML",
            "download_url": "https://export.hotosm.org/downloads/e5c67b43-9def-4dda-a17e-893d326d5549/hotosm_bra_north_populated_places_polygons_kml.zip",
            "id": "62833821-e94c-4ddd-85ab-4708a5ed4334",
            "last_modified": "2020-06-10T22:01:52.425613",
            "metadata_modified": "2024-01-26T05:46:31.996768",
            "microdata": false,
            "dataset_id": "ec96f43d-ac9f-40be-846a-da02adec34e1",
            "resource_type": "api",
            "name": "hotosm_bra_north_populated_places_polygons_kml.zip",
            "mimetype": null,
            "size": "0.0B"
        },
        {
            "created": "2019-12-07T00:40:39.446280",
            "description": ".IMG for Garmin GPS Devices (All OSM layers for area)",
            "format": "Garmin IMG",
            "download_url": "http://export.hotosm.org/downloads/2d77cd1e-f254-411e-aa01-48d3e803c3ea/hotosm_bra_north_gmapsupp_img.zip",
            "id": "f1af51c4-ce1c-48aa-8a59-23ba17d0e4a9",
            "last_modified": "2020-06-10T22:01:52.425613",
            "metadata_modified": "2021-08-09T05:55:41.863434",
            "microdata": false,
            "dataset_id": "ec96f43d-ac9f-40be-846a-da02adec34e1",
            "resource_type": "api",
            "name": "hotosm_bra_north_gmapsupp_img.zip",
            "mimetype": null,
            "size": "0.0B"
        }
    ]
}