{
    "id": "c3429f0e-651b-4788-bb2f-4adbf222c90e",
    "title": "Movement Range Maps",
    "name": "movement-range-maps",
    "notes": "NOTE: We plan to no longer update this dataset after May 22 2022.  These data sets are intended to inform researchers and public health experts about how populations are responding to physical distancing measures. In particular, there are two metrics, Change in Movement and Stay Put, that provide a slightly different perspective on movement trends. Change in Movement looks at how much people are moving around and compares it with a baseline period that predates most social distancing measures, while Stay Put looks at the fraction of the population that appear to stay within a small area during an entire day. Full details, including the privacy protections in this data, are available here: https://research.fb.com/blog/2020/06/protecting-privacy-in-facebook-mobility-data-during-the-covid-19-response/",
    "dataset_source": "Facebook",
    "organization": "Data for Good at Meta",
    "dataset_date": "[2020-03-01T00:00:00 TO 2022-05-22T23:59:59]",
    "last_modified": "2022-05-24T04:02:33.007599",
    "data_update_frequency": "As needed",
    "groups": [
        "Albania",
        "Algeria",
        "American Samoa",
        "Angola",
        "Argentina",
        "Australia",
        "Austria",
        "Bangladesh",
        "Belarus",
        "Belgium",
        "Benin",
        "Bhutan",
        "Bolivia (Plurinational State of)",
        "Bosnia and Herzegovina",
        "Botswana",
        "Brazil",
        "Brunei Darussalam",
        "Bulgaria",
        "Burkina Faso",
        "Burundi",
        "Cambodia",
        "Cameroon",
        "Canada",
        "Central African Republic",
        "Chad",
        "Chile",
        "China, Hong Kong Special Administrative Region",
        "China, Macao Special Administrative Region",
        "Colombia",
        "Congo",
        "Costa Rica",
        "C\u00f4te d'Ivoire",
        "Croatia",
        "Czechia",
        "Democratic Republic of the Congo",
        "Djibouti",
        "Dominica",
        "Dominican Republic",
        "Ecuador",
        "Egypt",
        "El Salvador",
        "Equatorial Guinea",
        "Estonia",
        "Ethiopia",
        "Faroe Islands",
        "Fiji",
        "Finland",
        "France",
        "French Guiana",
        "Gabon",
        "Gambia",
        "Georgia",
        "Germany",
        "Ghana",
        "Greece",
        "Guadeloupe",
        "Guatemala",
        "Guinea",
        "Guinea-Bissau",
        "Guyana",
        "Haiti",
        "Honduras",
        "Hungary",
        "Iceland",
        "Indonesia",
        "Iraq",
        "Ireland",
        "Isle of Man",
        "Italy",
        "Jamaica",
        "Japan",
        "Jordan",
        "Kazakhstan",
        "Kenya",
        "Kyrgyzstan",
        "Lao People's Democratic Republic",
        "Latvia",
        "Lebanon",
        "Lesotho",
        "Liberia",
        "Lithuania",
        "Luxembourg",
        "Madagascar",
        "Malawi",
        "Malaysia",
        "Mali",
        "Malta",
        "Martinique",
        "Mauritania",
        "Mauritius",
        "Mexico",
        "Mongolia",
        "Mozambique",
        "Namibia",
        "Nepal",
        "Netherlands",
        "New Caledonia",
        "New Zealand",
        "Nicaragua",
        "Niger",
        "Nigeria",
        "North Macedonia",
        "Norway",
        "Oman",
        "Panama",
        "Papua New Guinea",
        "Paraguay",
        "Peru",
        "Philippines",
        "Poland",
        "Portugal",
        "Qatar",
        "Republic of Korea",
        "Republic of Moldova",
        "R\u00e9union",
        "Romania",
        "Rwanda",
        "Samoa",
        "Sao Tome and Principe",
        "Saudi Arabia",
        "Senegal",
        "Serbia",
        "Sierra Leone",
        "Slovakia",
        "Slovenia",
        "South Africa",
        "Spain",
        "Sri Lanka",
        "Suriname",
        "Sweden",
        "Switzerland",
        "Taiwan (Province of China)",
        "Tajikistan",
        "Thailand",
        "Timor-Leste",
        "Togo",
        "Trinidad and Tobago",
        "Tunisia",
        "T\u00fcrkiye",
        "Uganda",
        "United Arab Emirates",
        "United Kingdom",
        "United Republic of Tanzania",
        "United States",
        "United States Virgin Islands",
        "Uruguay",
        "Uzbekistan",
        "Vanuatu",
        "Viet Nam",
        "Zambia",
        "Zimbabwe"
    ],
    "license_title": "Creative Commons Attribution International",
    "methodology": "Other",
    "methodology_other": "https://research.fb.com/blog/2020/06/protecting-privacy-in-facebook-mobility-data-during-the-covid-19-response/",
    "caveats": "NOTE: We plan to no longer update this dataset after May 24 2022. ",
    "tags": [],
    "resources": [
        {
            "created": "2020-06-03T18:04:59.175354",
            "description": "",
            "format": "TXT",
            "download_url": "https://data.humdata.org/dataset/c3429f0e-651b-4788-bb2f-4adbf222c90e/resource/435ed157-6f7a-4e8f-a63a-2aa177b9bd05/download/readme.txt",
            "id": "435ed157-6f7a-4e8f-a63a-2aa177b9bd05",
            "last_modified": "2022-05-24T04:02:33.007599",
            "metadata_modified": "2022-05-24T04:02:33.257508",
            "microdata": false,
            "dataset_id": "c3429f0e-651b-4788-bb2f-4adbf222c90e",
            "resource_type": null,
            "name": "How To Understand This Data.txt",
            "mimetype": "text/plain",
            "size": "961.0B"
        },
        {
            "created": "2020-12-04T21:18:44.451227",
            "description": "",
            "format": "zip",
            "download_url": "https://data.humdata.org/dataset/c3429f0e-651b-4788-bb2f-4adbf222c90e/resource/55a51014-0d27-49ae-bf92-c82a570c2c6c/download/movement-range-data-2022-05-22.zip",
            "id": "55a51014-0d27-49ae-bf92-c82a570c2c6c",
            "last_modified": "2022-05-24T04:01:50.982982",
            "metadata_modified": "2022-05-24T04:02:33.257668",
            "microdata": false,
            "dataset_id": "c3429f0e-651b-4788-bb2f-4adbf222c90e",
            "resource_type": null,
            "name": "movement-range-data-2022-05-22.zip",
            "mimetype": "application/zip",
            "size": "69.7M"
        },
        {
            "created": "2021-07-27T19:25:53.851296",
            "description": "",
            "format": "TXT",
            "download_url": "https://data.humdata.org/dataset/c3429f0e-651b-4788-bb2f-4adbf222c90e/resource/3d77ce5c-ab6d-4864-b8a2-c8bafffac4f3/download/movement-range-data-2020-03-01-2020-12-31.zip",
            "id": "3d77ce5c-ab6d-4864-b8a2-c8bafffac4f3",
            "last_modified": "2021-07-27T19:25:52.653823",
            "metadata_modified": "2021-07-27T20:58:58.020547",
            "microdata": false,
            "dataset_id": "c3429f0e-651b-4788-bb2f-4adbf222c90e",
            "resource_type": "file.upload",
            "name": "movement-range-data-2020-03-01--2020-12-31.zip",
            "mimetype": "application/zip",
            "size": "53.9M"
        }
    ]
}