{
    "id": "5b30c730-0281-4f64-9c8a-88a8435a0328",
    "title": "Brazil - Protection Monitoring, 2020",
    "name": "unhcr-bra-pm-2020-v2-1",
    "notes": "The size of the outflows from Venezuela sharply increased from some 700,000 in 2015 to over 4 million by June 2019, largely driven by a substantial deterioration of the situation in the country. Given the disruption of the functioning of some democratic institutions and rule of law, and its impact on the preservation of security, economic stability, health, public peace and the general welfare system, the crisis continues to worsen and serious human rights violations are widely reported. The displacement outside Venezuela has mostly affected countries in Latin America and the Caribbean, particularly Argentina, Brazil, Chile, Colombia, Ecuador, Peru, and the southern Caribbean islands. Most governments in the region have made efforts to facilitate access to territory, documentation and access to services, but the capacity of host countries has become overstretched to address the increasing protection and integration needs, resulting in tighter border controls being put in place. Protection monitoring is a core UNHCR activity which aims at ensuring an adequate and timely understanding of the protection situation of persons affected by forced displacement. The action-oriented nature of protection monitoring allows UNHCR to adapt to the needs and protection risks faced by persons displaced outside Venezuela and informs a broad range of responses.",
    "dataset_source": "UNHCR",
    "organization": "UNHCR - The UN Refugee Agency",
    "dataset_date": "[2019-05-01T00:00:00 TO 2020-04-30T23:59:59]",
    "last_modified": "2020-09-04T00:00:00",
    "data_update_frequency": "Never",
    "groups": [
        "Brazil"
    ],
    "license_title": "Other",
    "methodology": "Other",
    "methodology_other": "Unit of Analysis: Household and individual  \nSampling Procedure: UNHCR undertook a survey to understand the protection needs of Venezuelan persons of concern (asylum-seekers and refugees) by taking a sample of those who registered with UNHCR. This survey was conducted through the Protection Monitoring Tool (PMT).\n\t\t  \nThe survey was voluntary, and each respondent\u2019s consent was obtained before posing questions. The responses are not a representative sampling of the Venezuelan population, but rather those who registered with UNHCR, and who consented to the survey. \n\nThe survey was extensive, providing answers to over 100 questions. It covered general profiles, household composition, travel routes, education, and employment. The information was collected using KOBO Toolkit, the corporate tool of UNHCR.  \nData Collection Mode: Face-to-face [f2f]  \n",
    "caveats": "The data must be requested via the resource download link",
    "tags": [
        "education",
        "health",
        "livelihoods",
        "protection"
    ],
    "resources": [
        {
            "created": "2021-02-07T17:35:48.646611",
            "description": "Clicking \"Download\" leads outside HDX where you can request access to the data in csv, xlsx &amp; dta formats",
            "format": "Web App",
            "download_url": "https://microdata.unhcr.org/index.php/auth/login/?destination=catalog/258/get-microdata",
            "id": "33d5427c-7cfd-42de-9b7b-3d11de6b4b56",
            "last_modified": "2020-09-04T00:00:00",
            "metadata_modified": "2024-02-25T02:13:32.837747",
            "microdata": false,
            "dataset_id": "5b30c730-0281-4f64-9c8a-88a8435a0328",
            "resource_type": "api",
            "name": "Brazil - Protection Monitoring, 2020",
            "mimetype": null,
            "size": null
        },
        {
            "created": "2021-02-07T17:35:48.646616",
            "description": "Contains information about the dataset's metadata and data",
            "format": "PDF",
            "download_url": "https://microdata.unhcr.org/index.php/catalog/258/pdf-documentation",
            "id": "bcce8878-676f-468c-ac7b-dd21c52273b3",
            "last_modified": "2020-09-04T00:00:00",
            "metadata_modified": "2024-02-25T02:13:32.837871",
            "microdata": false,
            "dataset_id": "5b30c730-0281-4f64-9c8a-88a8435a0328",
            "resource_type": "api",
            "name": "Codebook",
            "mimetype": null,
            "size": null
        }
    ]
}