{
    "id": "b1ff8958-1323-4b2d-b931-7bab4f07afe2",
    "title": "Brazil - Internal displacements (New Displacements) - IDPs",
    "name": "idmc-idp-data-bra",
    "notes": "Internally displaced persons are defined according to the 1998 Guiding Principles (http://www.internal-displacement.org/publications/1998/ocha-guiding-principles-on-internal-displacement) as people or groups of people who have been forced or obliged to flee or to leave their homes or places of habitual residence, in particular as a result of armed conflict, or to avoid the effects of armed conflict, situations of generalized violence, violations of human rights, or natural or human-made disasters and who have not crossed an international border. \"Internally displaced persons - IDPs\" refers to the number of people living in displacement as of the end of each year. \"Internal displacements (New Displacements)\" refers to the number of new cases or incidents of displacement recorded, rather than the number of people displaced. This is done because people may have been displaced more than once. Contains data from IDMC's Global Internal Displacement Database.",
    "dataset_source": "IDMC",
    "organization": "Internal Displacement Monitoring Centre (IDMC)",
    "dataset_date": "[2008-01-01T00:00:00 TO 2022-12-31T23:59:59]",
    "last_modified": "2023-09-20T04:26:46.786514",
    "data_update_frequency": "Every year",
    "groups": [
        "Brazil"
    ],
    "license_title": "Creative Commons Attribution for Intergovernmental Organisations",
    "methodology": "Other",
    "methodology_other": "Internally displaced persons are \"persons or groups of persons who have been forced or obliged to flee or to leave their homes or places of habitual residence, in particular as a result of or in order to avoid the effects of armed conflict, situations of generalized violence, violations of human rights or natural or human-made disasters, and who have not crossed an internationally recognized state border.\"\n\nInternally displaced people are often confused with refugees. Unlike refugees, internally displaced people remain under the protection of their own government, even if their reason for fleeing was similar to that of refugees. Refugees are people who have crossed an international border to find sanctuary and have been granted refugee or refugee-like status or temporary protection.\n",
    "caveats": "Please note that most of the figures are estimates. The definition highlights two issues:\n\n1) The coercive or otherwise involuntary character of movement. The definition mentions some of the most common causes of involuntary movements, such as armed conflict, violence, human rights violations and disasters. These causes have in common that they give no choice to people but to leave their homes and deprive them of the most essential protection mechanisms, such as community networks, access to services, livelihoods. Displacement severely affects the physical, socio-economic and legal safety of people and should be systematically regarded as an indicator of potential vulnerability.\n\n2) The fact that such movement takes place within national borders. Unlike refugees, who have been deprived of the protection of their state of origin, IDPs remain legally under the protection of national authorities of their country of habitual residence. IDPs should therefore enjoy the same rights as the rest of the population. The Guiding Principles on Internal Displacement remind national authorities and other relevant actors of their responsibility to ensure that IDPs\" rights are respected and fulfilled, despite the vulnerability generated by their displacement.\n",
    "tags": [
        "conflict-violence",
        "displacement",
        "hxl",
        "internally displaced persons-idp"
    ],
    "resources": [
        {
            "created": "2017-09-04T10:03:24.878487",
            "description": "Internally displaced persons - IDPs for Brazil",
            "format": "CSV",
            "download_url": "https://data.humdata.org/dataset/b1ff8958-1323-4b2d-b931-7bab4f07afe2/resource/1dd250d1-5d61-4216-a34c-6879e795a161/download/internally-displaced-persons-idps_bra.csv",
            "id": "1dd250d1-5d61-4216-a34c-6879e795a161",
            "last_modified": "2023-09-20T04:26:46.669618",
            "metadata_modified": "2023-09-20T04:26:49.343989",
            "microdata": false,
            "dataset_id": "b1ff8958-1323-4b2d-b931-7bab4f07afe2",
            "resource_type": "file.upload",
            "name": "Internally displaced persons - IDPs",
            "mimetype": "",
            "size": "298.0B"
        },
        {
            "created": "2017-09-04T10:03:24.878505",
            "description": "Internal displacements (new displacements) associated with disasters for Brazil",
            "format": "CSV",
            "download_url": "https://data.humdata.org/dataset/b1ff8958-1323-4b2d-b931-7bab4f07afe2/resource/c1cc5dbb-bc53-47a0-b874-b93e83d6daae/download/internal-displacements-new-displacements-associated-with-disasters_bra.csv",
            "id": "c1cc5dbb-bc53-47a0-b874-b93e83d6daae",
            "last_modified": "2023-09-20T04:26:46.786514",
            "metadata_modified": "2023-09-20T04:26:48.906681",
            "microdata": false,
            "dataset_id": "b1ff8958-1323-4b2d-b931-7bab4f07afe2",
            "resource_type": "file.upload",
            "name": "Internal displacements (new displacements) associated with disasters",
            "mimetype": "",
            "size": "60.5K"
        }
    ]
}