{
    "id": "d0e1806d-e1ed-4b60-bd4a-6a36dfb8053a",
    "title": "Immunization Campaigns Impacted due to COVID-19",
    "name": "immunization-campaigns-impacted",
    "notes": "Immunization campaigns impacted due to COVID-19",
    "dataset_source": "Multiple sources",
    "organization": "World Health Organization",
    "dataset_date": "[2020-12-14T00:00:00 TO 2023-11-09T23:59:59]",
    "last_modified": "2023-10-29T01:01:50.117775",
    "data_update_frequency": "Live",
    "groups": [
        "Afghanistan",
        "Angola",
        "Bangladesh",
        "Benin",
        "Bhutan",
        "Bolivia (Plurinational State of)",
        "Botswana",
        "Brazil",
        "Burkina Faso",
        "Burundi",
        "Cambodia",
        "Cameroon",
        "Central African Republic",
        "Chad",
        "Chile",
        "China",
        "Colombia",
        "Comoros",
        "Congo",
        "Democratic People's Republic of Korea",
        "Democratic Republic of the Congo",
        "Equatorial Guinea",
        "Eritrea",
        "Eswatini",
        "Ethiopia",
        "Gabon",
        "Gambia",
        "Ghana",
        "Guinea",
        "Guinea-Bissau",
        "Honduras",
        "India",
        "Indonesia",
        "Iraq",
        "Kazakhstan",
        "Kenya",
        "Kyrgyzstan",
        "Lao People's Democratic Republic",
        "Lebanon",
        "Lesotho",
        "Liberia",
        "Madagascar",
        "Malawi",
        "Malaysia",
        "Maldives",
        "Mali",
        "Mexico",
        "Micronesia (Federated States of)",
        "Mongolia",
        "Mozambique",
        "Myanmar",
        "Nepal",
        "New Zealand",
        "Niger",
        "Nigeria",
        "Pakistan",
        "Papua New Guinea",
        "Paraguay",
        "Philippines",
        "Rwanda",
        "Senegal",
        "Sierra Leone",
        "Somalia",
        "South Sudan",
        "Sudan",
        "Syrian Arab Republic",
        "Tajikistan",
        "Thailand",
        "Togo",
        "Tunisia",
        "Uganda",
        "Ukraine",
        "Uzbekistan",
        "Viet Nam",
        "Yemen",
        "Zambia",
        "Zimbabwe"
    ],
    "license_title": "Creative Commons Attribution International",
    "methodology": "Registry",
    "methodology_other": null,
    "caveats": null,
    "tags": [
        "covid-19",
        "hxl",
        "vaccination-immunization"
    ],
    "resources": [
        {
            "created": "2020-05-27T10:29:43.959345",
            "description": "Immunization campaigns impacted",
            "format": "CSV",
            "download_url": "https://docs.google.com/spreadsheets/d/e/2PACX-1vT8m53T3ITzFdJWWKkdRRVRjezgt6MeeU5c2tJWl9SNff7SYn3iJ9_7DZZ_tYSmYI67-vH7cqze1VE0/pub?gid=2141885116&single=true&output=csv",
            "id": "ed6827b6-fa77-4d9c-9129-2ab98377b016",
            "last_modified": "2023-10-29T01:01:50.117775",
            "metadata_modified": "2023-10-29T14:16:15.466594",
            "microdata": false,
            "dataset_id": "d0e1806d-e1ed-4b60-bd4a-6a36dfb8053a",
            "resource_type": "api",
            "name": "Immunization Campaigns Impacted",
            "mimetype": null,
            "size": "0.0B"
        }
    ]
}