{
    "id": "5fd0c61a-3017-4138-9072-cc19b86e56e3",
    "title": "Brazil Points of Interest (OpenStreetMap Export)",
    "name": "hotosm_bra_points_of_interest",
    "notes": "OpenStreetMap exports for use in GIS applications. This theme includes all OpenStreetMap features in this area matching ( Learn what tags means here ) : tags['amenity'] IS NOT NULL OR tags['man_made'] IS NOT NULL OR tags['shop'] IS NOT NULL OR tags['tourism'] IS NOT NULL Features may have these attributes:  name name:en amenity man_made shop tourism opening_hours beds rooms addr:full addr:housenumber addr:street addr:city source name:pt  This dataset is one of many OpenStreetMap exports on HDX. See the Humanitarian OpenStreetMap Team website for more information.",
    "dataset_source": "OpenStreetMap contributors",
    "organization": "Humanitarian OpenStreetMap Team (HOT)",
    "dataset_date": "[2024-04-05T00:00:00 TO 2024-04-05T23:59:59]",
    "last_modified": "2024-04-05T15:57:14.319203",
    "data_update_frequency": "Every month",
    "groups": [
        "Brazil"
    ],
    "license_title": "Open Database License (ODC-ODbL)",
    "methodology": "Other",
    "methodology_other": "Volunteered geographic information",
    "caveats": "OpenStreetMap data is crowd sourced and cannot be considered to be exhaustive",
    "tags": [
        "facilities-infrastructure",
        "geodata",
        "points of interest-poi"
    ],
    "resources": [
        {
            "created": "2024-04-05T15:57:14.333301",
            "description": "ESRI Shapefile",
            "format": "SHP",
            "download_url": "https://s3.dualstack.us-east-1.amazonaws.com/production-raw-data-api/ISO3/BRA/points_of_interest/points/hotosm_bra_points_of_interest_points_shp.zip",
            "id": "36443d28-1c67-464c-afb6-5ec8915acb62",
            "last_modified": "2024-04-05T15:57:14.318221",
            "metadata_modified": "2024-04-05T16:01:06.690569",
            "microdata": false,
            "dataset_id": "5fd0c61a-3017-4138-9072-cc19b86e56e3",
            "resource_type": "api",
            "name": "hotosm_bra_points_of_interest_points_shp.zip",
            "mimetype": null,
            "size": "19.4M"
        },
        {
            "created": "2024-04-05T15:57:14.333306",
            "description": "KML",
            "format": "KML",
            "download_url": "https://s3.dualstack.us-east-1.amazonaws.com/production-raw-data-api/ISO3/BRA/points_of_interest/points/hotosm_bra_points_of_interest_points_kml.zip",
            "id": "9b02280e-a1f8-46cd-8e6b-9e3896c35e27",
            "last_modified": "2024-04-05T15:57:14.318381",
            "metadata_modified": "2024-04-05T15:58:00.358368",
            "microdata": false,
            "dataset_id": "5fd0c61a-3017-4138-9072-cc19b86e56e3",
            "resource_type": "api",
            "name": "hotosm_bra_points_of_interest_points_kml.zip",
            "mimetype": null,
            "size": "13.5M"
        },
        {
            "created": "2024-04-05T15:57:14.333310",
            "description": "GeoJSON",
            "format": "GeoJSON",
            "download_url": "https://s3.dualstack.us-east-1.amazonaws.com/production-raw-data-api/ISO3/BRA/points_of_interest/points/hotosm_bra_points_of_interest_points_geojson.zip",
            "id": "e03c9d8e-5f95-426c-bd1d-5a7f02f8289a",
            "last_modified": "2024-04-05T15:57:14.318544",
            "metadata_modified": "2024-04-05T16:02:57.769862",
            "microdata": false,
            "dataset_id": "5fd0c61a-3017-4138-9072-cc19b86e56e3",
            "resource_type": "api",
            "name": "hotosm_bra_points_of_interest_points_geojson.zip",
            "mimetype": null,
            "size": "13.8M"
        },
        {
            "created": "2024-04-05T15:57:14.333313",
            "description": "GPKG",
            "format": "Geopackage",
            "download_url": "https://s3.dualstack.us-east-1.amazonaws.com/production-raw-data-api/ISO3/BRA/points_of_interest/points/hotosm_bra_points_of_interest_points_gpkg.zip",
            "id": "7375b9be-e36b-4ba7-9bad-c32a12ca10a9",
            "last_modified": "2024-04-05T15:57:14.318674",
            "metadata_modified": "2024-04-05T15:58:00.358550",
            "microdata": false,
            "dataset_id": "5fd0c61a-3017-4138-9072-cc19b86e56e3",
            "resource_type": "api",
            "name": "hotosm_bra_points_of_interest_points_gpkg.zip",
            "mimetype": null,
            "size": "16.0M"
        },
        {
            "created": "2024-04-05T15:57:14.333316",
            "description": "ESRI Shapefile",
            "format": "SHP",
            "download_url": "https://s3.dualstack.us-east-1.amazonaws.com/production-raw-data-api/ISO3/BRA/points_of_interest/polygons/hotosm_bra_points_of_interest_polygons_shp.zip",
            "id": "37f4c276-0431-4f96-b685-dd4e19b3a207",
            "last_modified": "2024-04-05T15:57:14.318797",
            "metadata_modified": "2024-04-05T16:03:01.855457",
            "microdata": false,
            "dataset_id": "5fd0c61a-3017-4138-9072-cc19b86e56e3",
            "resource_type": "api",
            "name": "hotosm_bra_points_of_interest_polygons_shp.zip",
            "mimetype": null,
            "size": "41.4M"
        },
        {
            "created": "2024-04-05T15:57:14.333319",
            "description": "KML",
            "format": "KML",
            "download_url": "https://s3.dualstack.us-east-1.amazonaws.com/production-raw-data-api/ISO3/BRA/points_of_interest/polygons/hotosm_bra_points_of_interest_polygons_kml.zip",
            "id": "380ba1c7-a979-4c32-b229-678ca1b4c9fd",
            "last_modified": "2024-04-05T15:57:14.318918",
            "metadata_modified": "2024-04-05T15:58:13.093579",
            "microdata": false,
            "dataset_id": "5fd0c61a-3017-4138-9072-cc19b86e56e3",
            "resource_type": "api",
            "name": "hotosm_bra_points_of_interest_polygons_kml.zip",
            "mimetype": null,
            "size": "26.8M"
        },
        {
            "created": "2024-04-05T15:57:14.333322",
            "description": "GeoJSON",
            "format": "GeoJSON",
            "download_url": "https://s3.dualstack.us-east-1.amazonaws.com/production-raw-data-api/ISO3/BRA/points_of_interest/polygons/hotosm_bra_points_of_interest_polygons_geojson.zip",
            "id": "caf3b39f-3e86-40fc-ad48-7b9a23e3e616",
            "last_modified": "2024-04-05T15:57:14.319038",
            "metadata_modified": "2024-04-05T16:02:18.698226",
            "microdata": false,
            "dataset_id": "5fd0c61a-3017-4138-9072-cc19b86e56e3",
            "resource_type": "api",
            "name": "hotosm_bra_points_of_interest_polygons_geojson.zip",
            "mimetype": null,
            "size": "27.2M"
        },
        {
            "created": "2024-04-05T15:57:14.333325",
            "description": "GPKG",
            "format": "Geopackage",
            "download_url": "https://s3.dualstack.us-east-1.amazonaws.com/production-raw-data-api/ISO3/BRA/points_of_interest/polygons/hotosm_bra_points_of_interest_polygons_gpkg.zip",
            "id": "a5e987f5-6143-4d70-a687-4e1ab62aaa70",
            "last_modified": "2024-04-05T15:57:14.319203",
            "metadata_modified": "2024-04-05T15:58:00.358992",
            "microdata": false,
            "dataset_id": "5fd0c61a-3017-4138-9072-cc19b86e56e3",
            "resource_type": "api",
            "name": "hotosm_bra_points_of_interest_polygons_gpkg.zip",
            "mimetype": null,
            "size": "40.0M"
        }
    ]
}