{
    "id": "af8cb8fc-4f36-41e7-9abb-a5abda8502bd",
    "title": "Brazil - IFRC Appeals",
    "name": "ifrc-appeals-data-for-brazil",
    "notes": "The International Federation of Red Cross and Red Crescent Societies (IFRC) is the world\u2019s largest humanitarian network. Our secretariat supports local Red Cross and Red Crescent action in more than 192 countries, bringing together almost 15 million volunteers for the good of humanity.   We launch Emergency Appeals for big and complex disasters affecting lots of people who will need long-term support to recover. We also support Red Cross and Red Crescent Societies to respond to lots of small and medium-sized disasters worldwide\u2014through our Disaster Response Emergency Fund (DREF) and in other ways.   There is also a global dataset.",
    "dataset_source": "IFRC",
    "organization": "International Federation of Red Cross and Red Crescent Societies (IFRC)",
    "dataset_date": "[1997-01-01T00:00:00 TO 2022-05-31T23:59:59]",
    "last_modified": "2023-04-26T01:48:41.924181",
    "data_update_frequency": "Every week",
    "groups": [
        "Brazil"
    ],
    "license_title": "Creative Commons Attribution for Intergovernmental Organisations",
    "methodology": "Registry",
    "methodology_other": null,
    "caveats": null,
    "tags": [
        "funding",
        "hxl"
    ],
    "resources": [
        {
            "created": "2023-03-13T23:11:52.767213",
            "description": "IFRC Appeals data with HXL tags",
            "format": "CSV",
            "download_url": "https://data.humdata.org/dataset/af8cb8fc-4f36-41e7-9abb-a5abda8502bd/resource/71ad68dc-ca1f-433a-a9a8-8d150263a3dc/download/appeals_data_bra.csv",
            "id": "71ad68dc-ca1f-433a-a9a8-8d150263a3dc",
            "last_modified": "2023-04-26T01:48:41.828097",
            "metadata_modified": "2023-04-26T01:48:42.105076",
            "microdata": false,
            "dataset_id": "af8cb8fc-4f36-41e7-9abb-a5abda8502bd",
            "resource_type": "file.upload",
            "name": "IFRC Appeals Data for Brazil",
            "mimetype": null,
            "size": "4.6K"
        },
        {
            "created": "2023-04-26T01:48:42.116718",
            "description": "IFRC Appeals QuickCharts data with HXL tags",
            "format": "CSV",
            "download_url": "https://data.humdata.org/dataset/af8cb8fc-4f36-41e7-9abb-a5abda8502bd/resource/15a493e6-9021-408e-90a7-2f95f8d62503/download/qc_appeals_data_bra.csv",
            "id": "15a493e6-9021-408e-90a7-2f95f8d62503",
            "last_modified": "2023-04-26T01:48:41.924181",
            "metadata_modified": "2023-05-16T04:27:32.360571",
            "microdata": false,
            "dataset_id": "af8cb8fc-4f36-41e7-9abb-a5abda8502bd",
            "resource_type": "file.upload",
            "name": "IFRC Appeals QuickCharts Data for Brazil",
            "mimetype": "text/csv",
            "size": "394.0B"
        }
    ]
}