{
    "id": "e4bb99cb-bba0-4d14-be65-2b6cdcb36d0c",
    "title": "Brazil - Population Counts",
    "name": "worldpop-population-counts-for-brazil",
    "notes": "WorldPop produces different types of gridded population count datasets, depending on the methods used and end application.  Please make sure you have read our Mapping Populations overview page before choosing and downloading a dataset.    Bespoke methods used to produce datasets for specific individual countries are available through the WorldPop Open Population Repository (WOPR) link below.  These are 100m resolution gridded population estimates using customized methods (\"bottom-up\" and/or \"top-down\") developed for the latest data available from each country.  They can also be visualised and explored through the woprVision App.  The remaining datasets in the links below are produced using the \"top-down\" method,  with either the unconstrained or constrained top-down disaggregation method used.  Please make sure you read the Top-down estimation modelling overview page to decide on which datasets best meet your needs.  Datasets are available to download in Geotiff and ASCII XYZ format at a resolution of 3 and 30 arc-seconds (approximately 100m and 1km at the equator, respectively):  - Unconstrained individual countries 2000-2020  ( 1km resolution ): Consistent 1km resolution population count datasets created using  unconstrained top-down methods for all countries of the World for each year 2000-2020.   - Unconstrained individual countries 2000-2020 ( 100m resolution ): Consistent 100m resolution population count datasets created using  unconstrained top-down methods for all countries of the World for each year 2000-2020.   - Unconstrained individual countries 2000-2020 UN adjusted ( 100m resolution ): Consistent 100m resolution population count datasets created using  unconstrained top-down methods for all countries of the World for each year 2000-2020 and adjusted to match United Nations national population estimates (UN 2019)  -Unconstrained individual countries 2000-2020 UN adjusted ( 1km resolution ): Consistent 1km resolution population count datasets created using  unconstrained top-down methods for all countries of the World for each year 2000-2020 and adjusted to match United Nations national population estimates (UN 2019).  -Unconstrained global mosaics 2000-2020 ( 1km resolution ): Mosaiced 1km resolution versions of the \"Unconstrained individual countries 2000-2020\" datasets.  -Constrained individual countries 2020 ( 100m resolution ): Consistent 100m resolution population count datasets created using  constrained top-down methods for all countries of the World for 2020.  -Constrained individual countries 2020 UN adjusted ( 100m resolution ): Consistent 100m resolution population count datasets created using  constrained top-down methods for all countries of the World for 2020 and adjusted to match United Nations national  population estimates (UN 2019).   Older datasets produced for specific individual countries and continents, using a set of tailored geospatial inputs and differing \"top-down\" methods and time periods are still available for download here: Individual countries and Whole Continent. Data for earlier dates is available directly from WorldPop.   WorldPop (www.worldpop.org - School of Geography and Environmental Science, University of Southampton; Department of Geography and Geosciences, University of Louisville; Departement de Geographie, Universite de Namur) and Center for International Earth Science Information Network (CIESIN), Columbia University (2018). Global High Resolution Population Denominators Project - Funded by The Bill and Melinda Gates Foundation (OPP1134076). https://dx.doi.org/10.5258/SOTON/WP00645",
    "dataset_source": "WorldPop, University of Southampton, UK",
    "organization": "WorldPop",
    "dataset_date": "[2000-01-01T00:00:00 TO 2020-12-31T23:59:59]",
    "last_modified": "2020-09-16T00:00:00",
    "data_update_frequency": "Every year",
    "groups": [
        "Brazil"
    ],
    "license_title": "Other",
    "methodology": "Other",
    "methodology_other": "Estimated total number of people per grid-cell. The dataset is available to download in Geotiff and ASCII XYZ format at a resolution of 30 arc (approximately 1km at the equator). The projection is Geographic Coordinate System, WGS84. with country totals adjusted to match the corresponding official United Nations population estimates that have been prepared by the Population Division of the Department of Economic and Social Affairs of the United Nations Secretariat (2019 Revision of World Population Prospects)-based dasymetric redistribution The units are number of people per pixel. The mapping approach is Random Forest. The dataset is available to download in Geotiff format at a resolution of 3 arc (approximately 100m at the equator).. The units are number of people per pixel \"NoData\" values represent areas that were mapped as unsettled based on the outputs of the Built-Settlement Growth Model (BSGM) developed by Jeremiah J.Nieves et al. 2020.The mapping approach is the Random Forests developed by Stevens et al. (2015).  The disaggregation was done by Maksym Bondarenko (WorldPop) and David Kerr (WorldPop), using the Random Forests population modelling R scripts (Bondarenko et al., 2020), with oversight from Alessandro Sorichetta (WorldPop).SOURCE DATA:This dataset was produced based on the 2020 population census/projection-based estimates for 2020  (information and sources of the input population data can be found here).Built-Settlement Growth Model (BSGM) outputs produced by Jeremiah J.Nieves et al. 2020.Geospatial covariates representing factors related to population distribution, were obtained from the \"Global High Resolution Population Denominators Project\" (OPP1134076).REFERENCES:- Stevens FR, Gaughan AE, Linard C, Tatem AJ (2015) Disaggregating Census Data for Population Mapping Using Random Forests with Remotely-Sensed and Ancillary Data. PLoS ONE 10(2): e0107042. https://doi.org/10.1371/journal.pone.0107042- WorldPop (www.worldpop.org - School of Geography and Environmental Science, University of Southampton; Department of Geography and Geosciences, University of Louisville; Departement de Geographie, Universite de Namur) and Center for International Earth Science Information Network (CIESIN), Columbia University (2018). Global High Resolution Population Denominators Project - Funded by The Bill and Melinda Gates Foundation (OPP1134076).- Jeremiah J. Nieves, Alessandro Sorichetta, Catherine Linard, Maksym Bondarenko, Jessica E. Steele, Forrest R. Stevens, Andrea E. Gaughan, Alessandra Carioli, Donna J. Clarke, Thomas Esch, Andrew J. Tatem, Annually modelling built-settlements between remotely-sensed observations using relative changes in subnational populations and lights at night, Computers, Environment and Urban Systems,Volume 80,2020,101444,ISSN 0198-9715,https://doi.org/10.1016/j.compenvurbsys.2019.101444- Nieves, J.J.; Bondarenko, M.; Sorichetta, A.; Steele, J.E.; Kerr, D.; Carioli, A.; Stevens, F.R.; Gaughan, A.E.; Tatem, A.J. Predicting Near-Future Built-Settlement Expansion Using Relative Changes in Small Area Populations. Remote Sens. 2020, 12, 1545.- Bondarenko M., Nieves J. J., Stevens F. R., Gaughan A. E., Tatem A. and Sorichetta A. 2020. wpgpRFPMS: Random Forests population modelling R scripts, version 0.1.0. University of Southampton: Southampton, UK. https://dx.doi.org/10.5258/SOTON/WP00665 The projection is Geographic Coordinate System, WGS84.5258/SOTON/WP00665 The units are number of people per pixel. The mapping approach is Random Forest.",
    "caveats": null,
    "tags": [
        "baseline population",
        "geodata"
    ],
    "resources": [
        {
            "created": "2020-06-29T05:35:31.931598",
            "description": "The spatial distribution of population in 2020, Brazil",
            "format": "GeoTIFF",
            "download_url": "https://data.worldpop.org/GIS/Population/Global_2000_2020/2020/BRA/bra_ppp_2020.tif",
            "id": "23c7c83e-a28b-4775-b1ad-c90eafb22a5e",
            "last_modified": "2018-11-01T00:00:00",
            "metadata_modified": "2023-08-03T00:12:14.890558",
            "microdata": false,
            "dataset_id": "e4bb99cb-bba0-4d14-be65-2b6cdcb36d0c",
            "resource_type": "api",
            "name": "bra_ppp_2020.tif",
            "mimetype": null,
            "size": null
        },
        {
            "created": "2020-06-29T05:35:31.931606",
            "description": "The spatial distribution of population in 2019, Brazil",
            "format": "GeoTIFF",
            "download_url": "https://data.worldpop.org/GIS/Population/Global_2000_2020/2019/BRA/bra_ppp_2019.tif",
            "id": "6b790528-78dc-4aef-b39f-87646e4d9235",
            "last_modified": "2018-11-01T00:00:00",
            "metadata_modified": "2023-08-03T00:12:14.890755",
            "microdata": false,
            "dataset_id": "e4bb99cb-bba0-4d14-be65-2b6cdcb36d0c",
            "resource_type": "api",
            "name": "bra_ppp_2019.tif",
            "mimetype": null,
            "size": null
        },
        {
            "created": "2020-06-29T05:35:31.931608",
            "description": "The spatial distribution of population in 2018, Brazil",
            "format": "GeoTIFF",
            "download_url": "https://data.worldpop.org/GIS/Population/Global_2000_2020/2018/BRA/bra_ppp_2018.tif",
            "id": "04c6993d-820a-44d1-85a1-31fa8c5c25e7",
            "last_modified": "2018-11-01T00:00:00",
            "metadata_modified": "2023-08-03T00:12:14.890875",
            "microdata": false,
            "dataset_id": "e4bb99cb-bba0-4d14-be65-2b6cdcb36d0c",
            "resource_type": "api",
            "name": "bra_ppp_2018.tif",
            "mimetype": null,
            "size": null
        },
        {
            "created": "2020-06-29T05:35:31.931612",
            "description": "The spatial distribution of population in 2017, Brazil",
            "format": "GeoTIFF",
            "download_url": "https://data.worldpop.org/GIS/Population/Global_2000_2020/2017/BRA/bra_ppp_2017.tif",
            "id": "dafd9004-1912-425b-a338-785560f7a016",
            "last_modified": "2018-11-01T00:00:00",
            "metadata_modified": "2023-08-03T00:12:14.891028",
            "microdata": false,
            "dataset_id": "e4bb99cb-bba0-4d14-be65-2b6cdcb36d0c",
            "resource_type": "api",
            "name": "bra_ppp_2017.tif",
            "mimetype": null,
            "size": null
        },
        {
            "created": "2020-06-29T05:35:31.931615",
            "description": "The spatial distribution of population in 2016, Brazil",
            "format": "GeoTIFF",
            "download_url": "https://data.worldpop.org/GIS/Population/Global_2000_2020/2016/BRA/bra_ppp_2016.tif",
            "id": "68fb8564-b115-467d-a7d8-97be6301d5bb",
            "last_modified": "2018-11-01T00:00:00",
            "metadata_modified": "2023-08-03T00:12:14.891134",
            "microdata": false,
            "dataset_id": "e4bb99cb-bba0-4d14-be65-2b6cdcb36d0c",
            "resource_type": "api",
            "name": "bra_ppp_2016.tif",
            "mimetype": null,
            "size": null
        },
        {
            "created": "2020-06-29T05:35:31.931603",
            "description": "The spatial distribution of population in 2020 with country total adjusted to match the corresponding UNPD estimate, Brazil",
            "format": "GeoTIFF",
            "download_url": "https://data.worldpop.org/GIS/Population/Global_2000_2020/2020/BRA/bra_ppp_2020_UNadj.tif",
            "id": "30a0f62e-37d7-4c8a-b9a0-6c38d4784d6f",
            "last_modified": "2020-02-01T00:00:00",
            "metadata_modified": "2023-08-03T00:12:14.891266",
            "microdata": false,
            "dataset_id": "e4bb99cb-bba0-4d14-be65-2b6cdcb36d0c",
            "resource_type": "api",
            "name": "bra_ppp_2020_UNadj.tif",
            "mimetype": null,
            "size": null
        },
        {
            "created": "2020-06-29T05:35:31.931610",
            "description": "The spatial distribution of population in 2018 with country total adjusted to match the corresponding UNPD estimate, Brazil",
            "format": "GeoTIFF",
            "download_url": "https://data.worldpop.org/GIS/Population/Global_2000_2020/2018/BRA/bra_ppp_2018_UNadj.tif",
            "id": "2c14739c-ce9e-45e0-afc0-7e84b5162b82",
            "last_modified": "2020-02-01T00:00:00",
            "metadata_modified": "2023-08-03T00:12:14.891411",
            "microdata": false,
            "dataset_id": "e4bb99cb-bba0-4d14-be65-2b6cdcb36d0c",
            "resource_type": "api",
            "name": "bra_ppp_2018_UNadj.tif",
            "mimetype": null,
            "size": null
        },
        {
            "created": "2020-06-29T05:35:31.931613",
            "description": "The spatial distribution of population in 2017 with country total adjusted to match the corresponding UNPD estimate, Brazil",
            "format": "GeoTIFF",
            "download_url": "https://data.worldpop.org/GIS/Population/Global_2000_2020/2017/BRA/bra_ppp_2017_UNadj.tif",
            "id": "6d91593d-d1ed-49b1-a570-b6a91cd81f5e",
            "last_modified": "2020-02-01T00:00:00",
            "metadata_modified": "2023-08-03T00:12:14.891514",
            "microdata": false,
            "dataset_id": "e4bb99cb-bba0-4d14-be65-2b6cdcb36d0c",
            "resource_type": "api",
            "name": "bra_ppp_2017_UNadj.tif",
            "mimetype": null,
            "size": null
        },
        {
            "created": "2020-06-29T05:35:31.931617",
            "description": "The spatial distribution of population in 2016 with country total adjusted to match the corresponding UNPD estimate, Brazil",
            "format": "GeoTIFF",
            "download_url": "https://data.worldpop.org/GIS/Population/Global_2000_2020/2016/BRA/bra_ppp_2016_UNadj.tif",
            "id": "9e76a45c-9ba5-4730-9c50-7132637e17ea",
            "last_modified": "2020-02-01T00:00:00",
            "metadata_modified": "2023-08-03T00:12:14.891614",
            "microdata": false,
            "dataset_id": "e4bb99cb-bba0-4d14-be65-2b6cdcb36d0c",
            "resource_type": "api",
            "name": "bra_ppp_2016_UNadj.tif",
            "mimetype": null,
            "size": null
        },
        {
            "created": "2020-11-23T20:28:06.021276",
            "description": "The spatial distribution of population in 2020, Brazil",
            "format": "GeoTIFF",
            "download_url": "https://data.worldpop.org/GIS/Population/Global_2000_2020_Constrained/2020/BSGM/BRA/bra_ppp_2020_constrained.tif",
            "id": "53650f29-32de-4247-b30d-ec3119b2cef6",
            "last_modified": "2020-09-16T00:00:00",
            "metadata_modified": "2023-08-03T00:12:14.891713",
            "microdata": false,
            "dataset_id": "e4bb99cb-bba0-4d14-be65-2b6cdcb36d0c",
            "resource_type": "api",
            "name": "bra_ppp_2020_constrained.tif",
            "mimetype": null,
            "size": null
        },
        {
            "created": "2020-11-23T20:28:06.021283",
            "description": "The spatial distribution of population in 2020 with country total adjusted to match the corresponding UNPD estimate, Brazil",
            "format": "GeoTIFF",
            "download_url": "https://data.worldpop.org/GIS/Population/Global_2000_2020_Constrained/2020/BSGM/BRA/bra_ppp_2020_UNadj_constrained.tif",
            "id": "ed8fe746-114b-45bf-9933-fffbacaeb9de",
            "last_modified": "2020-09-16T00:00:00",
            "metadata_modified": "2023-08-03T00:12:14.891820",
            "microdata": false,
            "dataset_id": "e4bb99cb-bba0-4d14-be65-2b6cdcb36d0c",
            "resource_type": "api",
            "name": "bra_ppp_2020_UNadj_constrained.tif",
            "mimetype": null,
            "size": null
        },
        {
            "created": "2020-11-23T20:28:06.021285",
            "description": "The spatial distribution of population in 2020 Brazil",
            "format": "GeoTIFF",
            "download_url": "https://data.worldpop.org/GIS/Population/Global_2000_2020_1km/2020/BRA/bra_ppp_2020_1km_Aggregated.tif",
            "id": "e6b97531-6400-46e8-990d-b690d9de7274",
            "last_modified": "2020-06-22T00:00:00",
            "metadata_modified": "2023-08-03T00:12:14.891997",
            "microdata": false,
            "dataset_id": "e4bb99cb-bba0-4d14-be65-2b6cdcb36d0c",
            "resource_type": "api",
            "name": "bra_ppp_2020_1km_Aggregated.tif",
            "mimetype": null,
            "size": null
        },
        {
            "created": "2020-11-23T20:28:06.021287",
            "description": "The spatial distribution of population in 2020 Brazil",
            "format": "GeoTIFF",
            "download_url": "https://data.worldpop.org/GIS/Population/Global_2000_2020_1km/2020/BRA/bra_ppp_2020_1km_ASCII_XYZ.zip",
            "id": "ea7a654f-53ff-4af1-9659-3c46f86c58c1",
            "last_modified": "2020-06-22T00:00:00",
            "metadata_modified": "2023-08-03T00:12:14.892173",
            "microdata": false,
            "dataset_id": "e4bb99cb-bba0-4d14-be65-2b6cdcb36d0c",
            "resource_type": "api",
            "name": "bra_ppp_2020_1km_ASCII_XYZ.zip",
            "mimetype": null,
            "size": null
        },
        {
            "created": "2020-11-23T20:28:06.021289",
            "description": "The spatial distribution of population in 2020 with country total adjusted to match the corresponding UNPD estimate, Brazil",
            "format": "GeoTIFF",
            "download_url": "https://data.worldpop.org/GIS/Population/Global_2000_2020_1km_UNadj/2020/BRA/bra_ppp_2020_1km_UNadj_ASCII_XYZ.zip",
            "id": "2c21506f-272d-402d-bb63-045ac7f74697",
            "last_modified": "2020-06-22T00:00:00",
            "metadata_modified": "2023-08-03T00:12:14.892347",
            "microdata": false,
            "dataset_id": "e4bb99cb-bba0-4d14-be65-2b6cdcb36d0c",
            "resource_type": "api",
            "name": "bra_ppp_2020_1km_UNadj_ASCII_XYZ.zip",
            "mimetype": null,
            "size": null
        },
        {
            "created": "2020-11-23T20:28:06.021291",
            "description": "The spatial distribution of population in 2020 with country total adjusted to match the corresponding UNPD estimate, Brazil",
            "format": "GeoTIFF",
            "download_url": "https://data.worldpop.org/GIS/Population/Global_2000_2020_1km_UNadj/2020/BRA/bra_ppp_2020_1km_Aggregated_UNadj.tif",
            "id": "f8367383-3e30-46bd-a174-6a4cbb7bc10c",
            "last_modified": "2020-06-22T00:00:00",
            "metadata_modified": "2023-08-03T00:12:14.892523",
            "microdata": false,
            "dataset_id": "e4bb99cb-bba0-4d14-be65-2b6cdcb36d0c",
            "resource_type": "api",
            "name": "bra_ppp_2020_1km_Aggregated_UNadj.tif",
            "mimetype": null,
            "size": null
        },
        {
            "created": "2020-11-23T20:28:06.021293",
            "description": "The spatial distribution of population in 2019 Brazil",
            "format": "GeoTIFF",
            "download_url": "https://data.worldpop.org/GIS/Population/Global_2000_2020_1km/2019/BRA/bra_ppp_2019_1km_Aggregated.tif",
            "id": "36a215ba-c75f-4a09-a7be-6a803f230fbd",
            "last_modified": "2020-06-22T00:00:00",
            "metadata_modified": "2023-08-03T00:12:14.892699",
            "microdata": false,
            "dataset_id": "e4bb99cb-bba0-4d14-be65-2b6cdcb36d0c",
            "resource_type": "api",
            "name": "bra_ppp_2019_1km_Aggregated.tif",
            "mimetype": null,
            "size": null
        },
        {
            "created": "2020-11-23T20:28:06.021294",
            "description": "The spatial distribution of population in 2019 Brazil",
            "format": "GeoTIFF",
            "download_url": "https://data.worldpop.org/GIS/Population/Global_2000_2020_1km/2019/BRA/bra_ppp_2019_1km_ASCII_XYZ.zip",
            "id": "bfc7d772-8da9-4be7-a825-37a83fb14089",
            "last_modified": "2020-06-22T00:00:00",
            "metadata_modified": "2023-08-03T00:12:14.892874",
            "microdata": false,
            "dataset_id": "e4bb99cb-bba0-4d14-be65-2b6cdcb36d0c",
            "resource_type": "api",
            "name": "bra_ppp_2019_1km_ASCII_XYZ.zip",
            "mimetype": null,
            "size": null
        },
        {
            "created": "2020-11-23T20:28:06.021296",
            "description": "The spatial distribution of population in 2019 with country total adjusted to match the corresponding UNPD estimate, Brazil",
            "format": "GeoTIFF",
            "download_url": "https://data.worldpop.org/GIS/Population/Global_2000_2020_1km_UNadj/2019/BRA/bra_ppp_2019_1km_UNadj_ASCII_XYZ.zip",
            "id": "b550672c-d2c5-4a42-b6c2-fbe2d5348312",
            "last_modified": "2020-06-22T00:00:00",
            "metadata_modified": "2023-08-03T00:12:14.893073",
            "microdata": false,
            "dataset_id": "e4bb99cb-bba0-4d14-be65-2b6cdcb36d0c",
            "resource_type": "api",
            "name": "bra_ppp_2019_1km_UNadj_ASCII_XYZ.zip",
            "mimetype": null,
            "size": null
        },
        {
            "created": "2020-11-23T20:28:06.021298",
            "description": "The spatial distribution of population in 2019 with country total adjusted to match the corresponding UNPD estimate, Brazil",
            "format": "GeoTIFF",
            "download_url": "https://data.worldpop.org/GIS/Population/Global_2000_2020_1km_UNadj/2019/BRA/bra_ppp_2019_1km_Aggregated_UNadj.tif",
            "id": "f7adc2cf-444e-48ed-ab47-e0e00c4e3823",
            "last_modified": "2020-06-22T00:00:00",
            "metadata_modified": "2023-08-03T00:12:14.893276",
            "microdata": false,
            "dataset_id": "e4bb99cb-bba0-4d14-be65-2b6cdcb36d0c",
            "resource_type": "api",
            "name": "bra_ppp_2019_1km_Aggregated_UNadj.tif",
            "mimetype": null,
            "size": null
        },
        {
            "created": "2020-11-23T20:28:06.021300",
            "description": "The spatial distribution of population in 2018 Brazil",
            "format": "GeoTIFF",
            "download_url": "https://data.worldpop.org/GIS/Population/Global_2000_2020_1km/2018/BRA/bra_ppp_2018_1km_Aggregated.tif",
            "id": "2d1ec1c7-ba9c-4a1f-983d-95b51771dea6",
            "last_modified": "2020-06-22T00:00:00",
            "metadata_modified": "2023-08-03T00:12:14.893411",
            "microdata": false,
            "dataset_id": "e4bb99cb-bba0-4d14-be65-2b6cdcb36d0c",
            "resource_type": "api",
            "name": "bra_ppp_2018_1km_Aggregated.tif",
            "mimetype": null,
            "size": null
        },
        {
            "created": "2020-11-23T20:28:06.021302",
            "description": "The spatial distribution of population in 2018 Brazil",
            "format": "GeoTIFF",
            "download_url": "https://data.worldpop.org/GIS/Population/Global_2000_2020_1km/2018/BRA/bra_ppp_2018_1km_ASCII_XYZ.zip",
            "id": "bfd213ef-9fbe-40b7-8628-9ac0d5586f4c",
            "last_modified": "2020-06-22T00:00:00",
            "metadata_modified": "2023-08-03T00:12:14.893618",
            "microdata": false,
            "dataset_id": "e4bb99cb-bba0-4d14-be65-2b6cdcb36d0c",
            "resource_type": "api",
            "name": "bra_ppp_2018_1km_ASCII_XYZ.zip",
            "mimetype": null,
            "size": null
        },
        {
            "created": "2020-11-23T20:28:06.021303",
            "description": "The spatial distribution of population in 2018 with country total adjusted to match the corresponding UNPD estimate, Brazil",
            "format": "GeoTIFF",
            "download_url": "https://data.worldpop.org/GIS/Population/Global_2000_2020_1km_UNadj/2018/BRA/bra_ppp_2018_1km_UNadj_ASCII_XYZ.zip",
            "id": "31a1eab1-bffc-41fe-b5c1-a7c38dddc086",
            "last_modified": "2020-06-22T00:00:00",
            "metadata_modified": "2023-08-03T00:12:14.893811",
            "microdata": false,
            "dataset_id": "e4bb99cb-bba0-4d14-be65-2b6cdcb36d0c",
            "resource_type": "api",
            "name": "bra_ppp_2018_1km_UNadj_ASCII_XYZ.zip",
            "mimetype": null,
            "size": null
        },
        {
            "created": "2020-11-23T20:28:06.021305",
            "description": "The spatial distribution of population in 2018 with country total adjusted to match the corresponding UNPD estimate, Brazil",
            "format": "GeoTIFF",
            "download_url": "https://data.worldpop.org/GIS/Population/Global_2000_2020_1km_UNadj/2018/BRA/bra_ppp_2018_1km_Aggregated_UNadj.tif",
            "id": "b1f30cc7-25af-491e-b76b-29bf46784063",
            "last_modified": "2020-06-22T00:00:00",
            "metadata_modified": "2023-08-03T00:12:14.894050",
            "microdata": false,
            "dataset_id": "e4bb99cb-bba0-4d14-be65-2b6cdcb36d0c",
            "resource_type": "api",
            "name": "bra_ppp_2018_1km_Aggregated_UNadj.tif",
            "mimetype": null,
            "size": null
        },
        {
            "created": "2020-11-23T20:28:06.021307",
            "description": "The spatial distribution of population in 2017 Brazil",
            "format": "GeoTIFF",
            "download_url": "https://data.worldpop.org/GIS/Population/Global_2000_2020_1km/2017/BRA/bra_ppp_2017_1km_Aggregated.tif",
            "id": "15fd085d-b935-4bde-949c-e1632d23952e",
            "last_modified": "2020-06-22T00:00:00",
            "metadata_modified": "2023-08-03T00:12:14.894259",
            "microdata": false,
            "dataset_id": "e4bb99cb-bba0-4d14-be65-2b6cdcb36d0c",
            "resource_type": "api",
            "name": "bra_ppp_2017_1km_Aggregated.tif",
            "mimetype": null,
            "size": null
        },
        {
            "created": "2020-11-23T20:28:06.021309",
            "description": "The spatial distribution of population in 2017 Brazil",
            "format": "GeoTIFF",
            "download_url": "https://data.worldpop.org/GIS/Population/Global_2000_2020_1km/2017/BRA/bra_ppp_2017_1km_ASCII_XYZ.zip",
            "id": "347151bb-5a64-4fb8-9e55-547784ba6769",
            "last_modified": "2020-06-22T00:00:00",
            "metadata_modified": "2023-08-03T00:12:14.894447",
            "microdata": false,
            "dataset_id": "e4bb99cb-bba0-4d14-be65-2b6cdcb36d0c",
            "resource_type": "api",
            "name": "bra_ppp_2017_1km_ASCII_XYZ.zip",
            "mimetype": null,
            "size": null
        },
        {
            "created": "2020-11-23T20:28:06.021310",
            "description": "The spatial distribution of population in 2017 with country total adjusted to match the corresponding UNPD estimate, Brazil",
            "format": "GeoTIFF",
            "download_url": "https://data.worldpop.org/GIS/Population/Global_2000_2020_1km_UNadj/2017/BRA/bra_ppp_2017_1km_UNadj_ASCII_XYZ.zip",
            "id": "37824526-c515-4431-a9e1-bed13c4c929e",
            "last_modified": "2020-06-22T00:00:00",
            "metadata_modified": "2023-08-03T00:12:14.894644",
            "microdata": false,
            "dataset_id": "e4bb99cb-bba0-4d14-be65-2b6cdcb36d0c",
            "resource_type": "api",
            "name": "bra_ppp_2017_1km_UNadj_ASCII_XYZ.zip",
            "mimetype": null,
            "size": null
        },
        {
            "created": "2020-11-23T20:28:06.021312",
            "description": "The spatial distribution of population in 2017 with country total adjusted to match the corresponding UNPD estimate, Brazil",
            "format": "GeoTIFF",
            "download_url": "https://data.worldpop.org/GIS/Population/Global_2000_2020_1km_UNadj/2017/BRA/bra_ppp_2017_1km_Aggregated_UNadj.tif",
            "id": "46342c3a-eb8e-4368-85d8-605ac361e9ab",
            "last_modified": "2020-06-22T00:00:00",
            "metadata_modified": "2023-08-03T00:12:14.894840",
            "microdata": false,
            "dataset_id": "e4bb99cb-bba0-4d14-be65-2b6cdcb36d0c",
            "resource_type": "api",
            "name": "bra_ppp_2017_1km_Aggregated_UNadj.tif",
            "mimetype": null,
            "size": null
        },
        {
            "created": "2020-11-23T20:28:06.021314",
            "description": "The spatial distribution of population in 2016 Brazil",
            "format": "GeoTIFF",
            "download_url": "https://data.worldpop.org/GIS/Population/Global_2000_2020_1km/2016/BRA/bra_ppp_2016_1km_Aggregated.tif",
            "id": "c7353525-a5ae-42b8-b447-f1e98aebf50c",
            "last_modified": "2020-06-22T00:00:00",
            "metadata_modified": "2023-08-03T00:12:14.895138",
            "microdata": false,
            "dataset_id": "e4bb99cb-bba0-4d14-be65-2b6cdcb36d0c",
            "resource_type": "api",
            "name": "bra_ppp_2016_1km_Aggregated.tif",
            "mimetype": null,
            "size": null
        },
        {
            "created": "2020-11-23T20:28:06.021315",
            "description": "The spatial distribution of population in 2016 Brazil",
            "format": "GeoTIFF",
            "download_url": "https://data.worldpop.org/GIS/Population/Global_2000_2020_1km/2016/BRA/bra_ppp_2016_1km_ASCII_XYZ.zip",
            "id": "92221a3b-0de7-4ed4-84b7-039408874c9a",
            "last_modified": "2020-06-22T00:00:00",
            "metadata_modified": "2023-08-03T00:12:14.895330",
            "microdata": false,
            "dataset_id": "e4bb99cb-bba0-4d14-be65-2b6cdcb36d0c",
            "resource_type": "api",
            "name": "bra_ppp_2016_1km_ASCII_XYZ.zip",
            "mimetype": null,
            "size": null
        },
        {
            "created": "2020-11-23T20:28:06.021317",
            "description": "The spatial distribution of population in 2016 with country total adjusted to match the corresponding UNPD estimate, Brazil",
            "format": "GeoTIFF",
            "download_url": "https://data.worldpop.org/GIS/Population/Global_2000_2020_1km_UNadj/2016/BRA/bra_ppp_2016_1km_UNadj_ASCII_XYZ.zip",
            "id": "b3250cc3-62e7-44b3-88ee-89a37532aba2",
            "last_modified": "2020-06-22T00:00:00",
            "metadata_modified": "2023-08-03T00:12:14.895504",
            "microdata": false,
            "dataset_id": "e4bb99cb-bba0-4d14-be65-2b6cdcb36d0c",
            "resource_type": "api",
            "name": "bra_ppp_2016_1km_UNadj_ASCII_XYZ.zip",
            "mimetype": null,
            "size": null
        },
        {
            "created": "2020-11-23T20:28:06.021319",
            "description": "The spatial distribution of population in 2016 with country total adjusted to match the corresponding UNPD estimate, Brazil",
            "format": "GeoTIFF",
            "download_url": "https://data.worldpop.org/GIS/Population/Global_2000_2020_1km_UNadj/2016/BRA/bra_ppp_2016_1km_Aggregated_UNadj.tif",
            "id": "6d350fe3-5d96-4bf4-8a12-6a0ad3e51e5b",
            "last_modified": "2020-06-22T00:00:00",
            "metadata_modified": "2023-08-03T00:12:14.895673",
            "microdata": false,
            "dataset_id": "e4bb99cb-bba0-4d14-be65-2b6cdcb36d0c",
            "resource_type": "api",
            "name": "bra_ppp_2016_1km_Aggregated_UNadj.tif",
            "mimetype": null,
            "size": null
        }
    ]
}