{
    "id": "4546e8f1-9fec-43de-b724-d810accb5786",
    "title": "Brazil Airports (OpenStreetMap Export)",
    "name": "hotosm_bra_airports",
    "notes": "OpenStreetMap exports for use in GIS applications. This theme includes all OpenStreetMap features in this area matching ( Learn what tags means here ) : tags['aeroway'] IS NOT NULL OR tags['building'] = 'aerodrome' OR tags['emergency:helipad'] IS NOT NULL OR tags['emergency'] = 'landing_site' Features may have these attributes:  name name:en aeroway building emergency emergency:helipad operator:type capacity:persons addr:full addr:city source name:pt  This dataset is one of many OpenStreetMap exports on HDX. See the Humanitarian OpenStreetMap Team website for more information.",
    "dataset_source": "OpenStreetMap contributors",
    "organization": "Humanitarian OpenStreetMap Team (HOT)",
    "dataset_date": "[2024-04-05T00:00:00 TO 2024-04-05T23:59:59]",
    "last_modified": "2024-04-05T15:57:14.266812",
    "data_update_frequency": "Every month",
    "groups": [
        "Brazil"
    ],
    "license_title": "Open Database License (ODC-ODbL)",
    "methodology": "Other",
    "methodology_other": "Volunteered geographic information",
    "caveats": "OpenStreetMap data is crowd sourced and cannot be considered to be exhaustive",
    "tags": [
        "aviation",
        "facilities-infrastructure",
        "geodata"
    ],
    "resources": [
        {
            "created": "2024-04-05T15:57:14.286917",
            "description": "ESRI Shapefile",
            "format": "SHP",
            "download_url": "https://s3.dualstack.us-east-1.amazonaws.com/production-raw-data-api/ISO3/BRA/airports/points/hotosm_bra_airports_points_shp.zip",
            "id": "13fa11d4-85c5-4b7f-a513-ec1255054d59",
            "last_modified": "2024-04-05T15:57:14.264009",
            "metadata_modified": "2024-04-05T15:59:14.516774",
            "microdata": false,
            "dataset_id": "4546e8f1-9fec-43de-b724-d810accb5786",
            "resource_type": "api",
            "name": "hotosm_bra_airports_points_shp.zip",
            "mimetype": null,
            "size": "163.9K"
        },
        {
            "created": "2024-04-05T15:57:14.286923",
            "description": "KML",
            "format": "KML",
            "download_url": "https://s3.dualstack.us-east-1.amazonaws.com/production-raw-data-api/ISO3/BRA/airports/points/hotosm_bra_airports_points_kml.zip",
            "id": "21406550-cb50-4355-bd16-c228ba99fa9f",
            "last_modified": "2024-04-05T15:57:14.264301",
            "metadata_modified": "2024-04-05T15:59:20.502762",
            "microdata": false,
            "dataset_id": "4546e8f1-9fec-43de-b724-d810accb5786",
            "resource_type": "api",
            "name": "hotosm_bra_airports_points_kml.zip",
            "mimetype": null,
            "size": "108.0K"
        },
        {
            "created": "2024-04-05T15:57:14.286927",
            "description": "GeoJSON",
            "format": "GeoJSON",
            "download_url": "https://s3.dualstack.us-east-1.amazonaws.com/production-raw-data-api/ISO3/BRA/airports/points/hotosm_bra_airports_points_geojson.zip",
            "id": "1bcc2d72-0065-4ef3-8ccf-f61bcd465c0a",
            "last_modified": "2024-04-05T15:57:14.264546",
            "metadata_modified": "2024-04-05T15:59:42.910589",
            "microdata": false,
            "dataset_id": "4546e8f1-9fec-43de-b724-d810accb5786",
            "resource_type": "api",
            "name": "hotosm_bra_airports_points_geojson.zip",
            "mimetype": null,
            "size": "110.3K"
        },
        {
            "created": "2024-04-05T15:57:14.286930",
            "description": "GPKG",
            "format": "Geopackage",
            "download_url": "https://s3.dualstack.us-east-1.amazonaws.com/production-raw-data-api/ISO3/BRA/airports/points/hotosm_bra_airports_points_gpkg.zip",
            "id": "d2ca5d93-92b8-4c80-8d50-532d11ce220e",
            "last_modified": "2024-04-05T15:57:14.264781",
            "metadata_modified": "2024-04-05T15:59:14.517076",
            "microdata": false,
            "dataset_id": "4546e8f1-9fec-43de-b724-d810accb5786",
            "resource_type": "api",
            "name": "hotosm_bra_airports_points_gpkg.zip",
            "mimetype": null,
            "size": "139.6K"
        },
        {
            "created": "2024-04-05T15:57:14.286933",
            "description": "ESRI Shapefile",
            "format": "SHP",
            "download_url": "https://s3.dualstack.us-east-1.amazonaws.com/production-raw-data-api/ISO3/BRA/airports/lines/hotosm_bra_airports_lines_shp.zip",
            "id": "46551303-d3eb-478a-9251-c5da32cf5afa",
            "last_modified": "2024-04-05T15:57:14.265017",
            "metadata_modified": "2024-04-05T16:00:01.545469",
            "microdata": false,
            "dataset_id": "4546e8f1-9fec-43de-b724-d810accb5786",
            "resource_type": "api",
            "name": "hotosm_bra_airports_lines_shp.zip",
            "mimetype": null,
            "size": "980.9K"
        },
        {
            "created": "2024-04-05T15:57:14.286936",
            "description": "KML",
            "format": "KML",
            "download_url": "https://s3.dualstack.us-east-1.amazonaws.com/production-raw-data-api/ISO3/BRA/airports/lines/hotosm_bra_airports_lines_kml.zip",
            "id": "0b1f59d3-9490-4ca9-9ff7-0056125e05ac",
            "last_modified": "2024-04-05T15:57:14.265372",
            "metadata_modified": "2024-04-05T16:00:04.380069",
            "microdata": false,
            "dataset_id": "4546e8f1-9fec-43de-b724-d810accb5786",
            "resource_type": "api",
            "name": "hotosm_bra_airports_lines_kml.zip",
            "mimetype": null,
            "size": "580.7K"
        },
        {
            "created": "2024-04-05T15:57:14.286940",
            "description": "GeoJSON",
            "format": "GeoJSON",
            "download_url": "https://s3.dualstack.us-east-1.amazonaws.com/production-raw-data-api/ISO3/BRA/airports/lines/hotosm_bra_airports_lines_geojson.zip",
            "id": "be1e750c-73af-48ab-9929-b62a5152121e",
            "last_modified": "2024-04-05T15:57:14.265637",
            "metadata_modified": "2024-04-05T16:00:38.243075",
            "microdata": false,
            "dataset_id": "4546e8f1-9fec-43de-b724-d810accb5786",
            "resource_type": "api",
            "name": "hotosm_bra_airports_lines_geojson.zip",
            "mimetype": null,
            "size": "592.1K"
        },
        {
            "created": "2024-04-05T15:57:14.286942",
            "description": "GPKG",
            "format": "Geopackage",
            "download_url": "https://s3.dualstack.us-east-1.amazonaws.com/production-raw-data-api/ISO3/BRA/airports/lines/hotosm_bra_airports_lines_gpkg.zip",
            "id": "c8243fcc-b3ec-40fd-b1db-5870fbbe8494",
            "last_modified": "2024-04-05T15:57:14.265872",
            "metadata_modified": "2024-04-05T15:59:14.517480",
            "microdata": false,
            "dataset_id": "4546e8f1-9fec-43de-b724-d810accb5786",
            "resource_type": "api",
            "name": "hotosm_bra_airports_lines_gpkg.zip",
            "mimetype": null,
            "size": "967.9K"
        },
        {
            "created": "2024-04-05T15:57:14.286946",
            "description": "ESRI Shapefile",
            "format": "SHP",
            "download_url": "https://s3.dualstack.us-east-1.amazonaws.com/production-raw-data-api/ISO3/BRA/airports/polygons/hotosm_bra_airports_polygons_shp.zip",
            "id": "3d9e1051-0390-4d56-987e-35d66143d69c",
            "last_modified": "2024-04-05T15:57:14.266107",
            "metadata_modified": "2024-04-05T16:00:35.777222",
            "microdata": false,
            "dataset_id": "4546e8f1-9fec-43de-b724-d810accb5786",
            "resource_type": "api",
            "name": "hotosm_bra_airports_polygons_shp.zip",
            "mimetype": null,
            "size": "1013.0K"
        },
        {
            "created": "2024-04-05T15:57:14.286949",
            "description": "KML",
            "format": "KML",
            "download_url": "https://s3.dualstack.us-east-1.amazonaws.com/production-raw-data-api/ISO3/BRA/airports/polygons/hotosm_bra_airports_polygons_kml.zip",
            "id": "034b84dd-394b-4cf2-9fbc-57bd55f43cb1",
            "last_modified": "2024-04-05T15:57:14.266351",
            "metadata_modified": "2024-04-05T16:00:40.057356",
            "microdata": false,
            "dataset_id": "4546e8f1-9fec-43de-b724-d810accb5786",
            "resource_type": "api",
            "name": "hotosm_bra_airports_polygons_kml.zip",
            "mimetype": null,
            "size": "648.3K"
        },
        {
            "created": "2024-04-05T15:57:14.286952",
            "description": "GeoJSON",
            "format": "GeoJSON",
            "download_url": "https://s3.dualstack.us-east-1.amazonaws.com/production-raw-data-api/ISO3/BRA/airports/polygons/hotosm_bra_airports_polygons_geojson.zip",
            "id": "0929e074-d90c-4323-ba67-fc8566133eb1",
            "last_modified": "2024-04-05T15:57:14.266578",
            "metadata_modified": "2024-04-05T16:00:50.430903",
            "microdata": false,
            "dataset_id": "4546e8f1-9fec-43de-b724-d810accb5786",
            "resource_type": "api",
            "name": "hotosm_bra_airports_polygons_geojson.zip",
            "mimetype": null,
            "size": "661.6K"
        },
        {
            "created": "2024-04-05T15:57:14.286955",
            "description": "GPKG",
            "format": "Geopackage",
            "download_url": "https://s3.dualstack.us-east-1.amazonaws.com/production-raw-data-api/ISO3/BRA/airports/polygons/hotosm_bra_airports_polygons_gpkg.zip",
            "id": "581ca2c1-b85f-46f1-b0dc-c3280690c5ea",
            "last_modified": "2024-04-05T15:57:14.266812",
            "metadata_modified": "2024-04-05T15:59:14.517819",
            "microdata": false,
            "dataset_id": "4546e8f1-9fec-43de-b724-d810accb5786",
            "resource_type": "api",
            "name": "hotosm_bra_airports_polygons_gpkg.zip",
            "mimetype": null,
            "size": "1004.7K"
        }
    ]
}