{
    "id": "5634a3f2-e2f3-4245-81da-470ee45b8657",
    "title": "Brazil - Energy and Mining",
    "name": "world-bank-energy-and-mining-indicators-for-brazil",
    "notes": "Contains data from the World Bank's data portal. There is also a consolidated country dataset on HDX. The world economy needs ever-increasing amounts of energy to sustain economic growth, raise living standards, and reduce poverty. But today's trends in energy use are not sustainable. As the world's population grows and economies become more industrialized, nonrenewable energy sources will become scarcer and more costly. Data here on energy production, use, dependency, and efficiency are compiled by the World Bank from the International Energy Agency and the Carbon Dioxide Information Analysis Center.",
    "dataset_source": "World Bank",
    "organization": "World Bank Group",
    "dataset_date": "[1960-01-01T00:00:00 TO 2022-12-31T23:59:59]",
    "last_modified": "2024-04-27T13:50:44.524779",
    "data_update_frequency": "Every month",
    "groups": [
        "Brazil"
    ],
    "license_title": "Creative Commons Attribution International",
    "methodology": "Registry",
    "methodology_other": null,
    "caveats": "",
    "tags": [
        "development",
        "energy",
        "hxl",
        "indicators"
    ],
    "resources": [
        {
            "created": "2019-11-19T14:16:14.532854",
            "description": "HXLated csv containing Energy and Mining indicators Indicators: Access to electricity, Adjusted savings, CO2 emissions from gaseous fuel consumption, CO2 emissions from liquid fuel consumption, Energy intensity level of primary energy, Energy related methane emissions, Firms using banks to finance investment, Fuel exports, Fuel imports, Investment in energy with private participation, Methane emissions in energy sector, Mineral rents, Natural gas rents, Nitrous oxide emissions in energy sector, Oil rents, Ores and metals exports, Ores and metals imports, Pump price for diesel fuel, Pump price for gasoline, Renewable energy consumption, Time required to get electricity, Time to obtain an electrical connection, Total natural resources rents, Value lost due to electrical outages",
            "format": "CSV",
            "download_url": "https://data.humdata.org/dataset/5634a3f2-e2f3-4245-81da-470ee45b8657/resource/82f641a6-565f-410f-87ad-ba2a5b2e0b93/download/energy-and-mining_bra.csv",
            "id": "82f641a6-565f-410f-87ad-ba2a5b2e0b93",
            "last_modified": "2024-04-27T13:50:44.175399",
            "metadata_modified": "2024-04-27T13:50:48.256983",
            "microdata": false,
            "dataset_id": "5634a3f2-e2f3-4245-81da-470ee45b8657",
            "resource_type": "file.upload",
            "name": "Energy and Mining Indicators for Brazil",
            "mimetype": "",
            "size": "112.7K"
        },
        {
            "created": "2020-05-04T14:25:39.783983",
            "description": "Cut down data for QuickCharts",
            "format": "CSV",
            "download_url": "https://data.humdata.org/dataset/5634a3f2-e2f3-4245-81da-470ee45b8657/resource/f6cd74e5-348b-4888-b581-48a41e8c8cbe/download/qc_energy-and-mining_bra.csv",
            "id": "f6cd74e5-348b-4888-b581-48a41e8c8cbe",
            "last_modified": "2024-04-27T13:50:44.524779",
            "metadata_modified": "2024-04-27T13:50:48.716720",
            "microdata": false,
            "dataset_id": "5634a3f2-e2f3-4245-81da-470ee45b8657",
            "resource_type": "file.upload",
            "name": "QuickCharts-Energy and Mining Indicators for Brazil",
            "mimetype": "",
            "size": "2.3K"
        }
    ]
}