{
    "id": "8bec2803-be47-4d6c-b20d-a374de389172",
    "title": "HOTOSM Brazil (East) Airports (OpenStreetMap Export)",
    "name": "hotosm_bra_east_airports",
    "notes": "OpenStreetMap exports for use in GIS applications. This theme includes all OpenStreetMap features in this area matching: aeroway IS NOT NULL OR building = 'aerodrome' OR emergency:helipad IS NOT NULL OR emergency = 'landing_site' Features may have these attributes:  addr:city aeroway emergency:helipad addr:full capacity:persons operator:type source emergency name building  This dataset is one of many OpenStreetMap exports on HDX. See the Humanitarian OpenStreetMap Team website for more information.",
    "dataset_source": "OpenStreetMap contributors",
    "organization": "Humanitarian OpenStreetMap Team (HOT)",
    "dataset_date": "[2023-03-04T00:00:00 TO 2023-03-04T23:59:59]",
    "last_modified": "2020-06-03T22:47:36",
    "data_update_frequency": "Every month",
    "groups": [
        "Brazil"
    ],
    "license_title": "Open Database License (ODC-ODbL)",
    "methodology": "Other",
    "methodology_other": "Volunteered geographic information",
    "caveats": "OpenStreetMap data is crowd sourced and cannot be considered to be exhaustive",
    "tags": [
        "aviation",
        "facilities-infrastructure",
        "geodata",
        "transportation"
    ],
    "resources": [
        {
            "created": "2019-12-06T23:39:25.090115",
            "description": "ESRI Shapefile",
            "format": "SHP",
            "download_url": "https://export.hotosm.org/downloads/0595bee7-2f3c-499b-ade9-50bd2886a922/hotosm_bra_east_airports_points_shp.zip",
            "id": "4d3b1968-b546-4481-81d0-371db3a7e41e",
            "last_modified": "2020-06-03T22:39:08",
            "metadata_modified": "2024-01-26T05:44:46.968744",
            "microdata": false,
            "dataset_id": "8bec2803-be47-4d6c-b20d-a374de389172",
            "resource_type": "api",
            "name": "hotosm_bra_east_airports_points_shp.zip",
            "mimetype": null,
            "size": "0.0B"
        },
        {
            "created": "2019-12-06T23:39:25.090134",
            "description": "ESRI Shapefile",
            "format": "SHP",
            "download_url": "https://export.hotosm.org/downloads/0595bee7-2f3c-499b-ade9-50bd2886a922/hotosm_bra_east_airports_lines_shp.zip",
            "id": "aaaede38-799f-48c0-9824-d21bf6ab320c",
            "last_modified": "2020-06-03T22:39:08",
            "metadata_modified": "2024-01-26T05:44:48.096719",
            "microdata": false,
            "dataset_id": "8bec2803-be47-4d6c-b20d-a374de389172",
            "resource_type": "api",
            "name": "hotosm_bra_east_airports_lines_shp.zip",
            "mimetype": null,
            "size": "0.0B"
        },
        {
            "created": "2019-12-06T23:39:25.090143",
            "description": "ESRI Shapefile",
            "format": "SHP",
            "download_url": "https://export.hotosm.org/downloads/0595bee7-2f3c-499b-ade9-50bd2886a922/hotosm_bra_east_airports_polygons_shp.zip",
            "id": "30d8ceb3-e2aa-413a-a598-68fbd0dabd3a",
            "last_modified": "2020-06-03T22:39:08",
            "metadata_modified": "2024-01-26T05:44:52.587815",
            "microdata": false,
            "dataset_id": "8bec2803-be47-4d6c-b20d-a374de389172",
            "resource_type": "api",
            "name": "hotosm_bra_east_airports_polygons_shp.zip",
            "mimetype": null,
            "size": "0.0B"
        },
        {
            "created": "2019-12-06T23:39:25.090150",
            "description": "Geopackage, SQLite compatible",
            "format": "Geopackage",
            "download_url": "https://export.hotosm.org/downloads/0595bee7-2f3c-499b-ade9-50bd2886a922/hotosm_bra_east_airports_gpkg.zip",
            "id": "3b1a4ec3-efbd-46cf-8790-8039f7760dc4",
            "last_modified": "2020-06-03T22:38:05",
            "metadata_modified": "2023-03-04T16:44:27.294584",
            "microdata": false,
            "dataset_id": "8bec2803-be47-4d6c-b20d-a374de389172",
            "resource_type": "api",
            "name": "hotosm_bra_east_airports_gpkg.zip",
            "mimetype": null,
            "size": null
        },
        {
            "created": "2019-12-06T23:39:25.090154",
            "description": "Google Earth .KML",
            "format": "KML",
            "download_url": "https://export.hotosm.org/downloads/0595bee7-2f3c-499b-ade9-50bd2886a922/hotosm_bra_east_airports_points_kml.zip",
            "id": "5bf58417-75d1-4a0d-9f7a-80eb02348175",
            "last_modified": "2020-06-03T22:40:02",
            "metadata_modified": "2024-01-26T05:44:49.251015",
            "microdata": false,
            "dataset_id": "8bec2803-be47-4d6c-b20d-a374de389172",
            "resource_type": "api",
            "name": "hotosm_bra_east_airports_points_kml.zip",
            "mimetype": null,
            "size": "0.0B"
        },
        {
            "created": "2019-12-06T23:39:25.090159",
            "description": "Google Earth .KML",
            "format": "KML",
            "download_url": "https://export.hotosm.org/downloads/0595bee7-2f3c-499b-ade9-50bd2886a922/hotosm_bra_east_airports_lines_kml.zip",
            "id": "85415a9e-88d6-4aec-88eb-718edaaf1ea8",
            "last_modified": "2020-06-03T22:40:02",
            "metadata_modified": "2024-01-26T05:44:50.434552",
            "microdata": false,
            "dataset_id": "8bec2803-be47-4d6c-b20d-a374de389172",
            "resource_type": "api",
            "name": "hotosm_bra_east_airports_lines_kml.zip",
            "mimetype": null,
            "size": "0.0B"
        },
        {
            "created": "2019-12-06T23:39:25.090163",
            "description": "Google Earth .KML",
            "format": "KML",
            "download_url": "https://export.hotosm.org/downloads/0595bee7-2f3c-499b-ade9-50bd2886a922/hotosm_bra_east_airports_polygons_kml.zip",
            "id": "46282c68-0420-483c-93e9-0c78cf29517c",
            "last_modified": "2020-06-03T22:40:02",
            "metadata_modified": "2024-01-26T05:44:51.575524",
            "microdata": false,
            "dataset_id": "8bec2803-be47-4d6c-b20d-a374de389172",
            "resource_type": "api",
            "name": "hotosm_bra_east_airports_polygons_kml.zip",
            "mimetype": null,
            "size": "0.0B"
        },
        {
            "created": "2019-12-06T23:39:25.090166",
            "description": ".IMG for Garmin GPS Devices (All OSM layers for area)",
            "format": "Garmin IMG",
            "download_url": "https://export.hotosm.org/downloads/0595bee7-2f3c-499b-ade9-50bd2886a922/hotosm_bra_east_gmapsupp_img.zip",
            "id": "3871aad7-b5fd-429d-9b4f-e28be95b3082",
            "last_modified": "2020-06-03T22:47:36",
            "metadata_modified": "2023-03-04T16:44:27.294972",
            "microdata": false,
            "dataset_id": "8bec2803-be47-4d6c-b20d-a374de389172",
            "resource_type": "api",
            "name": "hotosm_bra_east_gmapsupp_img.zip",
            "mimetype": null,
            "size": "0.0B"
        }
    ]
}