{
    "id": "9971c6f2-4233-4dfd-883d-d8dba5c82bb9",
    "title": "Brazil - Trade",
    "name": "world-bank-trade-indicators-for-brazil",
    "notes": "Contains data from the World Bank's data portal. There is also a consolidated country dataset on HDX. Trade is a key means to fight poverty and achieve the Millennium Development Goals, specifically by improving developing country access to markets, and supporting a rules based, predictable trading system. In cooperation with other international development partners, the World Bank launched the Transparency in Trade Initiative to provide free and easy access to data on country-specific trade policies.",
    "dataset_source": "World Bank",
    "organization": "World Bank Group",
    "dataset_date": "[1960-01-01T00:00:00 TO 2022-12-31T23:59:59]",
    "last_modified": "2024-04-27T13:52:23.453931",
    "data_update_frequency": "Every month",
    "groups": [
        "Brazil"
    ],
    "license_title": "Creative Commons Attribution International",
    "methodology": "Registry",
    "methodology_other": null,
    "caveats": "",
    "tags": [
        "hxl",
        "indicators",
        "trade"
    ],
    "resources": [
        {
            "created": "2019-11-19T14:18:10.281083",
            "description": "HXLated csv containing Trade indicators Indicators: Agricultural raw materials exports, Agricultural raw materials imports, Arms exports, Arms imports, Average time to clear exports through customs, Binding coverage, Bound rate, Commercial service exports, Commercial service imports, Communications, Computer, Cost to export, Cost to import, Customs and other import duties, Export unit value index, Export value index, Export volume index, Exports as a capacity to import, Exports of goods, Exports of goods and services, External balance on goods and services, Food exports, Food imports, Fuel exports, Fuel imports, Goods exports, Goods imports, High-technology exports, ICT goods exports, ICT goods imports, ICT service exports, Import unit value index, Import value index, Import volume index, Imports of goods, Imports of goods and services, Insurance and financial services, International tourism, Lead time to export, Lead time to import, Logistics performance index, Manufactures exports, Manufactures imports, Medium and high-tech exports, Merchandise exports, Merchandise exports by the reporting economy, Merchandise exports to economies in the Arab World, Merchandise exports to high-income economies, Merchandise exports to low- and middle-income economies in East Asia &amp; Pacific, Merchandise exports to low- and middle-income economies in Europe &amp; Central Asia, Merchandise exports to low- and middle-income economies in Latin America &amp; the Caribbean, Merchandise exports to low- and middle-income economies in Middle East &amp; North Africa, Merchandise exports to low- and middle-income economies in South Asia, Merchandise exports to low- and middle-income economies in Sub-Saharan Africa, Merchandise exports to low- and middle-income economies outside region, Merchandise exports to low- and middle-income economies within region, Merchandise imports, Merchandise imports by the reporting economy, Merchandise imports from economies in the Arab World, Merchandise imports from high-income economies, Merchandise imports from low- and middle-income economies in East Asia &amp; Pacific, Merchandise imports from low- and middle-income economies in Europe &amp; Central Asia, Merchandise imports from low- and middle-income economies in Latin America &amp; the Caribbean, Merchandise imports from low- and middle-income economies in Middle East &amp; North Africa, Merchandise imports from low- and middle-income economies in South Asia, Merchandise imports from low- and middle-income economies in Sub-Saharan Africa, Merchandise imports from low- and middle-income economies outside region, Merchandise imports from low- and middle-income economies within region, Merchandise trade, Net barter terms of trade index, Net trade in goods, Net trade in goods and services, Ores and metals exports, Ores and metals imports, Service exports, Service imports, Share of tariff lines with international peaks, Share of tariff lines with specific rates, Tariff rate, Taxes on exports, Time to export, Time to import, Trade, Trade in services, Transport services, Travel services",
            "format": "CSV",
            "download_url": "https://data.humdata.org/dataset/9971c6f2-4233-4dfd-883d-d8dba5c82bb9/resource/28610d8c-8f37-4d8a-ad8c-b366e68069fe/download/trade_bra.csv",
            "id": "28610d8c-8f37-4d8a-ad8c-b366e68069fe",
            "last_modified": "2024-04-27T13:52:23.260697",
            "metadata_modified": "2024-04-27T13:52:26.864045",
            "microdata": false,
            "dataset_id": "9971c6f2-4233-4dfd-883d-d8dba5c82bb9",
            "resource_type": "file.upload",
            "name": "Trade Indicators for Brazil",
            "mimetype": "",
            "size": "651.4K"
        },
        {
            "created": "2020-05-04T14:30:07.256448",
            "description": "Cut down data for QuickCharts",
            "format": "CSV",
            "download_url": "https://data.humdata.org/dataset/9971c6f2-4233-4dfd-883d-d8dba5c82bb9/resource/11317338-cac7-4b91-8080-0429f222d62c/download/qc_trade_bra.csv",
            "id": "11317338-cac7-4b91-8080-0429f222d62c",
            "last_modified": "2024-04-27T13:52:23.453931",
            "metadata_modified": "2024-04-27T13:52:25.878724",
            "microdata": false,
            "dataset_id": "9971c6f2-4233-4dfd-883d-d8dba5c82bb9",
            "resource_type": "file.upload",
            "name": "QuickCharts-Trade Indicators for Brazil",
            "mimetype": "",
            "size": "613.0B"
        }
    ]
}