{
    "id": "fd7a99fe-ff94-4e4f-b6de-2bb22aca2126",
    "title": "HOTOSM Brazil (North) Sea Ports (OpenStreetMap Export)",
    "name": "hotosm_bra_north_sea_ports",
    "notes": "OpenStreetMap exports for use in GIS applications. This theme includes all OpenStreetMap features in this area matching: amenity = 'ferry_terminal' OR building = 'ferry_terminal' OR port IS NOT NULL Features may have these attributes:  name addr:full source operator:type amenity addr:city building port  This dataset is one of many OpenStreetMap exports on HDX. See the Humanitarian OpenStreetMap Team website for more information.",
    "dataset_source": "OpenStreetMap contributors",
    "organization": "Humanitarian OpenStreetMap Team (HOT)",
    "dataset_date": "[2023-03-07T00:00:00 TO 2023-03-07T23:59:59]",
    "last_modified": "2020-06-10T22:01:52.425613",
    "data_update_frequency": "Every month",
    "groups": [
        "Brazil"
    ],
    "license_title": "Open Database License (ODC-ODbL)",
    "methodology": "Other",
    "methodology_other": "Volunteered geographic information",
    "caveats": "OpenStreetMap data is crowd sourced and cannot be considered to be exhaustive",
    "tags": [
        "facilities-infrastructure",
        "geodata",
        "logistics",
        "ports",
        "transportation"
    ],
    "resources": [
        {
            "created": "2019-12-07T00:40:34.119399",
            "description": "ESRI Shapefile",
            "format": "SHP",
            "download_url": "https://export.hotosm.org/downloads/e5c67b43-9def-4dda-a17e-893d326d5549/hotosm_bra_north_sea_ports_points_shp.zip",
            "id": "5519e094-1ba5-4536-ab23-3119b0bac69e",
            "last_modified": "2020-06-10T22:01:52.425613",
            "metadata_modified": "2024-01-26T05:46:16.129143",
            "microdata": false,
            "dataset_id": "fd7a99fe-ff94-4e4f-b6de-2bb22aca2126",
            "resource_type": "api",
            "name": "hotosm_bra_north_sea_ports_points_shp.zip",
            "mimetype": null,
            "size": "0.0B"
        },
        {
            "created": "2019-12-07T00:40:34.119414",
            "description": "ESRI Shapefile",
            "format": "SHP",
            "download_url": "https://export.hotosm.org/downloads/e5c67b43-9def-4dda-a17e-893d326d5549/hotosm_bra_north_sea_ports_lines_shp.zip",
            "id": "d2ac4527-aeba-4f7e-97ad-9be80c86951e",
            "last_modified": "2020-06-10T22:01:52.425613",
            "metadata_modified": "2024-01-26T05:46:17.598377",
            "microdata": false,
            "dataset_id": "fd7a99fe-ff94-4e4f-b6de-2bb22aca2126",
            "resource_type": "api",
            "name": "hotosm_bra_north_sea_ports_lines_shp.zip",
            "mimetype": null,
            "size": "0.0B"
        },
        {
            "created": "2019-12-07T00:40:34.119422",
            "description": "ESRI Shapefile",
            "format": "SHP",
            "download_url": "https://export.hotosm.org/downloads/e5c67b43-9def-4dda-a17e-893d326d5549/hotosm_bra_north_sea_ports_polygons_shp.zip",
            "id": "e77e6714-0b95-42ed-a32c-a1b46fcd00f4",
            "last_modified": "2020-06-10T22:01:52.425613",
            "metadata_modified": "2024-01-26T05:46:18.790655",
            "microdata": false,
            "dataset_id": "fd7a99fe-ff94-4e4f-b6de-2bb22aca2126",
            "resource_type": "api",
            "name": "hotosm_bra_north_sea_ports_polygons_shp.zip",
            "mimetype": null,
            "size": "0.0B"
        },
        {
            "created": "2019-12-07T00:40:34.119429",
            "description": "Geopackage, SQLite compatible",
            "format": "Geopackage",
            "download_url": "https://export.hotosm.org/downloads/e5c67b43-9def-4dda-a17e-893d326d5549/hotosm_bra_north_sea_ports_gpkg.zip",
            "id": "f8f5c7c2-acf8-4a2a-8482-ea0bd3332dc3",
            "last_modified": "2020-06-10T22:01:52.425613",
            "metadata_modified": "2023-03-07T01:02:10.807409",
            "microdata": false,
            "dataset_id": "fd7a99fe-ff94-4e4f-b6de-2bb22aca2126",
            "resource_type": "api",
            "name": "hotosm_bra_north_sea_ports_gpkg.zip",
            "mimetype": null,
            "size": null
        },
        {
            "created": "2019-12-07T00:40:34.119436",
            "description": "Google Earth .KML",
            "format": "KML",
            "download_url": "https://export.hotosm.org/downloads/e5c67b43-9def-4dda-a17e-893d326d5549/hotosm_bra_north_sea_ports_points_kml.zip",
            "id": "72379875-9699-4312-9f60-d60679c5e1cb",
            "last_modified": "2020-06-10T22:01:52.425613",
            "metadata_modified": "2024-01-26T05:46:19.885339",
            "microdata": false,
            "dataset_id": "fd7a99fe-ff94-4e4f-b6de-2bb22aca2126",
            "resource_type": "api",
            "name": "hotosm_bra_north_sea_ports_points_kml.zip",
            "mimetype": null,
            "size": "0.0B"
        },
        {
            "created": "2019-12-07T00:40:34.119443",
            "description": "Google Earth .KML",
            "format": "KML",
            "download_url": "https://export.hotosm.org/downloads/e5c67b43-9def-4dda-a17e-893d326d5549/hotosm_bra_north_sea_ports_lines_kml.zip",
            "id": "a663ac8a-2c81-4d91-8e2d-a16aba73d41e",
            "last_modified": "2020-06-10T22:01:52.425613",
            "metadata_modified": "2024-01-26T05:46:21.018514",
            "microdata": false,
            "dataset_id": "fd7a99fe-ff94-4e4f-b6de-2bb22aca2126",
            "resource_type": "api",
            "name": "hotosm_bra_north_sea_ports_lines_kml.zip",
            "mimetype": null,
            "size": "0.0B"
        },
        {
            "created": "2019-12-07T00:40:34.119450",
            "description": "Google Earth .KML",
            "format": "KML",
            "download_url": "https://export.hotosm.org/downloads/e5c67b43-9def-4dda-a17e-893d326d5549/hotosm_bra_north_sea_ports_polygons_kml.zip",
            "id": "6c56e481-d9c4-4147-91ff-d38d455940eb",
            "last_modified": "2020-06-10T22:01:52.425613",
            "metadata_modified": "2024-01-26T05:46:22.394033",
            "microdata": false,
            "dataset_id": "fd7a99fe-ff94-4e4f-b6de-2bb22aca2126",
            "resource_type": "api",
            "name": "hotosm_bra_north_sea_ports_polygons_kml.zip",
            "mimetype": null,
            "size": "0.0B"
        },
        {
            "created": "2019-12-07T00:40:34.119457",
            "description": ".IMG for Garmin GPS Devices (All OSM layers for area)",
            "format": "Garmin IMG",
            "download_url": "http://export.hotosm.org/downloads/2d77cd1e-f254-411e-aa01-48d3e803c3ea/hotosm_bra_north_gmapsupp_img.zip",
            "id": "25ba3f91-4d4b-47c2-95d0-d76002fb422d",
            "last_modified": "2020-06-10T22:01:52.425613",
            "metadata_modified": "2021-08-09T04:14:40.811238",
            "microdata": false,
            "dataset_id": "fd7a99fe-ff94-4e4f-b6de-2bb22aca2126",
            "resource_type": "api",
            "name": "hotosm_bra_north_gmapsupp_img.zip",
            "mimetype": null,
            "size": "0.0B"
        }
    ]
}