{
    "id": "9fb9c9ab-fc5b-4506-bd70-b822adad4a55",
    "title": "Brazil - Vulnerability Need Assessment (Boa Vista), 2019",
    "name": "unhcr-bra-2019-vna-v2-1",
    "notes": "This one-off data collection exercise had the purpose of facilitating decision-making processes. The exercize took place within the month of July 2019 and no further frequency is expected. A total of 308 households were surveyed. The population currently living in shelters was classified in three categories for further intervention, namely:  1) Population willing to relocate and/or already registered in the Interiorization programme;  2) Population not willing to relocate to another part of the country;  3) Vulnerable population classified by evident Specific Needs.  These categories are not mutually exclusive.",
    "dataset_source": "UNHCR",
    "organization": "UNHCR - The UN Refugee Agency",
    "dataset_date": "[2019-07-01T00:00:00 TO 2019-07-30T23:59:59]",
    "last_modified": "2022-01-28T00:00:00",
    "data_update_frequency": "Never",
    "groups": [
        "Brazil"
    ],
    "license_title": "Other",
    "methodology": "Other",
    "methodology_other": "Kind of Data: Sample survey data [ssd]  \nUnit of Analysis: Households living in shelters  \nSampling Procedure: Simple random sampling.  \nData Collection Mode: Face-to-face interview  \n",
    "caveats": "The data must be requested via the resource download link",
    "tags": [
        "livelihoods",
        "needs assessment"
    ],
    "resources": [
        {
            "created": "2022-04-10T01:32:16.707609",
            "description": "Clicking \"Download\" leads outside HDX where you can request access to the data in csv, xlsx &amp; dta formats",
            "format": "Web App",
            "download_url": "https://microdata.unhcr.org/index.php/auth/login/?destination=catalog/606/get-microdata",
            "id": "838f3e15-7db7-4c6e-823c-97abcbd79684",
            "last_modified": "2022-01-28T00:00:00",
            "metadata_modified": "2023-07-30T01:49:39.480489",
            "microdata": false,
            "dataset_id": "9fb9c9ab-fc5b-4506-bd70-b822adad4a55",
            "resource_type": "api",
            "name": "Brazil - Vulnerability Need Assessment (Boa Vista), 2019",
            "mimetype": null,
            "size": null
        },
        {
            "created": "2022-04-10T01:32:16.707614",
            "description": "Contains information about the dataset's metadata and data",
            "format": "PDF",
            "download_url": "https://microdata.unhcr.org/index.php/catalog/606/pdf-documentation",
            "id": "682996ba-92fd-4034-b7f1-8ccaa8dd4029",
            "last_modified": "2022-01-28T00:00:00",
            "metadata_modified": "2023-07-30T01:49:39.480635",
            "microdata": false,
            "dataset_id": "9fb9c9ab-fc5b-4506-bd70-b822adad4a55",
            "resource_type": "api",
            "name": "Codebook",
            "mimetype": null,
            "size": null
        }
    ]
}