{
    "id": "fd39e5fe-6ab6-4467-96b6-40cd51f3e11f",
    "title": "Brazil - Aid Effectiveness",
    "name": "world-bank-aid-effectiveness-indicators-for-brazil",
    "notes": "Contains data from the World Bank's data portal. There is also a consolidated country dataset on HDX. Aid effectiveness is the impact that aid has in reducing poverty and inequality, increasing growth, building capacity, and accelerating achievement of the Millennium Development Goals set by the international community. Indicators here cover aid received as well as progress in reducing poverty and improving education, health, and other measures of human welfare.",
    "dataset_source": "World Bank",
    "organization": "World Bank Group",
    "dataset_date": "[1960-01-01T00:00:00 TO 2023-12-31T23:59:59]",
    "last_modified": "2024-04-27T13:50:15.744001",
    "data_update_frequency": "Every month",
    "groups": [
        "Brazil"
    ],
    "license_title": "Creative Commons Attribution International",
    "methodology": "Registry",
    "methodology_other": null,
    "caveats": "",
    "tags": [
        "aid effectiveness",
        "hxl",
        "indicators"
    ],
    "resources": [
        {
            "created": "2019-11-19T14:15:22.598147",
            "description": "HXLated csv containing Aid Effectiveness indicators Indicators: Grants, Incidence of tuberculosis, Income share held by lowest 20%, Maternal mortality ratio, Mortality rate, Net ODA received, Net ODA received per capita, Net bilateral aid flows from DAC donors, Net migration, Net official development assistance and official aid received, Net official development assistance received, Net official flows from UN agencies, Poverty headcount ratio at $2.15 a day, Pregnant women receiving prenatal care, Prevalence of HIV, Prevalence of stunting, Primary completion rate, School enrollment, Technical cooperation grants, Vulnerable employment",
            "format": "CSV",
            "download_url": "https://data.humdata.org/dataset/fd39e5fe-6ab6-4467-96b6-40cd51f3e11f/resource/21c541fc-97fb-4b4f-aea2-ff011890cffc/download/aid-effectiveness_bra.csv",
            "id": "21c541fc-97fb-4b4f-aea2-ff011890cffc",
            "last_modified": "2024-04-27T13:50:15.493376",
            "metadata_modified": "2024-04-27T13:50:18.534885",
            "microdata": false,
            "dataset_id": "fd39e5fe-6ab6-4467-96b6-40cd51f3e11f",
            "resource_type": "file.upload",
            "name": "Aid Effectiveness Indicators for Brazil",
            "mimetype": "",
            "size": "271.1K"
        },
        {
            "created": "2020-05-04T14:24:25.469672",
            "description": "Cut down data for QuickCharts",
            "format": "CSV",
            "download_url": "https://data.humdata.org/dataset/fd39e5fe-6ab6-4467-96b6-40cd51f3e11f/resource/f85cf2a7-5088-49db-8461-4a5858fa3d4b/download/qc_aid-effectiveness_bra.csv",
            "id": "f85cf2a7-5088-49db-8461-4a5858fa3d4b",
            "last_modified": "2024-04-27T13:50:15.744001",
            "metadata_modified": "2024-04-27T13:50:18.873855",
            "microdata": false,
            "dataset_id": "fd39e5fe-6ab6-4467-96b6-40cd51f3e11f",
            "resource_type": "file.upload",
            "name": "QuickCharts-Aid Effectiveness Indicators for Brazil",
            "mimetype": "",
            "size": "2.8K"
        }
    ]
}