{
    "id": "70d91d5d-3369-466f-adef-df730df85fd4",
    "title": "HOTOSM Brazil (East) Points of Interest (OpenStreetMap Export)",
    "name": "hotosm_bra_east_points_of_interest",
    "notes": "OpenStreetMap exports for use in GIS applications. This theme includes all OpenStreetMap features in this area matching: amenity IS NOT NULL OR man_made IS NOT NULL OR shop IS NOT NULL OR tourism IS NOT NULL Features may have these attributes:  man_made beds addr:city addr:housenumber tourism rooms addr:full amenity addr:street shop opening_hours name source  This dataset is one of many OpenStreetMap exports on HDX. See the Humanitarian OpenStreetMap Team website for more information.",
    "dataset_source": "OpenStreetMap contributors",
    "organization": "Humanitarian OpenStreetMap Team (HOT)",
    "dataset_date": "[2023-03-04T00:00:00 TO 2023-03-04T23:59:59]",
    "last_modified": "2020-07-14T22:03:29.889841",
    "data_update_frequency": "Every month",
    "groups": [
        "Brazil"
    ],
    "license_title": "Open Database License (ODC-ODbL)",
    "methodology": "Other",
    "methodology_other": "Volunteered geographic information",
    "caveats": "OpenStreetMap data is crowd sourced and cannot be considered to be exhaustive",
    "tags": [
        "facilities-infrastructure",
        "geodata",
        "points of interest-poi"
    ],
    "resources": [
        {
            "created": "2019-01-28T08:55:11.117380",
            "description": "ESRI Shapefile",
            "format": "SHP",
            "download_url": "https://export.hotosm.org/downloads/0595bee7-2f3c-499b-ade9-50bd2886a922/hotosm_bra_east_points_of_interest_points_shp.zip",
            "id": "3316ce92-abb6-40e2-b32f-de2a4ab87bc0",
            "last_modified": "2020-07-14T22:03:29.889841",
            "metadata_modified": "2024-01-26T03:22:14.471750",
            "microdata": false,
            "dataset_id": "70d91d5d-3369-466f-adef-df730df85fd4",
            "resource_type": "api",
            "name": "hotosm_bra_east_points_of_interest_points_shp.zip",
            "mimetype": null,
            "size": "0.0B"
        },
        {
            "created": "2019-01-28T08:55:11.117397",
            "description": "ESRI Shapefile",
            "format": "SHP",
            "download_url": "https://export.hotosm.org/downloads/0595bee7-2f3c-499b-ade9-50bd2886a922/hotosm_bra_east_points_of_interest_polygons_shp.zip",
            "id": "2ae2eff6-823e-481d-a7d9-853059dee224",
            "last_modified": "2020-07-14T22:03:29.889841",
            "metadata_modified": "2024-01-26T03:22:04.141427",
            "microdata": false,
            "dataset_id": "70d91d5d-3369-466f-adef-df730df85fd4",
            "resource_type": "api",
            "name": "hotosm_bra_east_points_of_interest_polygons_shp.zip",
            "mimetype": null,
            "size": "0.0B"
        },
        {
            "created": "2019-01-28T08:55:11.117405",
            "description": "Geopackage, SQLite compatible",
            "format": "Geopackage",
            "download_url": "https://export.hotosm.org/downloads/0595bee7-2f3c-499b-ade9-50bd2886a922/hotosm_bra_east_points_of_interest_gpkg.zip",
            "id": "3585abe6-c1f4-40c6-89ea-ecd892ba0838",
            "last_modified": "2020-07-14T22:03:29.889841",
            "metadata_modified": "2023-03-04T16:44:19.412901",
            "microdata": false,
            "dataset_id": "70d91d5d-3369-466f-adef-df730df85fd4",
            "resource_type": "api",
            "name": "hotosm_bra_east_points_of_interest_gpkg.zip",
            "mimetype": null,
            "size": null
        },
        {
            "created": "2019-01-28T08:55:11.117412",
            "description": "Google Earth .KML",
            "format": "KML",
            "download_url": "https://export.hotosm.org/downloads/0595bee7-2f3c-499b-ade9-50bd2886a922/hotosm_bra_east_points_of_interest_points_kml.zip",
            "id": "3a8a9545-1344-428e-844c-62587b93b3e6",
            "last_modified": "2020-07-14T22:03:29.889841",
            "metadata_modified": "2024-01-26T03:22:03.055568",
            "microdata": false,
            "dataset_id": "70d91d5d-3369-466f-adef-df730df85fd4",
            "resource_type": "api",
            "name": "hotosm_bra_east_points_of_interest_points_kml.zip",
            "mimetype": null,
            "size": "0.0B"
        },
        {
            "created": "2019-01-28T08:55:11.117419",
            "description": "Google Earth .KML",
            "format": "KML",
            "download_url": "https://export.hotosm.org/downloads/0595bee7-2f3c-499b-ade9-50bd2886a922/hotosm_bra_east_points_of_interest_polygons_kml.zip",
            "id": "587624b3-284c-4f94-a304-768cd69b8bd3",
            "last_modified": "2020-07-14T22:03:29.889841",
            "metadata_modified": "2024-01-26T03:22:05.989005",
            "microdata": false,
            "dataset_id": "70d91d5d-3369-466f-adef-df730df85fd4",
            "resource_type": "api",
            "name": "hotosm_bra_east_points_of_interest_polygons_kml.zip",
            "mimetype": null,
            "size": "0.0B"
        },
        {
            "created": "2019-01-28T08:55:11.117425",
            "description": ".IMG for Garmin GPS Devices (All OSM layers for area)",
            "format": "Garmin IMG",
            "download_url": "https://export.hotosm.org/downloads/0595bee7-2f3c-499b-ade9-50bd2886a922/hotosm_bra_east_gmapsupp_img.zip",
            "id": "28e06395-7fcc-432e-8cff-e5fba3c21e55",
            "last_modified": "2020-06-14T22:02:20.059097",
            "metadata_modified": "2023-03-04T16:44:19.413246",
            "microdata": false,
            "dataset_id": "70d91d5d-3369-466f-adef-df730df85fd4",
            "resource_type": "api",
            "name": "hotosm_bra_east_gmapsupp_img.zip",
            "mimetype": null,
            "size": "0.0B"
        }
    ]
}