{
    "id": "8519dc2c-cdc6-4751-93bd-705503ea7e24",
    "title": "RMRP 2022",
    "name": "rmrp-2022",
    "notes": "Full dataset of the RMRP 2022, Activities, Partners, People in Need, Population projections 2022, target with full age gender breakdown, population type at Admin 1 level. Official R4V data page: https://www.r4v.info/en/data More info on the Activity Explorer https://bit.ly/activityexplorer2022 and RMRP Insight 2022 https://bit.ly/insight2022 ",
    "dataset_source": "Inter-Agency Coordination Platform for Refugees and Migrants from Venezuela",
    "organization": "Inter-Agency Coordination Platform for Refugees and Migrants from Venezuela",
    "dataset_date": "[2022-01-01T00:00:00 TO 2022-12-31T23:59:59]",
    "last_modified": "2023-05-05T23:45:56.027506",
    "data_update_frequency": "Never",
    "groups": [
        "Argentina",
        "Aruba",
        "Bolivia (Plurinational State of)",
        "Brazil",
        "Chile",
        "Colombia",
        "Costa Rica",
        "Cura\u00e7ao",
        "Dominican Republic",
        "Ecuador",
        "Guyana",
        "Mexico",
        "Panama",
        "Paraguay",
        "Peru",
        "Trinidad and Tobago",
        "Uruguay"
    ],
    "license_title": "Creative Commons Attribution International",
    "methodology": "Registry",
    "methodology_other": null,
    "caveats": " ",
    "tags": [
        "affected population",
        "demographics",
        "funding",
        "humanitarian response plan-hrp",
        "indicators",
        "migration",
        "needs assessment",
        "operational partners",
        "operational presence",
        "people in need-pin",
        "refugees"
    ],
    "resources": [
        {
            "created": "2023-05-05T23:36:51.094551",
            "description": "The consolidated report is a summary of the number of beneficiaries that have been reached by RMRP Activities during a given month, and until a given month. Beneficiaries refer to one of the 5 categories of population that are monitored by the RMRP: Refugees and migrants in Destination, Refugees and Migrants In Transit, Host Communities, Refugees and Migrants Pendulars and Colombian Returnees. The unit to report beneficiaries are persons, and in no case should services be reported (if this is the case, the reporting partner should have an internal formula to estimate the number of beneficiaries for each service). The activities that have to be considered at the moment of calculating the number of beneficiaries are those marked as PiN The figures reported in the consolidated templates can be split into two different categories that correspond to different units and interpretations of how many people we are reaching.  Monthly total: corresponds to the total number of people reached during the reported month, regardless of them already being beneficiaries during the previous month or not. A correct reading of the monthly total would be: \u201cin the month of April 2022, 54,961 people were reached by the Health sector, in X country\u201d. In the 5W format, Monthly total corresponds to the Total Monthly Beneficiaries column. As it measures the volume of attention during a given month, without consideration of previous ones, Monthly Total figures must not be summed over a period that covers several months.  Consolidated: corresponds to the number of beneficiaries, without double counting, reached by a given sector until the reported month. A correct reading of a figure in those columns would be \u201cUntil May, the Integration sector in X country reached 86,978 persons, with the following breakdown\u2026\u201d. To calculate these consolidated figures one uses the New Beneficiaries of the month column from the 5Ws format, as well as all the breakdown information. Since the figures are reported as a cumulative sum,  there is no need to make calculations between months.",
            "format": "XLSX",
            "download_url": "https://data.humdata.org/dataset/8519dc2c-cdc6-4751-93bd-705503ea7e24/resource/9faae6e2-9053-4223-8b95-d7d85566eb58/download/people-reached-rmrp-2022.xlsx",
            "id": "9faae6e2-9053-4223-8b95-d7d85566eb58",
            "last_modified": "2023-05-05T23:45:43.995152",
            "metadata_modified": "2023-05-05T23:47:40.769220",
            "microdata": false,
            "dataset_id": "8519dc2c-cdc6-4751-93bd-705503ea7e24",
            "resource_type": "file.upload",
            "name": "Consolidated Report on People Reached 2022",
            "mimetype": "application/vnd.openxmlformats-officedocument.spreadsheetml.sheet",
            "size": "2.4M"
        },
        {
            "created": "2023-05-05T23:37:02.000202",
            "description": "The RMRP establishes an integral response plan to the identified needs of refugees and migrants from Venezuela and their affected host communities in 17 countries of Latin America and the Caribbean. The objective of monitoring these activities is to ensure that transparent, regular updates in the status of implementation of the RMRP are given to governments, donors, RMRP partners, and beneficiary communities of host countries. To facilitate this process, in the planning stage of the RMRP, all the appealing organizations presented details on their planned activities for 2022, divided by sector and by platform, with specific indicators for each sector. These indicators will be used to measure the implementation progress of each activity throughout the year using the 5W system established in ActivityInfo. The RMRP monitoring is crucial to show how the who/what/when/where/to whom goals and objectives established in the RMRP are being achieved. Together with their partners, the national and subregional Coordination Platforms established sectoral objectives for the population groups that required assistance. The data about the number of services offered and about the number of people that receive these services, among other variables, allow every Coordination Platform to measure the implementation progress with respect to their goals and objectives; this also provides an accountability tool for governments and donors. At the same time, it will allow platforms to improve their interagency assistance by being able to coordinate activities, avoid the duplication of efforts and fill gaps in the assistance provided.  ",
            "format": "XLSX",
            "download_url": "https://data.humdata.org/dataset/8519dc2c-cdc6-4751-93bd-705503ea7e24/resource/57bcc8f3-0fbd-4f79-a2f3-8ac941060ab2/download/5w_-_rmrp_2022_final.xlsx",
            "id": "57bcc8f3-0fbd-4f79-a2f3-8ac941060ab2",
            "last_modified": "2023-05-05T23:45:56.027506",
            "metadata_modified": "2023-05-05T23:46:23.693578",
            "microdata": false,
            "dataset_id": "8519dc2c-cdc6-4751-93bd-705503ea7e24",
            "resource_type": "file.upload",
            "name": "5W Monitoring RMRP 2022",
            "mimetype": "application/vnd.openxmlformats-officedocument.spreadsheetml.sheet",
            "size": "8.9M"
        },
        {
            "created": "2021-11-30T16:40:12.816045",
            "description": "RMRP 2022 activities are submitted directly by the partners and then validated by the national sectors. The present database contains only the validated activities, that have then been used to calculate the different budget and total values for the RMRP 2022. More info can be foung on the Activity explorer at https://bit.ly/activityexplorer2022 ",
            "format": "XLSX",
            "download_url": "https://data.humdata.org/dataset/8519dc2c-cdc6-4751-93bd-705503ea7e24/resource/298b52fc-33a4-46b9-a952-77bbffb9bef1/download/activities-rmrp-2022.xlsx",
            "id": "298b52fc-33a4-46b9-a952-77bbffb9bef1",
            "last_modified": "2021-11-30T16:40:12.484331",
            "metadata_modified": "2022-09-23T16:56:56.700025",
            "microdata": false,
            "dataset_id": "8519dc2c-cdc6-4751-93bd-705503ea7e24",
            "resource_type": "file.upload",
            "name": "Activities RMRP 2022.xlsx",
            "mimetype": "application/vnd.openxmlformats-officedocument.spreadsheetml.sheet",
            "size": "2.4M"
        },
        {
            "created": "2021-11-30T16:54:07.255679",
            "description": "PiN are calculated by R4V national platforms in order to plan the R4V response, based on the Joint Needs Assesment and available information at national level.",
            "format": "XLSX",
            "download_url": "https://data.humdata.org/dataset/8519dc2c-cdc6-4751-93bd-705503ea7e24/resource/d697b23e-901e-443c-8de1-ba3c45eecc89/download/pin-rmrp-2022.xlsx",
            "id": "d697b23e-901e-443c-8de1-ba3c45eecc89",
            "last_modified": "2021-11-30T16:54:06.728088",
            "metadata_modified": "2022-09-23T16:56:56.700336",
            "microdata": false,
            "dataset_id": "8519dc2c-cdc6-4751-93bd-705503ea7e24",
            "resource_type": "file.upload",
            "name": "PiN - RMRP 2022.xlsx",
            "mimetype": "application/vnd.openxmlformats-officedocument.spreadsheetml.sheet",
            "size": "479.0K"
        },
        {
            "created": "2021-11-30T16:54:09.535265",
            "description": "Population projections calculated by R4V national platforms in order to plan the R4V response. The data used to calculate the projections are, as far as possible, provided by the official national statistics institutions. ",
            "format": "XLSX",
            "download_url": "https://data.humdata.org/dataset/8519dc2c-cdc6-4751-93bd-705503ea7e24/resource/d9955adf-6bec-4d5f-87e4-d4a778d5df7d/download/population-projections-rmrp-2022.xlsx",
            "id": "d9955adf-6bec-4d5f-87e4-d4a778d5df7d",
            "last_modified": "2021-11-30T16:54:08.892094",
            "metadata_modified": "2022-09-23T16:56:56.700586",
            "microdata": false,
            "dataset_id": "8519dc2c-cdc6-4751-93bd-705503ea7e24",
            "resource_type": "file.upload",
            "name": "Population Projections - RMRP 2022.xlsx",
            "mimetype": "application/vnd.openxmlformats-officedocument.spreadsheetml.sheet",
            "size": "124.7K"
        },
        {
            "created": "2021-11-30T16:54:11.937230",
            "description": "Target are calculated by R4V national platforms in order to plan the R4V response, based on the validated activities and the national aggregation model established in collaboration with national sectors",
            "format": "XLSX",
            "download_url": "https://data.humdata.org/dataset/8519dc2c-cdc6-4751-93bd-705503ea7e24/resource/8dd891b1-b390-4017-a113-e29f77523ca6/download/target-rmrp-2022.xlsx",
            "id": "8dd891b1-b390-4017-a113-e29f77523ca6",
            "last_modified": "2021-11-30T16:54:11.205705",
            "metadata_modified": "2022-09-23T16:56:56.700746",
            "microdata": false,
            "dataset_id": "8519dc2c-cdc6-4751-93bd-705503ea7e24",
            "resource_type": "file.upload",
            "name": "Target - RMRP 2022.xlsx",
            "mimetype": "application/vnd.openxmlformats-officedocument.spreadsheetml.sheet",
            "size": "396.4K"
        }
    ]
}