{
    "id": "e6bce73a-3a7a-4c68-a72e-fdd6eef79588",
    "title": "HOTOSM Brazil (East) Buildings (OpenStreetMap Export)",
    "name": "hotosm_bra_east_buildings",
    "notes": "OpenStreetMap exports for use in GIS applications. This theme includes all OpenStreetMap features in this area matching: building IS NOT NULL Features may have these attributes:  addr:city building:levels addr:housenumber addr:full building:materials addr:street source office name building  This dataset is one of many OpenStreetMap exports on HDX. See the Humanitarian OpenStreetMap Team website for more information.",
    "dataset_source": "OpenStreetMap contributors",
    "organization": "Humanitarian OpenStreetMap Team (HOT)",
    "dataset_date": "[2023-03-04T00:00:00 TO 2023-03-04T23:59:59]",
    "last_modified": "2020-07-14T22:03:29.889841",
    "data_update_frequency": "Every month",
    "groups": [
        "Brazil"
    ],
    "license_title": "Open Database License (ODC-ODbL)",
    "methodology": "Other",
    "methodology_other": "Volunteered geographic information",
    "caveats": "OpenStreetMap data is crowd sourced and cannot be considered to be exhaustive",
    "tags": [
        "facilities-infrastructure",
        "geodata"
    ],
    "resources": [
        {
            "created": "2019-01-28T08:55:12.807846",
            "description": "ESRI Shapefile",
            "format": "SHP",
            "download_url": "https://export.hotosm.org/downloads/0595bee7-2f3c-499b-ade9-50bd2886a922/hotosm_bra_east_buildings_polygons_shp.zip",
            "id": "e4e58515-30d2-46ca-b9bc-8e344977c696",
            "last_modified": "2020-07-14T22:03:29.889841",
            "metadata_modified": "2024-01-26T03:27:06.370090",
            "microdata": false,
            "dataset_id": "e6bce73a-3a7a-4c68-a72e-fdd6eef79588",
            "resource_type": "api",
            "name": "hotosm_bra_east_buildings_polygons_shp.zip",
            "mimetype": null,
            "size": "0.0B"
        },
        {
            "created": "2019-01-28T08:55:12.807867",
            "description": "Geopackage, SQLite compatible",
            "format": "Geopackage",
            "download_url": "https://export.hotosm.org/downloads/0595bee7-2f3c-499b-ade9-50bd2886a922/hotosm_bra_east_buildings_gpkg.zip",
            "id": "d3f1b867-a94c-428f-b2af-801152831a01",
            "last_modified": "2020-06-14T22:02:20.059097",
            "metadata_modified": "2023-03-04T16:44:05.122301",
            "microdata": false,
            "dataset_id": "e6bce73a-3a7a-4c68-a72e-fdd6eef79588",
            "resource_type": "api",
            "name": "hotosm_bra_east_buildings_gpkg.zip",
            "mimetype": null,
            "size": null
        },
        {
            "created": "2019-01-28T08:55:12.807875",
            "description": "Google Earth .KML",
            "format": "KML",
            "download_url": "https://export.hotosm.org/downloads/0595bee7-2f3c-499b-ade9-50bd2886a922/hotosm_bra_east_buildings_polygons_kml.zip",
            "id": "23ae8388-696e-4f7d-915b-54fce0c56fb7",
            "last_modified": "2020-06-14T22:02:20.059097",
            "metadata_modified": "2024-01-26T03:22:11.458316",
            "microdata": false,
            "dataset_id": "e6bce73a-3a7a-4c68-a72e-fdd6eef79588",
            "resource_type": "api",
            "name": "hotosm_bra_east_buildings_polygons_kml.zip",
            "mimetype": null,
            "size": "0.0B"
        },
        {
            "created": "2019-01-28T08:55:12.807887",
            "description": ".IMG for Garmin GPS Devices (All OSM layers for area)",
            "format": "Garmin IMG",
            "download_url": "https://export.hotosm.org/downloads/0595bee7-2f3c-499b-ade9-50bd2886a922/hotosm_bra_east_gmapsupp_img.zip",
            "id": "2b4efd8a-af6b-4753-9da0-d4fe0ce1c6a7",
            "last_modified": "2020-07-14T22:03:29.889841",
            "metadata_modified": "2023-03-04T16:44:05.122508",
            "microdata": false,
            "dataset_id": "e6bce73a-3a7a-4c68-a72e-fdd6eef79588",
            "resource_type": "api",
            "name": "hotosm_bra_east_gmapsupp_img.zip",
            "mimetype": null,
            "size": "0.0B"
        }
    ]
}