{
    "id": "cb7a73c0-b950-4122-a48a-98e18e63308d",
    "title": "Brazil - Births",
    "name": "worldpop-births-for-brazil",
    "notes": "The health and survival of women and their new-born babies in low income countries is a key public health priority, but basic and consistent subnational data on the number of live births to support decision making has been lacking. WorldPop integrates small area data on the distribution of women of childbearing age and age-specific fertility rates to map the estimated distributions of births for each 1x1km grid square across all low and middle income countries. Further details on the methods can be found in Tatem et al. and James et al.. Data for earlier dates is available directly from WorldPop.   WorldPop (www.worldpop.org - School of Geography and Environmental Science, University of Southampton). 2017. Brazil 1km births. Version 2.0 2015 estimates of numbers of live births per grid square, with national totals adjusted to match UN national estimates on numbers of live births (http://esa.un.org/wpp/).   DOI: 10.5258/SOTON/WP00384",
    "dataset_source": "WorldPop, University of Southampton, UK",
    "organization": "WorldPop",
    "dataset_date": "[2017-01-01T00:00:00 TO 2017-12-31T23:59:59]",
    "last_modified": "2017-05-05T00:00:00",
    "data_update_frequency": "Every year",
    "groups": [
        "Brazil"
    ],
    "license_title": "Other",
    "methodology": "Other",
    "methodology_other": "Dataset details: Brazil 1km births______________________________________________DATASET: Version 2.0 2015 estimates of numbers of live births per grid square, with national totals adjusted to match UN national estimates on numbers of live births (http://esa.un.org/wpp/).  REGION: Latin America and the CaribbeanSPATIAL RESOLUTION: 0.00833333 decimal degrees (approx 1km at the equator)PROJECTION: Geographic, WGS84UNITS: Estimated births per grid squareMAPPING APPROACH: Integration of multiple data sources on population distribution, age structure and fertility rates to produce high-resolution maps detailing the number and distribution of live births.FORMAT: Geotiff (zipped using 7-zip (open access tool): www.7-zip.org)FILENAMES: Example - ARG_births_pp_v2_2015.tif = Argentina (ARG, three-letter country code adhering to ISO 3166 standard) births per pixel (births_pp) version 2 (v2) based on data for circa 2015.",
    "caveats": null,
    "tags": [
        "births",
        "geodata"
    ],
    "resources": [
        {
            "created": "2020-06-29T05:35:38.182586",
            "description": "Brazil 1km births in 2017",
            "format": "GeoTIFF",
            "download_url": "https://data.worldpop.org/GIS/Births/Individual_countries/BRA/Brazil_1km_births.7z",
            "id": "a5a3055a-1194-4843-8ef3-49b63984de98",
            "last_modified": "2017-05-05T00:00:00",
            "metadata_modified": "2023-08-03T00:12:27.530630",
            "microdata": false,
            "dataset_id": "cb7a73c0-b950-4122-a48a-98e18e63308d",
            "resource_type": "api",
            "name": "Brazil_1km_births_2017.7z",
            "mimetype": null,
            "size": null
        }
    ]
}