{
    "id": "2b426706-90ae-4472-bbd7-5f54908bbbb4",
    "title": "Brazil - High Frequency Survey - Q1Q2 2021",
    "name": "unhcr-bra-2021-hfs-q1q2-v2-1",
    "notes": "The data was collected using the High Frequency Survey (HFS), the new regional data collection tool &amp; methodology launched in the Americas. The survey allowed for better reaching populations of interest with new remote modalities (phone interviews and self-administered surveys online) and improved sampling guidance and strategies. It includes a set of standardized regional core questions while allowing for operation-specific customizations. The core questions revolve around populations of interest's demographic profile, difficulties during their journey, specific protection needs, access to documentation &amp; regularization, health access, coverage of basic needs, coping capacity &amp; negative mechanisms used, and well-being &amp; local integration. The data collected has been used by countries in their protection monitoring analysis and vulnerability analysis.",
    "dataset_source": "UNHCR",
    "organization": "UNHCR - The UN Refugee Agency",
    "dataset_date": "[2021-01-01T00:00:00 TO 2021-06-30T23:59:59]",
    "last_modified": "2021-10-11T00:00:00",
    "data_update_frequency": "Never",
    "groups": [
        "Brazil"
    ],
    "license_title": "Other",
    "methodology": "Other",
    "methodology_other": "Kind of Data:   \nUnit of Analysis: All people of concern.  \nSampling Procedure: In the absence of a well-developed sampling-frame for forcibly displaced populations in the Americas, the High Frequency Survey employed a multi-frame sampling strategy where respondents entered the sample through one of three channels: (i) those who opt-in to complete an online self-administered version of the questionnaire which was widely circulated through refugee social media; (ii) persons identified through UNHCR and partner databases who were remotely-interviewed by phone; and (iii) random selection from the cases approaching UNHCR for registration or assistance. The total sample size was 669 households.  \nData Collection Mode: Other [oth]  \n",
    "caveats": "The data must be requested via the resource download link",
    "tags": [
        "covid-19",
        "health",
        "livelihoods",
        "needs assessment",
        "protection",
        "transportation"
    ],
    "resources": [
        {
            "created": "2021-10-11T17:32:16.689772",
            "description": "Clicking \"Download\" leads outside HDX where you can request access to the data in csv, xlsx &amp; dta formats",
            "format": "Web App",
            "download_url": "https://microdata.unhcr.org/index.php/auth/login/?destination=catalog/496/get-microdata",
            "id": "8a371635-4b13-4037-8401-ee941121b68e",
            "last_modified": "2021-10-11T00:00:00",
            "metadata_modified": "2023-07-30T01:56:59.572969",
            "microdata": false,
            "dataset_id": "2b426706-90ae-4472-bbd7-5f54908bbbb4",
            "resource_type": "api",
            "name": "Brazil - High Frequency Survey - Q1Q2 2021",
            "mimetype": null,
            "size": null
        },
        {
            "created": "2021-10-11T17:32:16.689777",
            "description": "Contains information about the dataset's metadata and data",
            "format": "PDF",
            "download_url": "https://microdata.unhcr.org/index.php/catalog/496/pdf-documentation",
            "id": "150695c8-a625-4641-b6cf-dc862a75161c",
            "last_modified": "2021-10-11T00:00:00",
            "metadata_modified": "2023-07-30T01:56:59.573197",
            "microdata": false,
            "dataset_id": "2b426706-90ae-4472-bbd7-5f54908bbbb4",
            "resource_type": "api",
            "name": "Codebook",
            "mimetype": null,
            "size": null
        }
    ]
}