{
    "id": "95600c55-929f-46aa-b066-a956016a2005",
    "title": "HOTOSM Brazil (West) Health Facilities (OpenStreetMap Export)",
    "name": "hotosm_bra_west_health_facilities",
    "notes": "OpenStreetMap exports for use in GIS applications. This theme includes all OpenStreetMap features in this area matching: healthcare IS NOT NULL OR amenity IN ('doctors','dentist','clinic','hospital','pharmacy') Features may have these attributes:  capacity:persons name healthcare addr:full healthcare:speciality source operator:type amenity addr:city building  This dataset is one of many OpenStreetMap exports on HDX. See the Humanitarian OpenStreetMap Team website for more information.",
    "dataset_source": "OpenStreetMap contributors",
    "organization": "Humanitarian OpenStreetMap Team (HOT)",
    "dataset_date": "[2023-03-07T00:00:00 TO 2023-03-07T23:59:59]",
    "last_modified": "2020-06-11T22:02:38.083962",
    "data_update_frequency": "Every month",
    "groups": [
        "Brazil"
    ],
    "license_title": "Open Database License (ODC-ODbL)",
    "methodology": "Other",
    "methodology_other": "Volunteered geographic information",
    "caveats": "OpenStreetMap data is crowd sourced and cannot be considered to be exhaustive",
    "tags": [
        "geodata",
        "health",
        "health facilities"
    ],
    "resources": [
        {
            "created": "2019-12-07T02:23:36.989676",
            "description": "ESRI Shapefile",
            "format": "SHP",
            "download_url": "https://export.hotosm.org/downloads/344201fa-8532-4aee-bc43-6667f7f89efa/hotosm_bra_west_health_facilities_points_shp.zip",
            "id": "14ae0551-6339-41cd-9466-20a06bbd52e6",
            "last_modified": "2020-06-11T22:02:38.083962",
            "metadata_modified": "2024-01-26T05:49:22.535336",
            "microdata": false,
            "dataset_id": "95600c55-929f-46aa-b066-a956016a2005",
            "resource_type": "api",
            "name": "hotosm_bra_west_health_facilities_points_shp.zip",
            "mimetype": null,
            "size": "0.0B"
        },
        {
            "created": "2019-12-07T02:23:36.989688",
            "description": "ESRI Shapefile",
            "format": "SHP",
            "download_url": "https://export.hotosm.org/downloads/344201fa-8532-4aee-bc43-6667f7f89efa/hotosm_bra_west_health_facilities_polygons_shp.zip",
            "id": "81d6d95f-8440-44a9-8d3b-7258a6ac5294",
            "last_modified": "2020-06-11T22:02:38.083962",
            "metadata_modified": "2024-01-26T05:49:26.820016",
            "microdata": false,
            "dataset_id": "95600c55-929f-46aa-b066-a956016a2005",
            "resource_type": "api",
            "name": "hotosm_bra_west_health_facilities_polygons_shp.zip",
            "mimetype": null,
            "size": "0.0B"
        },
        {
            "created": "2019-12-07T02:23:36.989693",
            "description": "Geopackage, SQLite compatible",
            "format": "Geopackage",
            "download_url": "https://export.hotosm.org/downloads/344201fa-8532-4aee-bc43-6667f7f89efa/hotosm_bra_west_health_facilities_gpkg.zip",
            "id": "d02c4a1c-5206-44b0-b0f4-4bab10dbe428",
            "last_modified": "2020-06-11T22:02:38.083962",
            "metadata_modified": "2023-03-07T01:37:01.177982",
            "microdata": false,
            "dataset_id": "95600c55-929f-46aa-b066-a956016a2005",
            "resource_type": "api",
            "name": "hotosm_bra_west_health_facilities_gpkg.zip",
            "mimetype": null,
            "size": null
        },
        {
            "created": "2019-12-07T02:23:36.989697",
            "description": "Google Earth .KML",
            "format": "KML",
            "download_url": "https://export.hotosm.org/downloads/344201fa-8532-4aee-bc43-6667f7f89efa/hotosm_bra_west_health_facilities_points_kml.zip",
            "id": "800d10e0-4cbd-4dbb-857c-7ebf2fc68b7e",
            "last_modified": "2020-06-11T22:02:38.083962",
            "metadata_modified": "2024-01-26T05:49:24.781349",
            "microdata": false,
            "dataset_id": "95600c55-929f-46aa-b066-a956016a2005",
            "resource_type": "api",
            "name": "hotosm_bra_west_health_facilities_points_kml.zip",
            "mimetype": null,
            "size": "0.0B"
        },
        {
            "created": "2019-12-07T02:23:36.989701",
            "description": "Google Earth .KML",
            "format": "KML",
            "download_url": "https://export.hotosm.org/downloads/344201fa-8532-4aee-bc43-6667f7f89efa/hotosm_bra_west_health_facilities_polygons_kml.zip",
            "id": "e7dc2adc-8be3-4bff-9f49-d5d06d4b033d",
            "last_modified": "2020-06-11T22:02:38.083962",
            "metadata_modified": "2024-01-26T05:49:25.795845",
            "microdata": false,
            "dataset_id": "95600c55-929f-46aa-b066-a956016a2005",
            "resource_type": "api",
            "name": "hotosm_bra_west_health_facilities_polygons_kml.zip",
            "mimetype": null,
            "size": "0.0B"
        },
        {
            "created": "2019-12-07T02:23:36.989705",
            "description": ".IMG for Garmin GPS Devices (All OSM layers for area)",
            "format": "Garmin IMG",
            "download_url": "http://export.hotosm.org/downloads/864862e1-cb7e-4b43-a65f-cb31335bb8db/hotosm_bra_west_gmapsupp_img.zip",
            "id": "e171a044-a581-44fc-8672-3126803e1575",
            "last_modified": "2020-06-11T22:02:38.083962",
            "metadata_modified": "2021-08-09T05:56:06.745707",
            "microdata": false,
            "dataset_id": "95600c55-929f-46aa-b066-a956016a2005",
            "resource_type": "api",
            "name": "hotosm_bra_west_gmapsupp_img.zip",
            "mimetype": null,
            "size": "0.0B"
        }
    ]
}