{
    "id": "85c2866a-5581-497f-b48d-dcd0de949ab6",
    "title": "HOTOSM Brazil (North) Airports (OpenStreetMap Export)",
    "name": "hotosm_bra_north_airports",
    "notes": "OpenStreetMap exports for use in GIS applications. This theme includes all OpenStreetMap features in this area matching: aeroway IS NOT NULL OR building = 'aerodrome' OR emergency:helipad IS NOT NULL OR emergency = 'landing_site' Features may have these attributes:  capacity:persons name emergency:helipad addr:full emergency source operator:type addr:city building aeroway  This dataset is one of many OpenStreetMap exports on HDX. See the Humanitarian OpenStreetMap Team website for more information.",
    "dataset_source": "OpenStreetMap contributors",
    "organization": "Humanitarian OpenStreetMap Team (HOT)",
    "dataset_date": "[2023-03-07T00:00:00 TO 2023-03-07T23:59:59]",
    "last_modified": "2020-06-10T22:01:52.425613",
    "data_update_frequency": "Every month",
    "groups": [
        "Brazil"
    ],
    "license_title": "Open Database License (ODC-ODbL)",
    "methodology": "Other",
    "methodology_other": "Volunteered geographic information",
    "caveats": "OpenStreetMap data is crowd sourced and cannot be considered to be exhaustive",
    "tags": [
        "aviation",
        "facilities-infrastructure",
        "geodata",
        "transportation"
    ],
    "resources": [
        {
            "created": "2019-12-07T00:40:32.083034",
            "description": "ESRI Shapefile",
            "format": "SHP",
            "download_url": "https://export.hotosm.org/downloads/e5c67b43-9def-4dda-a17e-893d326d5549/hotosm_bra_north_airports_points_shp.zip",
            "id": "2773377c-7329-4f9f-81b7-31c7c2347bd9",
            "last_modified": "2020-06-10T22:01:52.425613",
            "metadata_modified": "2024-01-26T05:46:10.682758",
            "microdata": false,
            "dataset_id": "85c2866a-5581-497f-b48d-dcd0de949ab6",
            "resource_type": "api",
            "name": "hotosm_bra_north_airports_points_shp.zip",
            "mimetype": null,
            "size": "0.0B"
        },
        {
            "created": "2019-12-07T00:40:32.083045",
            "description": "ESRI Shapefile",
            "format": "SHP",
            "download_url": "https://export.hotosm.org/downloads/e5c67b43-9def-4dda-a17e-893d326d5549/hotosm_bra_north_airports_lines_shp.zip",
            "id": "8af8d9f8-9138-4e88-b025-e70f50c5a86a",
            "last_modified": "2020-06-10T22:01:52.425613",
            "metadata_modified": "2024-01-26T05:46:16.157446",
            "microdata": false,
            "dataset_id": "85c2866a-5581-497f-b48d-dcd0de949ab6",
            "resource_type": "api",
            "name": "hotosm_bra_north_airports_lines_shp.zip",
            "mimetype": null,
            "size": "0.0B"
        },
        {
            "created": "2019-12-07T00:40:32.083051",
            "description": "ESRI Shapefile",
            "format": "SHP",
            "download_url": "https://export.hotosm.org/downloads/e5c67b43-9def-4dda-a17e-893d326d5549/hotosm_bra_north_airports_polygons_shp.zip",
            "id": "73e892c6-8624-485d-811a-c77af56d0ee8",
            "last_modified": "2020-06-10T22:01:52.425613",
            "metadata_modified": "2024-01-26T05:46:12.446451",
            "microdata": false,
            "dataset_id": "85c2866a-5581-497f-b48d-dcd0de949ab6",
            "resource_type": "api",
            "name": "hotosm_bra_north_airports_polygons_shp.zip",
            "mimetype": null,
            "size": "0.0B"
        },
        {
            "created": "2019-12-07T00:40:32.083055",
            "description": "Geopackage, SQLite compatible",
            "format": "Geopackage",
            "download_url": "https://export.hotosm.org/downloads/e5c67b43-9def-4dda-a17e-893d326d5549/hotosm_bra_north_airports_gpkg.zip",
            "id": "24ec9fd4-3a88-45ca-9576-c9c25c5f3cfc",
            "last_modified": "2020-06-10T22:01:52.425613",
            "metadata_modified": "2023-03-07T01:01:48.551188",
            "microdata": false,
            "dataset_id": "85c2866a-5581-497f-b48d-dcd0de949ab6",
            "resource_type": "api",
            "name": "hotosm_bra_north_airports_gpkg.zip",
            "mimetype": null,
            "size": null
        },
        {
            "created": "2019-12-07T00:40:32.083059",
            "description": "Google Earth .KML",
            "format": "KML",
            "download_url": "https://export.hotosm.org/downloads/e5c67b43-9def-4dda-a17e-893d326d5549/hotosm_bra_north_airports_points_kml.zip",
            "id": "529dc462-4561-4620-8b23-e358cc144ccd",
            "last_modified": "2020-06-10T22:01:52.425613",
            "metadata_modified": "2024-01-26T05:46:13.460987",
            "microdata": false,
            "dataset_id": "85c2866a-5581-497f-b48d-dcd0de949ab6",
            "resource_type": "api",
            "name": "hotosm_bra_north_airports_points_kml.zip",
            "mimetype": null,
            "size": "0.0B"
        },
        {
            "created": "2019-12-07T00:40:32.083063",
            "description": "Google Earth .KML",
            "format": "KML",
            "download_url": "https://export.hotosm.org/downloads/e5c67b43-9def-4dda-a17e-893d326d5549/hotosm_bra_north_airports_lines_kml.zip",
            "id": "a9a7e8d9-f67c-495c-966b-a5efc27c77cc",
            "last_modified": "2020-06-10T22:01:52.425613",
            "metadata_modified": "2024-01-26T05:46:14.720234",
            "microdata": false,
            "dataset_id": "85c2866a-5581-497f-b48d-dcd0de949ab6",
            "resource_type": "api",
            "name": "hotosm_bra_north_airports_lines_kml.zip",
            "mimetype": null,
            "size": "0.0B"
        },
        {
            "created": "2019-12-07T00:40:32.083067",
            "description": "Google Earth .KML",
            "format": "KML",
            "download_url": "https://export.hotosm.org/downloads/e5c67b43-9def-4dda-a17e-893d326d5549/hotosm_bra_north_airports_polygons_kml.zip",
            "id": "3be1c9d8-71d6-489c-a27d-e18356153a26",
            "last_modified": "2020-06-10T22:01:52.425613",
            "metadata_modified": "2024-01-26T05:46:17.801148",
            "microdata": false,
            "dataset_id": "85c2866a-5581-497f-b48d-dcd0de949ab6",
            "resource_type": "api",
            "name": "hotosm_bra_north_airports_polygons_kml.zip",
            "mimetype": null,
            "size": "0.0B"
        },
        {
            "created": "2019-12-07T00:40:32.083071",
            "description": ".IMG for Garmin GPS Devices (All OSM layers for area)",
            "format": "Garmin IMG",
            "download_url": "http://export.hotosm.org/downloads/2d77cd1e-f254-411e-aa01-48d3e803c3ea/hotosm_bra_north_gmapsupp_img.zip",
            "id": "a156f374-9170-4d4f-88d8-3c21467b37ff",
            "last_modified": "2020-06-10T22:01:52.425613",
            "metadata_modified": "2021-08-09T07:23:39.366717",
            "microdata": false,
            "dataset_id": "85c2866a-5581-497f-b48d-dcd0de949ab6",
            "resource_type": "api",
            "name": "hotosm_bra_north_gmapsupp_img.zip",
            "mimetype": null,
            "size": "0.0B"
        }
    ]
}