{
    "id": "69145991-9fd8-4d45-ad88-d05797153ce2",
    "title": "Brazil Health Facilities (OpenStreetMap Export)",
    "name": "hotosm_bra_health_facilities",
    "notes": "OpenStreetMap exports for use in GIS applications. This theme includes all OpenStreetMap features in this area matching ( Learn what tags means here ) : tags['healthcare'] IS NOT NULL OR tags['amenity'] IN ('doctors', 'dentist', 'clinic', 'hospital', 'pharmacy') Features may have these attributes:  name name:en amenity building healthcare healthcare:speciality operator:type capacity:persons addr:full addr:city source name:pt  This dataset is one of many OpenStreetMap exports on HDX. See the Humanitarian OpenStreetMap Team website for more information.",
    "dataset_source": "OpenStreetMap contributors",
    "organization": "Humanitarian OpenStreetMap Team (HOT)",
    "dataset_date": "[2024-04-05T00:00:00 TO 2024-04-05T23:59:59]",
    "last_modified": "2024-04-05T15:57:14.288087",
    "data_update_frequency": "Every month",
    "groups": [
        "Brazil"
    ],
    "license_title": "Open Database License (ODC-ODbL)",
    "methodology": "Other",
    "methodology_other": "Volunteered geographic information",
    "caveats": "OpenStreetMap data is crowd sourced and cannot be considered to be exhaustive",
    "tags": [
        "geodata",
        "health",
        "health facilities"
    ],
    "resources": [
        {
            "created": "2024-04-05T15:57:14.303297",
            "description": "ESRI Shapefile",
            "format": "SHP",
            "download_url": "https://s3.dualstack.us-east-1.amazonaws.com/production-raw-data-api/ISO3/BRA/health_facilities/points/hotosm_bra_health_facilities_points_shp.zip",
            "id": "39c931fe-4da2-4437-b66d-6f5561e5a141",
            "last_modified": "2024-04-05T15:57:14.287180",
            "metadata_modified": "2024-04-05T15:57:32.580929",
            "microdata": false,
            "dataset_id": "69145991-9fd8-4d45-ad88-d05797153ce2",
            "resource_type": "api",
            "name": "hotosm_bra_health_facilities_points_shp.zip",
            "mimetype": null,
            "size": "995.2K"
        },
        {
            "created": "2024-04-05T15:57:14.303303",
            "description": "KML",
            "format": "KML",
            "download_url": "https://s3.dualstack.us-east-1.amazonaws.com/production-raw-data-api/ISO3/BRA/health_facilities/points/hotosm_bra_health_facilities_points_kml.zip",
            "id": "30e0cddf-6312-4c1d-9f1b-950d6ba23fee",
            "last_modified": "2024-04-05T15:57:14.287347",
            "metadata_modified": "2024-04-05T15:57:18.051011",
            "microdata": false,
            "dataset_id": "69145991-9fd8-4d45-ad88-d05797153ce2",
            "resource_type": "api",
            "name": "hotosm_bra_health_facilities_points_kml.zip",
            "mimetype": null,
            "size": "680.0K"
        },
        {
            "created": "2024-04-05T15:57:14.303306",
            "description": "GeoJSON",
            "format": "GeoJSON",
            "download_url": "https://s3.dualstack.us-east-1.amazonaws.com/production-raw-data-api/ISO3/BRA/health_facilities/points/hotosm_bra_health_facilities_points_geojson.zip",
            "id": "bcb9c544-98b3-4097-8aea-be17bf6c03fa",
            "last_modified": "2024-04-05T15:57:14.287474",
            "metadata_modified": "2024-04-05T15:57:37.914285",
            "microdata": false,
            "dataset_id": "69145991-9fd8-4d45-ad88-d05797153ce2",
            "resource_type": "api",
            "name": "hotosm_bra_health_facilities_points_geojson.zip",
            "mimetype": null,
            "size": "683.0K"
        },
        {
            "created": "2024-04-05T15:57:14.303309",
            "description": "GPKG",
            "format": "Geopackage",
            "download_url": "https://s3.dualstack.us-east-1.amazonaws.com/production-raw-data-api/ISO3/BRA/health_facilities/points/hotosm_bra_health_facilities_points_gpkg.zip",
            "id": "623dcbe6-2709-4e87-9bcd-9eced9a5bfb4",
            "last_modified": "2024-04-05T15:57:14.287596",
            "metadata_modified": "2024-04-05T15:57:18.051324",
            "microdata": false,
            "dataset_id": "69145991-9fd8-4d45-ad88-d05797153ce2",
            "resource_type": "api",
            "name": "hotosm_bra_health_facilities_points_gpkg.zip",
            "mimetype": null,
            "size": "800.5K"
        },
        {
            "created": "2024-04-05T15:57:14.303312",
            "description": "ESRI Shapefile",
            "format": "SHP",
            "download_url": "https://s3.dualstack.us-east-1.amazonaws.com/production-raw-data-api/ISO3/BRA/health_facilities/polygons/hotosm_bra_health_facilities_polygons_shp.zip",
            "id": "5651ea8c-e66e-4ac8-8eb4-d97884cd527d",
            "last_modified": "2024-04-05T15:57:14.287732",
            "metadata_modified": "2024-04-05T15:57:56.409832",
            "microdata": false,
            "dataset_id": "69145991-9fd8-4d45-ad88-d05797153ce2",
            "resource_type": "api",
            "name": "hotosm_bra_health_facilities_polygons_shp.zip",
            "mimetype": null,
            "size": "2.3M"
        },
        {
            "created": "2024-04-05T15:57:14.303316",
            "description": "KML",
            "format": "KML",
            "download_url": "https://s3.dualstack.us-east-1.amazonaws.com/production-raw-data-api/ISO3/BRA/health_facilities/polygons/hotosm_bra_health_facilities_polygons_kml.zip",
            "id": "7b13e3d1-5413-4c43-adef-a13d0e4205d5",
            "last_modified": "2024-04-05T15:57:14.287853",
            "metadata_modified": "2024-04-05T15:57:20.025059",
            "microdata": false,
            "dataset_id": "69145991-9fd8-4d45-ad88-d05797153ce2",
            "resource_type": "api",
            "name": "hotosm_bra_health_facilities_polygons_kml.zip",
            "mimetype": null,
            "size": "1.5M"
        },
        {
            "created": "2024-04-05T15:57:14.303319",
            "description": "GeoJSON",
            "format": "GeoJSON",
            "download_url": "https://s3.dualstack.us-east-1.amazonaws.com/production-raw-data-api/ISO3/BRA/health_facilities/polygons/hotosm_bra_health_facilities_polygons_geojson.zip",
            "id": "61fb2693-033e-4cae-ab34-054cc6eda371",
            "last_modified": "2024-04-05T15:57:14.287971",
            "metadata_modified": "2024-04-05T15:57:30.582638",
            "microdata": false,
            "dataset_id": "69145991-9fd8-4d45-ad88-d05797153ce2",
            "resource_type": "api",
            "name": "hotosm_bra_health_facilities_polygons_geojson.zip",
            "mimetype": null,
            "size": "1.5M"
        },
        {
            "created": "2024-04-05T15:57:14.303322",
            "description": "GPKG",
            "format": "Geopackage",
            "download_url": "https://s3.dualstack.us-east-1.amazonaws.com/production-raw-data-api/ISO3/BRA/health_facilities/polygons/hotosm_bra_health_facilities_polygons_gpkg.zip",
            "id": "4cba436c-4162-4d6a-8bd7-652b28d2c6c4",
            "last_modified": "2024-04-05T15:57:14.288087",
            "metadata_modified": "2024-04-05T15:57:18.051912",
            "microdata": false,
            "dataset_id": "69145991-9fd8-4d45-ad88-d05797153ce2",
            "resource_type": "api",
            "name": "hotosm_bra_health_facilities_polygons_gpkg.zip",
            "mimetype": null,
            "size": "2.3M"
        }
    ]
}