{
    "id": "b44f736b-9be3-4044-9203-5c41a76fda31",
    "title": "Brazil: Tourist attractions in Ouro Preto",
    "name": "brazil-tourist-attractions-in-ouro-preto",
    "notes": "Through the tripadvisor platform, information about establishments of tourist attractions until 2021 for the city of Ouro Preto was obtained.",
    "dataset_source": "Instituto de Geografia \u2013 USFQ and U.S Department of State",
    "organization": "Hub Latin America",
    "dataset_date": "[2018-01-01T00:00:00 TO 2021-06-14T23:59:59]",
    "last_modified": "2021-10-10T05:01:51.495319",
    "data_update_frequency": "Every year",
    "groups": [
        "Brazil"
    ],
    "license_title": "Creative Commons Attribution Share-Alike",
    "methodology": "Registry",
    "methodology_other": null,
    "caveats": "Created by TripAdvisor",
    "tags": [
        "transportation"
    ],
    "resources": [
        {
            "created": "2021-10-10T05:01:51.705075",
            "description": "Attractions establishments dedicated to tourism in the city of Ouro Preto",
            "format": "SHP",
            "download_url": "https://data.humdata.org/dataset/b44f736b-9be3-4044-9203-5c41a76fda31/resource/8e85802f-c149-4ff8-9721-c0d94296b6ac/download/p_attractions_ouropreto.zip",
            "id": "8e85802f-c149-4ff8-9721-c0d94296b6ac",
            "last_modified": "2021-10-10T05:01:51.495319",
            "metadata_modified": "2023-03-03T03:55:23.535778",
            "microdata": false,
            "dataset_id": "b44f736b-9be3-4044-9203-5c41a76fda31",
            "resource_type": "file.upload",
            "name": "P_Attractions_OuroPreto.zip",
            "mimetype": "application/x-zip-compressed",
            "size": "12.7K"
        }
    ]
}