{
    "id": "fcce64f7-77ee-463a-8827-4fe0b9cf6e4a",
    "title": "HOTOSM Brazil (North) Points of Interest (OpenStreetMap Export)",
    "name": "hotosm_bra_north_points_of_interest",
    "notes": "OpenStreetMap exports for use in GIS applications. This theme includes all OpenStreetMap features in this area matching: amenity IS NOT NULL OR man_made IS NOT NULL OR shop IS NOT NULL OR tourism IS NOT NULL Features may have these attributes:  name shop addr:full source opening_hours amenity rooms addr:city addr:housenumber beds addr:street tourism man_made  This dataset is one of many OpenStreetMap exports on HDX. See the Humanitarian OpenStreetMap Team website for more information.",
    "dataset_source": "OpenStreetMap contributors",
    "organization": "Humanitarian OpenStreetMap Team (HOT)",
    "dataset_date": "[2023-03-07T00:00:00 TO 2023-03-07T23:59:59]",
    "last_modified": "2020-07-05T08:20:57",
    "data_update_frequency": "Every month",
    "groups": [
        "Brazil"
    ],
    "license_title": "Open Database License (ODC-ODbL)",
    "methodology": "Other",
    "methodology_other": "Volunteered geographic information",
    "caveats": "OpenStreetMap data is crowd sourced and cannot be considered to be exhaustive",
    "tags": [
        "facilities-infrastructure",
        "geodata",
        "points of interest-poi"
    ],
    "resources": [
        {
            "created": "2019-01-28T03:26:15.016991",
            "description": "ESRI Shapefile",
            "format": "SHP",
            "download_url": "https://export.hotosm.org/downloads/e5c67b43-9def-4dda-a17e-893d326d5549/hotosm_bra_north_points_of_interest_points_shp.zip",
            "id": "442ae8d6-eab0-46f1-bf6c-c8ae34dd7b3b",
            "last_modified": "2020-07-05T08:11:26",
            "metadata_modified": "2024-01-26T03:17:21.601362",
            "microdata": false,
            "dataset_id": "fcce64f7-77ee-463a-8827-4fe0b9cf6e4a",
            "resource_type": "api",
            "name": "hotosm_bra_north_points_of_interest_points_shp.zip",
            "mimetype": null,
            "size": "0.0B"
        },
        {
            "created": "2019-01-28T03:26:15.017002",
            "description": "ESRI Shapefile",
            "format": "SHP",
            "download_url": "https://export.hotosm.org/downloads/e5c67b43-9def-4dda-a17e-893d326d5549/hotosm_bra_north_points_of_interest_polygons_shp.zip",
            "id": "261cf97d-725a-411d-84f4-bc5a2177302a",
            "last_modified": "2020-07-05T08:11:27",
            "metadata_modified": "2024-01-26T03:16:51.006520",
            "microdata": false,
            "dataset_id": "fcce64f7-77ee-463a-8827-4fe0b9cf6e4a",
            "resource_type": "api",
            "name": "hotosm_bra_north_points_of_interest_polygons_shp.zip",
            "mimetype": null,
            "size": "0.0B"
        },
        {
            "created": "2019-01-28T03:26:15.017007",
            "description": "Geopackage, SQLite compatible",
            "format": "Geopackage",
            "download_url": "https://export.hotosm.org/downloads/e5c67b43-9def-4dda-a17e-893d326d5549/hotosm_bra_north_points_of_interest_gpkg.zip",
            "id": "9de9a1a7-10a7-4835-906f-968de593ccab",
            "last_modified": "2020-07-05T08:10:26",
            "metadata_modified": "2023-03-07T01:01:41.614745",
            "microdata": false,
            "dataset_id": "fcce64f7-77ee-463a-8827-4fe0b9cf6e4a",
            "resource_type": "api",
            "name": "hotosm_bra_north_points_of_interest_gpkg.zip",
            "mimetype": null,
            "size": null
        },
        {
            "created": "2019-01-28T03:26:15.017011",
            "description": "Google Earth .KML",
            "format": "KML",
            "download_url": "https://export.hotosm.org/downloads/e5c67b43-9def-4dda-a17e-893d326d5549/hotosm_bra_north_points_of_interest_points_kml.zip",
            "id": "f698ee16-2e4c-4c06-b935-c1404c70c6ed",
            "last_modified": "2020-07-05T08:12:28",
            "metadata_modified": "2024-01-26T03:16:55.138818",
            "microdata": false,
            "dataset_id": "fcce64f7-77ee-463a-8827-4fe0b9cf6e4a",
            "resource_type": "api",
            "name": "hotosm_bra_north_points_of_interest_points_kml.zip",
            "mimetype": null,
            "size": "0.0B"
        },
        {
            "created": "2019-01-28T03:26:15.017015",
            "description": "Google Earth .KML",
            "format": "KML",
            "download_url": "https://export.hotosm.org/downloads/e5c67b43-9def-4dda-a17e-893d326d5549/hotosm_bra_north_points_of_interest_polygons_kml.zip",
            "id": "a18febaf-d3a1-4503-8ef0-0718d6503754",
            "last_modified": "2020-07-05T08:12:28",
            "metadata_modified": "2024-01-26T03:16:58.329648",
            "microdata": false,
            "dataset_id": "fcce64f7-77ee-463a-8827-4fe0b9cf6e4a",
            "resource_type": "api",
            "name": "hotosm_bra_north_points_of_interest_polygons_kml.zip",
            "mimetype": null,
            "size": "0.0B"
        },
        {
            "created": "2019-01-28T03:26:15.017019",
            "description": ".IMG for Garmin GPS Devices (All OSM layers for area)",
            "format": "Garmin IMG",
            "download_url": "http://export.hotosm.org/downloads/2d77cd1e-f254-411e-aa01-48d3e803c3ea/hotosm_bra_north_gmapsupp_img.zip",
            "id": "7372264d-97bb-4f94-8058-a39a6eaade46",
            "last_modified": "2020-07-05T08:20:57",
            "metadata_modified": "2021-08-08T22:30:09.115666",
            "microdata": false,
            "dataset_id": "fcce64f7-77ee-463a-8827-4fe0b9cf6e4a",
            "resource_type": "api",
            "name": "hotosm_bra_north_gmapsupp_img.zip",
            "mimetype": null,
            "size": "0.0B"
        }
    ]
}