{
    "id": "c17003d1-47f4-4ec5-8229-2f77aeb114be",
    "title": "Brazil: High Resolution Population Density Maps + Demographic Estimates",
    "name": "brazil-high-resolution-population-density-maps-demographic-estimates",
    "notes": "The world's most accurate population datasets. Seven maps/datasets for the distribution of various populations in Brazil: (1) Overall population density (2) Women (3) Men (4) Children (ages 0-5) (5) Youth (ages 15-24) (6) Elderly (ages 60+) (7) Women of reproductive age (ages 15-49).",
    "dataset_source": "Facebook",
    "organization": "Data for Good at Meta",
    "dataset_date": "[2019-06-10T00:00:00 TO 2019-06-10T23:59:59]",
    "last_modified": "2019-11-07T00:13:58.511741",
    "data_update_frequency": "As needed",
    "groups": [
        "Brazil"
    ],
    "license_title": "Creative Commons Attribution International",
    "methodology": "Other",
    "methodology_other": "To create our high-resolution maps, we use machine learning techniques to identify buildings from commercially available satellite images. Then we work with our partners at Columbia University to overlay general population estimates based on publicly available census data and other population statistics. The resulting maps are the most detailed and actionable tools available for aid and research organizations. For more information about the methodology used to create our high resolution population density maps and the demographic distributions, please visit: https://dataforgood.fb.com/docs/methodology-high-resolution-population-density-maps-demographic-estimates/\r\n\r\nFor information about how to use HDX to access these datasets, please visit: https://dataforgood.fb.com/docs/high-resolution-population-density-maps-demographic-estimates-documentation/\r\n\r\nAdjustments to match the census population with the UN estimates are applied at the national level. The UN estimate for a given country (or state/territory) is divided by the total census estimate of population for the given country. The resulting adjustment factor is multiplied by each administrative unit census value for the target year. This preserves the relative population totals across administrative units while matching the UN total. More information can be found here: https://dataforgood.fb.com/docs/census-information-for-high-resolution-population-density-maps/\r\n",
    "caveats": "To reference this data, please use the following citation: Facebook Connectivity Lab and Center for International Earth Science Information Network - CIESIN - Columbia University. 2016. High Resolution Settlement Layer (HRSL). Source imagery for HRSL \u00a9 2016 DigitalGlobe. Accessed DAY MONTH YEAR.\"\r\n",
    "tags": [
        "baseline population",
        "births",
        "children",
        "demographics",
        "elderly",
        "geodata",
        "health",
        "maternity",
        "women",
        "youth"
    ],
    "resources": [
        {
            "created": "2019-06-11T18:11:51.234261",
            "description": "",
            "format": "CSV",
            "download_url": "https://data.humdata.org/dataset/c17003d1-47f4-4ec5-8229-2f77aeb114be/resource/54964df0-8d6a-4f65-ac10-bcf11499a9fe/download/bra_children_under_five_2019-06-01_csv.zip",
            "id": "54964df0-8d6a-4f65-ac10-bcf11499a9fe",
            "last_modified": "2019-06-11T18:11:50.883948",
            "metadata_modified": "2023-03-03T03:30:44.619717",
            "microdata": false,
            "dataset_id": "c17003d1-47f4-4ec5-8229-2f77aeb114be",
            "resource_type": "file.upload",
            "name": "BRA_children_under_five_2019-06-01_csv.zip",
            "mimetype": "application/zip",
            "size": "159.1M"
        },
        {
            "created": "2019-06-11T18:13:57.898102",
            "description": "",
            "format": "CSV",
            "download_url": "https://data.humdata.org/dataset/c17003d1-47f4-4ec5-8229-2f77aeb114be/resource/6d6f1ea3-c8d3-4dc0-b0ea-af9c92b14b48/download/bra_elderly_60_plus_2019-06-01_csv.zip",
            "id": "6d6f1ea3-c8d3-4dc0-b0ea-af9c92b14b48",
            "last_modified": "2019-06-11T18:13:57.522184",
            "metadata_modified": "2023-03-03T03:30:44.619854",
            "microdata": false,
            "dataset_id": "c17003d1-47f4-4ec5-8229-2f77aeb114be",
            "resource_type": "file.upload",
            "name": "BRA_elderly_60_plus_2019-06-01_csv.zip",
            "mimetype": "application/zip",
            "size": "159.4M"
        },
        {
            "created": "2019-06-11T18:15:34.501349",
            "description": "",
            "format": "CSV",
            "download_url": "https://data.humdata.org/dataset/c17003d1-47f4-4ec5-8229-2f77aeb114be/resource/8d00d329-f873-4a20-baf2-01991d64ff57/download/bra_men_2019-06-01_csv.zip",
            "id": "8d00d329-f873-4a20-baf2-01991d64ff57",
            "last_modified": "2019-06-11T18:15:34.055431",
            "metadata_modified": "2023-03-03T03:30:44.619961",
            "microdata": false,
            "dataset_id": "c17003d1-47f4-4ec5-8229-2f77aeb114be",
            "resource_type": "file.upload",
            "name": "BRA_men_2019-06-01_csv.zip",
            "mimetype": "application/zip",
            "size": "160.2M"
        },
        {
            "created": "2019-06-11T18:21:01.701576",
            "description": "",
            "format": "GeoTIFF",
            "download_url": "https://data.humdata.org/dataset/c17003d1-47f4-4ec5-8229-2f77aeb114be/resource/6ca29762-b872-4bf3-8f1b-1de9af7c5a05/download/bra_northeast_children_under_five_2019-06-01_geotiff.zip",
            "id": "6ca29762-b872-4bf3-8f1b-1de9af7c5a05",
            "last_modified": "2019-06-11T18:21:01.229629",
            "metadata_modified": "2023-03-03T03:30:44.620064",
            "microdata": false,
            "dataset_id": "c17003d1-47f4-4ec5-8229-2f77aeb114be",
            "resource_type": "file.upload",
            "name": "BRA_northeast_children_under_five_2019-06-01_geotiff.zip",
            "mimetype": "application/zip",
            "size": "51.2M"
        },
        {
            "created": "2019-06-11T18:21:29.080080",
            "description": "",
            "format": "GeoTIFF",
            "download_url": "https://data.humdata.org/dataset/c17003d1-47f4-4ec5-8229-2f77aeb114be/resource/9584758c-23d2-47c6-b430-c719e4c66d83/download/bra_northeast_elderly_60_plus_2019-06-01_geotiff.zip",
            "id": "9584758c-23d2-47c6-b430-c719e4c66d83",
            "last_modified": "2019-06-11T18:21:28.522534",
            "metadata_modified": "2023-03-03T03:30:44.620164",
            "microdata": false,
            "dataset_id": "c17003d1-47f4-4ec5-8229-2f77aeb114be",
            "resource_type": "file.upload",
            "name": "BRA_northeast_elderly_60_plus_2019-06-01_geotiff.zip",
            "mimetype": "application/zip",
            "size": "51.2M"
        },
        {
            "created": "2019-06-11T18:21:56.047430",
            "description": "",
            "format": "GeoTIFF",
            "download_url": "https://data.humdata.org/dataset/c17003d1-47f4-4ec5-8229-2f77aeb114be/resource/562e471e-ae6b-46f2-b2cc-2788621de7c7/download/bra_northeast_men_2019-06-01_geotiff.zip",
            "id": "562e471e-ae6b-46f2-b2cc-2788621de7c7",
            "last_modified": "2019-06-11T18:21:55.406531",
            "metadata_modified": "2023-03-03T03:30:44.620275",
            "microdata": false,
            "dataset_id": "c17003d1-47f4-4ec5-8229-2f77aeb114be",
            "resource_type": "file.upload",
            "name": "BRA_northeast_men_2019-06-01_geotiff.zip",
            "mimetype": "application/zip",
            "size": "51.2M"
        },
        {
            "created": "2019-06-11T18:25:38.870869",
            "description": "",
            "format": "GeoTIFF",
            "download_url": "https://data.humdata.org/dataset/c17003d1-47f4-4ec5-8229-2f77aeb114be/resource/8450bd09-2a1f-45df-a7e1-c1c5aba8a7f5/download/bra_northeast_women_2019-06-01_geotiff.zip",
            "id": "8450bd09-2a1f-45df-a7e1-c1c5aba8a7f5",
            "last_modified": "2019-06-11T18:25:38.187105",
            "metadata_modified": "2023-03-03T03:30:44.620375",
            "microdata": false,
            "dataset_id": "c17003d1-47f4-4ec5-8229-2f77aeb114be",
            "resource_type": "file.upload",
            "name": "BRA_northeast_women_2019-06-01_geotiff.zip",
            "mimetype": "application/zip",
            "size": "51.2M"
        },
        {
            "created": "2019-06-11T18:26:03.126842",
            "description": "",
            "format": "GeoTIFF",
            "download_url": "https://data.humdata.org/dataset/c17003d1-47f4-4ec5-8229-2f77aeb114be/resource/94332c06-f80a-47af-ae24-c2cb4c3083ab/download/bra_northeast_women_of_reproductive_age_15_49_2019-06-01_geotiff.zip",
            "id": "94332c06-f80a-47af-ae24-c2cb4c3083ab",
            "last_modified": "2019-06-11T18:26:02.298724",
            "metadata_modified": "2023-03-03T03:30:44.620472",
            "microdata": false,
            "dataset_id": "c17003d1-47f4-4ec5-8229-2f77aeb114be",
            "resource_type": "file.upload",
            "name": "BRA_northeast_women_of_reproductive_age_15_49_2019-06-01_geotiff.zip",
            "mimetype": "application/zip",
            "size": "51.2M"
        },
        {
            "created": "2019-06-11T18:26:26.629390",
            "description": "",
            "format": "GeoTIFF",
            "download_url": "https://data.humdata.org/dataset/c17003d1-47f4-4ec5-8229-2f77aeb114be/resource/c1fe8710-448b-4c5a-80ac-0556bff0bb82/download/bra_northeast_youth_15_24_2019-06-01_geotiff.zip",
            "id": "c1fe8710-448b-4c5a-80ac-0556bff0bb82",
            "last_modified": "2019-06-11T18:26:25.836368",
            "metadata_modified": "2023-03-03T03:30:44.620570",
            "microdata": false,
            "dataset_id": "c17003d1-47f4-4ec5-8229-2f77aeb114be",
            "resource_type": "file.upload",
            "name": "BRA_northeast_youth_15_24_2019-06-01_geotiff.zip",
            "mimetype": "application/zip",
            "size": "51.2M"
        },
        {
            "created": "2019-06-11T18:31:12.055935",
            "description": "",
            "format": "GeoTIFF",
            "download_url": "https://data.humdata.org/dataset/c17003d1-47f4-4ec5-8229-2f77aeb114be/resource/fbf50179-f677-4a7e-a814-6fa990877a10/download/bra_northwest_children_under_five_2019-06-01_geotiff.zip",
            "id": "fbf50179-f677-4a7e-a814-6fa990877a10",
            "last_modified": "2019-06-11T18:31:11.194217",
            "metadata_modified": "2023-03-03T03:30:44.620667",
            "microdata": false,
            "dataset_id": "c17003d1-47f4-4ec5-8229-2f77aeb114be",
            "resource_type": "file.upload",
            "name": "BRA_northwest_children_under_five_2019-06-01_geotiff.zip",
            "mimetype": "application/zip",
            "size": "13.1M"
        },
        {
            "created": "2019-06-11T18:31:20.331653",
            "description": "",
            "format": "GeoTIFF",
            "download_url": "https://data.humdata.org/dataset/c17003d1-47f4-4ec5-8229-2f77aeb114be/resource/c5a2e025-7781-44f7-9772-a780d0100001/download/bra_northwest_elderly_60_plus_2019-06-01_geotiff.zip",
            "id": "c5a2e025-7781-44f7-9772-a780d0100001",
            "last_modified": "2019-06-11T18:31:19.420642",
            "metadata_modified": "2023-03-03T03:30:44.620764",
            "microdata": false,
            "dataset_id": "c17003d1-47f4-4ec5-8229-2f77aeb114be",
            "resource_type": "file.upload",
            "name": "BRA_northwest_elderly_60_plus_2019-06-01_geotiff.zip",
            "mimetype": "application/zip",
            "size": "13.1M"
        },
        {
            "created": "2019-06-11T18:31:30.044836",
            "description": "",
            "format": "GeoTIFF",
            "download_url": "https://data.humdata.org/dataset/c17003d1-47f4-4ec5-8229-2f77aeb114be/resource/84859064-baba-4093-9a32-96e5e50b6b0a/download/bra_northwest_men_2019-06-01_geotiff.zip",
            "id": "84859064-baba-4093-9a32-96e5e50b6b0a",
            "last_modified": "2019-06-11T18:31:29.074275",
            "metadata_modified": "2023-03-03T03:30:44.620860",
            "microdata": false,
            "dataset_id": "c17003d1-47f4-4ec5-8229-2f77aeb114be",
            "resource_type": "file.upload",
            "name": "BRA_northwest_men_2019-06-01_geotiff.zip",
            "mimetype": "application/zip",
            "size": "13.1M"
        },
        {
            "created": "2019-06-11T18:31:39.907774",
            "description": "",
            "format": "GeoTIFF",
            "download_url": "https://data.humdata.org/dataset/c17003d1-47f4-4ec5-8229-2f77aeb114be/resource/40f6585d-411e-4fdf-9b0b-da683e3e9b01/download/bra_northwest_women_2019-06-01_geotiff.zip",
            "id": "40f6585d-411e-4fdf-9b0b-da683e3e9b01",
            "last_modified": "2019-06-11T18:31:38.712986",
            "metadata_modified": "2023-03-03T03:30:44.620957",
            "microdata": false,
            "dataset_id": "c17003d1-47f4-4ec5-8229-2f77aeb114be",
            "resource_type": "file.upload",
            "name": "BRA_northwest_women_2019-06-01_geotiff.zip",
            "mimetype": "application/zip",
            "size": "13.1M"
        },
        {
            "created": "2019-06-11T18:31:48.938474",
            "description": "",
            "format": "GeoTIFF",
            "download_url": "https://data.humdata.org/dataset/c17003d1-47f4-4ec5-8229-2f77aeb114be/resource/855b63d6-af91-4774-806f-9cb44bea7337/download/bra_northwest_women_of_reproductive_age_15_49_2019-06-01_geotiff.zip",
            "id": "855b63d6-af91-4774-806f-9cb44bea7337",
            "last_modified": "2019-06-11T18:31:47.835592",
            "metadata_modified": "2023-03-03T03:30:44.621115",
            "microdata": false,
            "dataset_id": "c17003d1-47f4-4ec5-8229-2f77aeb114be",
            "resource_type": "file.upload",
            "name": "BRA_northwest_women_of_reproductive_age_15_49_2019-06-01_geotiff.zip",
            "mimetype": "application/zip",
            "size": "13.1M"
        },
        {
            "created": "2019-06-11T18:32:00.587969",
            "description": "",
            "format": "GeoTIFF",
            "download_url": "https://data.humdata.org/dataset/c17003d1-47f4-4ec5-8229-2f77aeb114be/resource/8d0764dd-55da-419a-aac4-839b6f91dbdb/download/bra_northwest_youth_15_24_2019-06-01_geotiff.zip",
            "id": "8d0764dd-55da-419a-aac4-839b6f91dbdb",
            "last_modified": "2019-06-11T18:31:59.447109",
            "metadata_modified": "2023-03-03T03:30:44.621214",
            "microdata": false,
            "dataset_id": "c17003d1-47f4-4ec5-8229-2f77aeb114be",
            "resource_type": "file.upload",
            "name": "BRA_northwest_youth_15_24_2019-06-01_geotiff.zip",
            "mimetype": "application/zip",
            "size": "13.1M"
        },
        {
            "created": "2019-06-11T18:37:21.958463",
            "description": "",
            "format": "GeoTIFF",
            "download_url": "https://data.humdata.org/dataset/c17003d1-47f4-4ec5-8229-2f77aeb114be/resource/5fe010a1-0aa8-4249-b0fd-bade33124e3b/download/bra_southeast_children_under_five_2019-06-01_geotiff.zip",
            "id": "5fe010a1-0aa8-4249-b0fd-bade33124e3b",
            "last_modified": "2019-06-11T18:37:20.760531",
            "metadata_modified": "2023-03-03T03:30:44.621311",
            "microdata": false,
            "dataset_id": "c17003d1-47f4-4ec5-8229-2f77aeb114be",
            "resource_type": "file.upload",
            "name": "BRA_southeast_children_under_five_2019-06-01_geotiff.zip",
            "mimetype": "application/zip",
            "size": "105.2M"
        },
        {
            "created": "2019-06-11T18:38:13.568115",
            "description": "",
            "format": "GeoTIFF",
            "download_url": "https://data.humdata.org/dataset/c17003d1-47f4-4ec5-8229-2f77aeb114be/resource/f2b48b1f-450c-433b-8505-bf9ad6a987f9/download/bra_southeast_elderly_60_plus_2019-06-01_geotiff.zip",
            "id": "f2b48b1f-450c-433b-8505-bf9ad6a987f9",
            "last_modified": "2019-06-11T18:38:12.221940",
            "metadata_modified": "2023-03-03T03:30:44.621408",
            "microdata": false,
            "dataset_id": "c17003d1-47f4-4ec5-8229-2f77aeb114be",
            "resource_type": "file.upload",
            "name": "BRA_southeast_elderly_60_plus_2019-06-01_geotiff.zip",
            "mimetype": "application/zip",
            "size": "105.3M"
        },
        {
            "created": "2019-06-11T18:39:09.252339",
            "description": "",
            "format": "GeoTIFF",
            "download_url": "https://data.humdata.org/dataset/c17003d1-47f4-4ec5-8229-2f77aeb114be/resource/ea9b60aa-f245-438a-bdfa-30e3ff4a6391/download/bra_southeast_women_2019-06-01_geotiff.zip",
            "id": "ea9b60aa-f245-438a-bdfa-30e3ff4a6391",
            "last_modified": "2019-06-11T18:39:07.829446",
            "metadata_modified": "2023-03-03T03:30:44.621505",
            "microdata": false,
            "dataset_id": "c17003d1-47f4-4ec5-8229-2f77aeb114be",
            "resource_type": "file.upload",
            "name": "BRA_southeast_women_2019-06-01_geotiff.zip",
            "mimetype": "application/zip",
            "size": "105.5M"
        },
        {
            "created": "2019-06-11T18:40:06.331049",
            "description": "",
            "format": "GeoTIFF",
            "download_url": "https://data.humdata.org/dataset/c17003d1-47f4-4ec5-8229-2f77aeb114be/resource/c9158e93-90d0-44cc-897d-fc1a960a4471/download/bra_southeast_women_of_reproductive_age_15_49_2019-06-01_geotiff.zip",
            "id": "c9158e93-90d0-44cc-897d-fc1a960a4471",
            "last_modified": "2019-06-11T18:40:04.929127",
            "metadata_modified": "2023-03-03T03:30:44.621601",
            "microdata": false,
            "dataset_id": "c17003d1-47f4-4ec5-8229-2f77aeb114be",
            "resource_type": "file.upload",
            "name": "BRA_southeast_women_of_reproductive_age_15_49_2019-06-01_geotiff.zip",
            "mimetype": "application/zip",
            "size": "105.5M"
        },
        {
            "created": "2019-06-11T18:41:01.694036",
            "description": "",
            "format": "GeoTIFF",
            "download_url": "https://data.humdata.org/dataset/c17003d1-47f4-4ec5-8229-2f77aeb114be/resource/dc0edb72-732f-4508-98a3-dd620534b4af/download/bra_southeast_youth_15_24_2019-06-01_geotiff.zip",
            "id": "dc0edb72-732f-4508-98a3-dd620534b4af",
            "last_modified": "2019-06-11T18:41:00.142346",
            "metadata_modified": "2023-03-03T03:30:44.621698",
            "microdata": false,
            "dataset_id": "c17003d1-47f4-4ec5-8229-2f77aeb114be",
            "resource_type": "file.upload",
            "name": "BRA_southeast_youth_15_24_2019-06-01_geotiff.zip",
            "mimetype": "application/zip",
            "size": "105.5M"
        },
        {
            "created": "2019-06-11T18:44:44.086333",
            "description": "",
            "format": "GeoTIFF",
            "download_url": "https://data.humdata.org/dataset/c17003d1-47f4-4ec5-8229-2f77aeb114be/resource/a33e807b-850b-4b63-92ec-b04d51f2c5d0/download/bra_southwest_children_under_five_2019-06-01_geotiff.zip",
            "id": "a33e807b-850b-4b63-92ec-b04d51f2c5d0",
            "last_modified": "2019-06-11T18:44:42.485404",
            "metadata_modified": "2023-03-03T03:30:44.621795",
            "microdata": false,
            "dataset_id": "c17003d1-47f4-4ec5-8229-2f77aeb114be",
            "resource_type": "file.upload",
            "name": "BRA_southwest_children_under_five_2019-06-01_geotiff.zip",
            "mimetype": "application/zip",
            "size": "19.6M"
        },
        {
            "created": "2019-06-11T18:44:57.252135",
            "description": "",
            "format": "GeoTIFF",
            "download_url": "https://data.humdata.org/dataset/c17003d1-47f4-4ec5-8229-2f77aeb114be/resource/3b8622ff-5dac-405a-b51c-68b9a350de12/download/bra_southwest_elderly_60_plus_2019-06-01_geotiff.zip",
            "id": "3b8622ff-5dac-405a-b51c-68b9a350de12",
            "last_modified": "2019-06-11T18:44:55.680610",
            "metadata_modified": "2023-03-03T03:30:44.621892",
            "microdata": false,
            "dataset_id": "c17003d1-47f4-4ec5-8229-2f77aeb114be",
            "resource_type": "file.upload",
            "name": "BRA_southwest_elderly_60_plus_2019-06-01_geotiff.zip",
            "mimetype": "application/zip",
            "size": "19.6M"
        },
        {
            "created": "2019-06-11T18:45:10.763829",
            "description": "",
            "format": "GeoTIFF",
            "download_url": "https://data.humdata.org/dataset/c17003d1-47f4-4ec5-8229-2f77aeb114be/resource/e8b765c1-9683-4a91-921b-3dcc84871520/download/bra_southwest_men_2019-06-01_geotiff.zip",
            "id": "e8b765c1-9683-4a91-921b-3dcc84871520",
            "last_modified": "2019-06-11T18:45:09.114401",
            "metadata_modified": "2023-03-03T03:30:44.621988",
            "microdata": false,
            "dataset_id": "c17003d1-47f4-4ec5-8229-2f77aeb114be",
            "resource_type": "file.upload",
            "name": "BRA_southwest_men_2019-06-01_geotiff.zip",
            "mimetype": "application/zip",
            "size": "19.7M"
        },
        {
            "created": "2019-06-11T18:45:23.734144",
            "description": "",
            "format": "GeoTIFF",
            "download_url": "https://data.humdata.org/dataset/c17003d1-47f4-4ec5-8229-2f77aeb114be/resource/8784c37c-836c-4c3d-ae43-a70d69b022bf/download/bra_southwest_women_2019-06-01_geotiff.zip",
            "id": "8784c37c-836c-4c3d-ae43-a70d69b022bf",
            "last_modified": "2019-06-11T18:45:22.001223",
            "metadata_modified": "2023-03-03T03:30:44.622086",
            "microdata": false,
            "dataset_id": "c17003d1-47f4-4ec5-8229-2f77aeb114be",
            "resource_type": "file.upload",
            "name": "BRA_southwest_women_2019-06-01_geotiff.zip",
            "mimetype": "application/zip",
            "size": "19.7M"
        },
        {
            "created": "2019-06-11T18:45:36.757829",
            "description": "",
            "format": "GeoTIFF",
            "download_url": "https://data.humdata.org/dataset/c17003d1-47f4-4ec5-8229-2f77aeb114be/resource/a49fbeca-5aff-44dd-9fc0-eeb1fb5d8d1a/download/bra_southwest_women_of_reproductive_age_15_49_2019-06-01_geotiff.zip",
            "id": "a49fbeca-5aff-44dd-9fc0-eeb1fb5d8d1a",
            "last_modified": "2019-06-11T18:45:34.929601",
            "metadata_modified": "2023-03-03T03:30:44.622184",
            "microdata": false,
            "dataset_id": "c17003d1-47f4-4ec5-8229-2f77aeb114be",
            "resource_type": "file.upload",
            "name": "BRA_southwest_women_of_reproductive_age_15_49_2019-06-01_geotiff.zip",
            "mimetype": "application/zip",
            "size": "19.6M"
        },
        {
            "created": "2019-06-11T18:45:50.371776",
            "description": "",
            "format": "GeoTIFF",
            "download_url": "https://data.humdata.org/dataset/c17003d1-47f4-4ec5-8229-2f77aeb114be/resource/879440dd-12cc-48d3-a159-d13bc76d5ec3/download/bra_southwest_youth_15_24_2019-06-01_geotiff.zip",
            "id": "879440dd-12cc-48d3-a159-d13bc76d5ec3",
            "last_modified": "2019-06-11T18:45:48.575933",
            "metadata_modified": "2023-03-03T03:30:44.622281",
            "microdata": false,
            "dataset_id": "c17003d1-47f4-4ec5-8229-2f77aeb114be",
            "resource_type": "file.upload",
            "name": "BRA_southwest_youth_15_24_2019-06-01_geotiff.zip",
            "mimetype": "application/zip",
            "size": "19.6M"
        },
        {
            "created": "2019-06-11T18:47:01.939537",
            "description": "",
            "format": "CSV",
            "download_url": "https://data.humdata.org/dataset/c17003d1-47f4-4ec5-8229-2f77aeb114be/resource/3a8e1355-abb3-4dd9-9b3a-9b983af42b0e/download/bra_women_2019-06-01_csv.zip",
            "id": "3a8e1355-abb3-4dd9-9b3a-9b983af42b0e",
            "last_modified": "2019-06-11T18:47:00.028777",
            "metadata_modified": "2023-03-03T03:30:44.622378",
            "microdata": false,
            "dataset_id": "c17003d1-47f4-4ec5-8229-2f77aeb114be",
            "resource_type": "file.upload",
            "name": "BRA_women_2019-06-01_csv.zip",
            "mimetype": "application/zip",
            "size": "160.2M"
        },
        {
            "created": "2019-06-11T18:48:15.699368",
            "description": "",
            "format": "CSV",
            "download_url": "https://data.humdata.org/dataset/c17003d1-47f4-4ec5-8229-2f77aeb114be/resource/b6613904-021c-4d56-88a7-61ad34087103/download/bra_women_of_reproductive_age_15_49_2019-06-01_csv.zip",
            "id": "b6613904-021c-4d56-88a7-61ad34087103",
            "last_modified": "2019-06-11T18:48:13.682531",
            "metadata_modified": "2023-03-03T03:30:44.622475",
            "microdata": false,
            "dataset_id": "c17003d1-47f4-4ec5-8229-2f77aeb114be",
            "resource_type": "file.upload",
            "name": "BRA_women_of_reproductive_age_15_49_2019-06-01_csv.zip",
            "mimetype": "application/zip",
            "size": "160.0M"
        },
        {
            "created": "2019-06-11T18:49:31.766497",
            "description": "",
            "format": "CSV",
            "download_url": "https://data.humdata.org/dataset/c17003d1-47f4-4ec5-8229-2f77aeb114be/resource/0e4af4ff-e4e5-4686-a17c-c8b326d98d76/download/bra_youth_15_24_2019-06-01_csv.zip",
            "id": "0e4af4ff-e4e5-4686-a17c-c8b326d98d76",
            "last_modified": "2019-06-11T18:49:29.446121",
            "metadata_modified": "2023-03-03T03:30:44.622572",
            "microdata": false,
            "dataset_id": "c17003d1-47f4-4ec5-8229-2f77aeb114be",
            "resource_type": "file.upload",
            "name": "BRA_youth_15_24_2019-06-01_csv.zip",
            "mimetype": "application/zip",
            "size": "159.8M"
        },
        {
            "created": "2019-06-21T17:57:15.955614",
            "description": "",
            "format": "GeoTIFF",
            "download_url": "https://data.humdata.org/dataset/c17003d1-47f4-4ec5-8229-2f77aeb114be/resource/17bedf4e-c521-4fe2-865a-1d7c1469b4a5/download/population_bra_northeast_2018-10-01.zip",
            "id": "17bedf4e-c521-4fe2-865a-1d7c1469b4a5",
            "last_modified": "2019-06-21T17:57:13.782692",
            "metadata_modified": "2023-03-03T03:30:44.622667",
            "microdata": false,
            "dataset_id": "c17003d1-47f4-4ec5-8229-2f77aeb114be",
            "resource_type": "file.upload",
            "name": "population_bra_northeast_2018-10-01.geotiff.zip",
            "mimetype": "application/zip",
            "size": "24.2M"
        },
        {
            "created": "2019-06-21T18:00:05.978431",
            "description": "",
            "format": "GeoTIFF",
            "download_url": "https://data.humdata.org/dataset/c17003d1-47f4-4ec5-8229-2f77aeb114be/resource/566d54d2-ec13-4f13-b948-35a7c707e04a/download/population_bra_northwest_2018-10-01.zip",
            "id": "566d54d2-ec13-4f13-b948-35a7c707e04a",
            "last_modified": "2019-06-21T18:00:03.754060",
            "metadata_modified": "2023-03-03T03:30:44.622762",
            "microdata": false,
            "dataset_id": "c17003d1-47f4-4ec5-8229-2f77aeb114be",
            "resource_type": "file.upload",
            "name": "population_bra_northwest_2018-10-01.geotiff.zip",
            "mimetype": "application/zip",
            "size": "7.2M"
        },
        {
            "created": "2019-06-21T18:03:20.062680",
            "description": "",
            "format": "GeoTIFF",
            "download_url": "https://data.humdata.org/dataset/c17003d1-47f4-4ec5-8229-2f77aeb114be/resource/fcb2b647-a6e4-4725-b24d-563e6a4eb46a/download/population_bra_southeast_2018-10-01.zip",
            "id": "fcb2b647-a6e4-4725-b24d-563e6a4eb46a",
            "last_modified": "2019-06-21T18:03:17.658253",
            "metadata_modified": "2023-03-03T03:30:44.622857",
            "microdata": false,
            "dataset_id": "c17003d1-47f4-4ec5-8229-2f77aeb114be",
            "resource_type": "file.upload",
            "name": "population_bra_southeast_2018-10-01.geotiff.zip",
            "mimetype": "application/zip",
            "size": "34.3M"
        },
        {
            "created": "2019-06-21T18:07:27.888174",
            "description": "",
            "format": "GeoTIFF",
            "download_url": "https://data.humdata.org/dataset/c17003d1-47f4-4ec5-8229-2f77aeb114be/resource/d794ddc1-049c-41dd-b363-d35a5d1e8563/download/population_bra_southwest_2018-10-01.zip",
            "id": "d794ddc1-049c-41dd-b363-d35a5d1e8563",
            "last_modified": "2019-06-21T18:07:25.614845",
            "metadata_modified": "2023-03-03T03:30:44.622952",
            "microdata": false,
            "dataset_id": "c17003d1-47f4-4ec5-8229-2f77aeb114be",
            "resource_type": "file.upload",
            "name": "population_bra_southwest_2018-10-01.geotiff.zip",
            "mimetype": "application/zip",
            "size": "15.5M"
        },
        {
            "created": "2019-06-25T00:59:39.443301",
            "description": "",
            "format": "CSV",
            "download_url": "https://data.humdata.org/dataset/c17003d1-47f4-4ec5-8229-2f77aeb114be/resource/957218ee-c740-44c0-88e5-7faeef813a0c/download/population_bra_northeast_2018-10-01.csv.zip",
            "id": "957218ee-c740-44c0-88e5-7faeef813a0c",
            "last_modified": "2019-06-25T00:59:36.924145",
            "metadata_modified": "2023-03-03T03:30:44.623047",
            "microdata": false,
            "dataset_id": "c17003d1-47f4-4ec5-8229-2f77aeb114be",
            "resource_type": "file.upload",
            "name": "population_bra_northeast_2018-10-01.csv..zip",
            "mimetype": "application/zip",
            "size": "71.2M"
        },
        {
            "created": "2019-06-25T01:00:07.385630",
            "description": "",
            "format": "CSV",
            "download_url": "https://data.humdata.org/dataset/c17003d1-47f4-4ec5-8229-2f77aeb114be/resource/1e1f271b-1055-4365-b391-f6fdf3093fe2/download/population_bra_northwest_2018-10-01.csv.zip",
            "id": "1e1f271b-1055-4365-b391-f6fdf3093fe2",
            "last_modified": "2019-06-25T01:00:04.681707",
            "metadata_modified": "2023-03-03T03:30:44.623143",
            "microdata": false,
            "dataset_id": "c17003d1-47f4-4ec5-8229-2f77aeb114be",
            "resource_type": "file.upload",
            "name": "population_bra_northwest_2018-10-01.csv.zip",
            "mimetype": "application/zip",
            "size": "13.5M"
        },
        {
            "created": "2019-06-25T01:04:15.892432",
            "description": "",
            "format": "CSV",
            "download_url": "https://data.humdata.org/dataset/c17003d1-47f4-4ec5-8229-2f77aeb114be/resource/eb17516f-3c84-4626-95e4-df1f342f3d82/download/population_bra_southeast_2018-10-01.csv.zip",
            "id": "eb17516f-3c84-4626-95e4-df1f342f3d82",
            "last_modified": "2019-06-25T01:04:13.198686",
            "metadata_modified": "2023-03-03T03:30:44.623238",
            "microdata": false,
            "dataset_id": "c17003d1-47f4-4ec5-8229-2f77aeb114be",
            "resource_type": "file.upload",
            "name": "population_bra_southeast_2018-10-01.csv.zip",
            "mimetype": "application/zip",
            "size": "159.4M"
        },
        {
            "created": "2019-06-25T01:05:35.222040",
            "description": "",
            "format": "CSV",
            "download_url": "https://data.humdata.org/dataset/c17003d1-47f4-4ec5-8229-2f77aeb114be/resource/5cb55d1a-9f11-4004-82f3-0c27e878495a/download/population_bra_southwest_2018-10-01.csv.zip",
            "id": "5cb55d1a-9f11-4004-82f3-0c27e878495a",
            "last_modified": "2019-06-25T01:05:32.603516",
            "metadata_modified": "2023-03-03T03:30:44.623333",
            "microdata": false,
            "dataset_id": "c17003d1-47f4-4ec5-8229-2f77aeb114be",
            "resource_type": "file.upload",
            "name": "population_bra_southwest_2018-10-01.csv.zip",
            "mimetype": "application/zip",
            "size": "46.0M"
        },
        {
            "created": "2019-11-07T00:14:01.753506",
            "description": "",
            "format": "GeoTIFF",
            "download_url": "https://data.humdata.org/dataset/c17003d1-47f4-4ec5-8229-2f77aeb114be/resource/3bde50a0-c349-4e53-bc2f-50a1636b6bd0/download/bra_southeast_men_2019-06-01_geotiff.zip",
            "id": "3bde50a0-c349-4e53-bc2f-50a1636b6bd0",
            "last_modified": "2019-11-07T00:13:58.511741",
            "metadata_modified": "2023-03-03T03:30:44.623428",
            "microdata": false,
            "dataset_id": "c17003d1-47f4-4ec5-8229-2f77aeb114be",
            "resource_type": "file.upload",
            "name": "BRA_southeast_men_2019-06-01_geotiff.zip",
            "mimetype": "application/zip",
            "size": "105.5M"
        }
    ]
}