{
    "id": "2d058968-9d7e-49a9-b28f-2895d7f6536f",
    "title": "Brazil - Requirements and Funding Data",
    "name": "fts-requirements-and-funding-data-for-brazil",
    "notes": "FTS publishes data on humanitarian funding flows as reported by donors and recipient organizations. It presents all humanitarian funding to a country and funding that is specifically reported or that can be specifically mapped against funding requirements stated in humanitarian response plans. The data comes from OCHA's Financial Tracking Service, is encoded as utf-8 and the second row of the CSV contains HXL tags.",
    "dataset_source": "OCHA Financial Tracking Service",
    "organization": "OCHA Financial Tracking System (FTS)",
    "dataset_date": "[2024-05-10T00:00:00 TO 2024-05-10T23:59:59]",
    "last_modified": "2024-05-10T02:10:33.357117",
    "data_update_frequency": "Every day",
    "groups": [
        "Brazil"
    ],
    "license_title": "Creative Commons Attribution for Intergovernmental Organisations",
    "methodology": "Other",
    "methodology_other": "FTS is open to all government and private donors, funds, recipient agencies and implementing organizations wishing to report financial pledges and contributions for humanitarian action. FTS team curates the reported data by manually reviewing, validating and reconciling incoming information and updating FTS data records on an ongoing basis.",
    "caveats": "Please see [About FTS](https://fts.unocha.org/content/about-fts-what-fts)",
    "tags": [
        "covid-19",
        "funding",
        "hxl"
    ],
    "resources": [
        {
            "created": "2019-01-21T12:28:35.740855",
            "description": "FTS Annual Requirements and Funding Data for Brazil",
            "format": "CSV",
            "download_url": "https://data.humdata.org/dataset/2d058968-9d7e-49a9-b28f-2895d7f6536f/resource/450a3082-88fa-4b26-8795-43d882b9e5ff/download/fts_requirements_funding_bra.csv",
            "id": "450a3082-88fa-4b26-8795-43d882b9e5ff",
            "last_modified": "2024-05-10T02:10:32.969681",
            "metadata_modified": "2024-05-10T02:10:36.123430",
            "microdata": false,
            "dataset_id": "2d058968-9d7e-49a9-b28f-2895d7f6536f",
            "resource_type": "file.upload",
            "name": "fts_requirements_funding_bra.csv",
            "mimetype": "",
            "size": "1.9K"
        },
        {
            "created": "2020-10-14T02:34:26.997346",
            "description": "FTS Annual Requirements, Funding and Covid Funding Data for Brazil",
            "format": "CSV",
            "download_url": "https://data.humdata.org/dataset/2d058968-9d7e-49a9-b28f-2895d7f6536f/resource/b23e8d62-23a9-4c2c-ae1b-d164d3d73ea5/download/fts_requirements_funding_covid_bra.csv",
            "id": "b23e8d62-23a9-4c2c-ae1b-d164d3d73ea5",
            "last_modified": "2024-05-10T02:10:33.136518",
            "metadata_modified": "2024-05-10T02:10:37.338861",
            "microdata": false,
            "dataset_id": "2d058968-9d7e-49a9-b28f-2895d7f6536f",
            "resource_type": "file.upload",
            "name": "fts_requirements_funding_covid_bra.csv",
            "mimetype": "",
            "size": "933.0B"
        },
        {
            "created": "2019-02-12T03:10:51.589365",
            "description": "FTS Incoming Funding Data for Brazil for 2024",
            "format": "CSV",
            "download_url": "https://data.humdata.org/dataset/2d058968-9d7e-49a9-b28f-2895d7f6536f/resource/a12bad12-f5ea-493c-9faa-66cb3f3e9ca7/download/fts_incoming_funding_bra.csv",
            "id": "a12bad12-f5ea-493c-9faa-66cb3f3e9ca7",
            "last_modified": "2024-05-10T02:10:33.357117",
            "metadata_modified": "2024-05-10T02:10:36.869692",
            "microdata": false,
            "dataset_id": "2d058968-9d7e-49a9-b28f-2895d7f6536f",
            "resource_type": "file.upload",
            "name": "fts_incoming_funding_bra.csv",
            "mimetype": "",
            "size": "13.6K"
        }
    ]
}