{
    "id": "f91842d3-5bec-4b03-9f52-86a6c90ad07b",
    "title": "HOTOSM Brazil (North) Education Facilities (OpenStreetMap Export)",
    "name": "hotosm_bra_north_education_facilities",
    "notes": "OpenStreetMap exports for use in GIS applications. This theme includes all OpenStreetMap features in this area matching: amenity IN ('kindergarten','school','college','university') OR building IN ('kindergarten','school','college','university') Features may have these attributes:  capacity:persons name addr:full source operator:type amenity addr:city building  This dataset is one of many OpenStreetMap exports on HDX. See the Humanitarian OpenStreetMap Team website for more information.",
    "dataset_source": "OpenStreetMap contributors",
    "organization": "Humanitarian OpenStreetMap Team (HOT)",
    "dataset_date": "[2023-03-07T00:00:00 TO 2023-03-07T23:59:59]",
    "last_modified": "2020-06-10T22:01:52.425613",
    "data_update_frequency": "Every month",
    "groups": [
        "Brazil"
    ],
    "license_title": "Open Database License (ODC-ODbL)",
    "methodology": "Other",
    "methodology_other": "Volunteered geographic information",
    "caveats": "OpenStreetMap data is crowd sourced and cannot be considered to be exhaustive",
    "tags": [
        "education",
        "education facilities-schools",
        "geodata"
    ],
    "resources": [
        {
            "created": "2019-12-07T00:40:36.064883",
            "description": "ESRI Shapefile",
            "format": "SHP",
            "download_url": "https://export.hotosm.org/downloads/e5c67b43-9def-4dda-a17e-893d326d5549/hotosm_bra_north_education_facilities_points_shp.zip",
            "id": "2f46cafd-bdbe-49c9-84c2-d2d9fd79cebb",
            "last_modified": "2020-06-10T22:01:52.425613",
            "metadata_modified": "2024-01-26T05:46:25.855467",
            "microdata": false,
            "dataset_id": "f91842d3-5bec-4b03-9f52-86a6c90ad07b",
            "resource_type": "api",
            "name": "hotosm_bra_north_education_facilities_points_shp.zip",
            "mimetype": null,
            "size": "0.0B"
        },
        {
            "created": "2019-12-07T00:40:36.064894",
            "description": "ESRI Shapefile",
            "format": "SHP",
            "download_url": "https://export.hotosm.org/downloads/e5c67b43-9def-4dda-a17e-893d326d5549/hotosm_bra_north_education_facilities_polygons_shp.zip",
            "id": "93ecadce-2106-41e2-8cb7-130c85c3d6d0",
            "last_modified": "2020-06-10T22:01:52.425613",
            "metadata_modified": "2024-01-26T05:46:49.763147",
            "microdata": false,
            "dataset_id": "f91842d3-5bec-4b03-9f52-86a6c90ad07b",
            "resource_type": "api",
            "name": "hotosm_bra_north_education_facilities_polygons_shp.zip",
            "mimetype": null,
            "size": "0.0B"
        },
        {
            "created": "2019-12-07T00:40:36.064899",
            "description": "Geopackage, SQLite compatible",
            "format": "Geopackage",
            "download_url": "https://export.hotosm.org/downloads/e5c67b43-9def-4dda-a17e-893d326d5549/hotosm_bra_north_education_facilities_gpkg.zip",
            "id": "83614ec9-82df-4eff-9b69-509a84f35fa7",
            "last_modified": "2020-06-10T22:01:52.425613",
            "metadata_modified": "2023-03-07T01:02:32.016846",
            "microdata": false,
            "dataset_id": "f91842d3-5bec-4b03-9f52-86a6c90ad07b",
            "resource_type": "api",
            "name": "hotosm_bra_north_education_facilities_gpkg.zip",
            "mimetype": null,
            "size": null
        },
        {
            "created": "2019-12-07T00:40:36.064904",
            "description": "Google Earth .KML",
            "format": "KML",
            "download_url": "https://export.hotosm.org/downloads/e5c67b43-9def-4dda-a17e-893d326d5549/hotosm_bra_north_education_facilities_points_kml.zip",
            "id": "49fc3287-9b9f-4f55-8693-15f7c625703f",
            "last_modified": "2020-06-10T22:01:52.425613",
            "metadata_modified": "2024-01-26T05:46:22.059410",
            "microdata": false,
            "dataset_id": "f91842d3-5bec-4b03-9f52-86a6c90ad07b",
            "resource_type": "api",
            "name": "hotosm_bra_north_education_facilities_points_kml.zip",
            "mimetype": null,
            "size": "0.0B"
        },
        {
            "created": "2019-12-07T00:40:36.064908",
            "description": "Google Earth .KML",
            "format": "KML",
            "download_url": "https://export.hotosm.org/downloads/e5c67b43-9def-4dda-a17e-893d326d5549/hotosm_bra_north_education_facilities_polygons_kml.zip",
            "id": "ecbb0046-0bb2-40f3-9047-c8ca08b55914",
            "last_modified": "2020-06-10T22:01:52.425613",
            "metadata_modified": "2024-01-26T05:46:23.622505",
            "microdata": false,
            "dataset_id": "f91842d3-5bec-4b03-9f52-86a6c90ad07b",
            "resource_type": "api",
            "name": "hotosm_bra_north_education_facilities_polygons_kml.zip",
            "mimetype": null,
            "size": "0.0B"
        },
        {
            "created": "2019-12-07T00:40:36.064912",
            "description": ".IMG for Garmin GPS Devices (All OSM layers for area)",
            "format": "Garmin IMG",
            "download_url": "http://export.hotosm.org/downloads/2d77cd1e-f254-411e-aa01-48d3e803c3ea/hotosm_bra_north_gmapsupp_img.zip",
            "id": "10026724-23ce-46b8-a672-29f7a2bb14b4",
            "last_modified": "2020-06-10T22:01:52.425613",
            "metadata_modified": "2021-08-09T05:55:39.499123",
            "microdata": false,
            "dataset_id": "f91842d3-5bec-4b03-9f52-86a6c90ad07b",
            "resource_type": "api",
            "name": "hotosm_bra_north_gmapsupp_img.zip",
            "mimetype": null,
            "size": "0.0B"
        }
    ]
}