{
    "id": "d65e0c75-dcf9-4a6a-9245-75f3ed7c007a",
    "title": "HOTOSM Brazil (East) Financial Services (OpenStreetMap Export)",
    "name": "hotosm_bra_east_financial_services",
    "notes": "OpenStreetMap exports for use in GIS applications. This theme includes all OpenStreetMap features in this area matching: amenity IN ('mobile_money_agent','bureau_de_change','bank','microfinance','atm','sacco','money_transfer','post_office') Features may have these attributes:  addr:city addr:full amenity network operator name source  This dataset is one of many OpenStreetMap exports on HDX. See the Humanitarian OpenStreetMap Team website for more information.",
    "dataset_source": "OpenStreetMap contributors",
    "organization": "Humanitarian OpenStreetMap Team (HOT)",
    "dataset_date": "[2023-03-04T00:00:00 TO 2023-03-04T23:59:59]",
    "last_modified": "2020-07-02T13:50:30",
    "data_update_frequency": "Every month",
    "groups": [
        "Brazil"
    ],
    "license_title": "Open Database License (ODC-ODbL)",
    "methodology": "Other",
    "methodology_other": "Volunteered geographic information",
    "caveats": "\u201cOpenStreetMap data is crowd sourced and cannot be considered to be exhaustive\u201d",
    "tags": [
        "economics",
        "geodata",
        "services"
    ],
    "resources": [
        {
            "created": "2019-12-06T23:39:40.799232",
            "description": "ESRI Shapefile",
            "format": "SHP",
            "download_url": "https://export.hotosm.org/downloads/0595bee7-2f3c-499b-ade9-50bd2886a922/hotosm_bra_east_financial_services_points_shp.zip",
            "id": "a612c52c-2144-4351-af92-0a5caa1c247c",
            "last_modified": "2020-07-02T13:41:00",
            "metadata_modified": "2024-01-26T05:45:11.666346",
            "microdata": false,
            "dataset_id": "d65e0c75-dcf9-4a6a-9245-75f3ed7c007a",
            "resource_type": "api",
            "name": "hotosm_bra_east_financial_services_points_shp.zip",
            "mimetype": null,
            "size": "0.0B"
        },
        {
            "created": "2019-12-06T23:39:40.799244",
            "description": "ESRI Shapefile",
            "format": "SHP",
            "download_url": "https://export.hotosm.org/downloads/0595bee7-2f3c-499b-ade9-50bd2886a922/hotosm_bra_east_financial_services_polygons_shp.zip",
            "id": "0071e2e9-e8bb-4310-b86c-ee17f7b48aa7",
            "last_modified": "2020-07-02T13:41:00",
            "metadata_modified": "2024-01-26T05:45:10.707439",
            "microdata": false,
            "dataset_id": "d65e0c75-dcf9-4a6a-9245-75f3ed7c007a",
            "resource_type": "api",
            "name": "hotosm_bra_east_financial_services_polygons_shp.zip",
            "mimetype": null,
            "size": "0.0B"
        },
        {
            "created": "2019-12-06T23:39:40.799249",
            "description": "Geopackage, SQLite compatible",
            "format": "Geopackage",
            "download_url": "https://export.hotosm.org/downloads/0595bee7-2f3c-499b-ade9-50bd2886a922/hotosm_bra_east_financial_services_gpkg.zip",
            "id": "4bdba638-6469-4f3d-9e4e-95fe80798553",
            "last_modified": "2020-07-02T13:39:50",
            "metadata_modified": "2023-03-04T16:45:25.286571",
            "microdata": false,
            "dataset_id": "d65e0c75-dcf9-4a6a-9245-75f3ed7c007a",
            "resource_type": "api",
            "name": "hotosm_bra_east_financial_services_gpkg.zip",
            "mimetype": null,
            "size": null
        },
        {
            "created": "2019-12-06T23:39:40.799254",
            "description": "Google Earth .KML",
            "format": "KML",
            "download_url": "https://export.hotosm.org/downloads/0595bee7-2f3c-499b-ade9-50bd2886a922/hotosm_bra_east_financial_services_points_kml.zip",
            "id": "284c26ee-c862-4d26-8ea4-b2f2e0e17d90",
            "last_modified": "2020-07-02T13:42:03",
            "metadata_modified": "2024-01-26T05:45:08.689208",
            "microdata": false,
            "dataset_id": "d65e0c75-dcf9-4a6a-9245-75f3ed7c007a",
            "resource_type": "api",
            "name": "hotosm_bra_east_financial_services_points_kml.zip",
            "mimetype": null,
            "size": "0.0B"
        },
        {
            "created": "2019-12-06T23:39:40.799258",
            "description": "Google Earth .KML",
            "format": "KML",
            "download_url": "https://export.hotosm.org/downloads/0595bee7-2f3c-499b-ade9-50bd2886a922/hotosm_bra_east_financial_services_polygons_kml.zip",
            "id": "ee0ab2b5-d69b-4133-8abe-a12e584d27da",
            "last_modified": "2020-07-02T13:42:03",
            "metadata_modified": "2024-01-26T05:45:09.687888",
            "microdata": false,
            "dataset_id": "d65e0c75-dcf9-4a6a-9245-75f3ed7c007a",
            "resource_type": "api",
            "name": "hotosm_bra_east_financial_services_polygons_kml.zip",
            "mimetype": null,
            "size": "0.0B"
        },
        {
            "created": "2019-12-06T23:39:40.799262",
            "description": ".IMG for Garmin GPS Devices (All OSM layers for area)",
            "format": "Garmin IMG",
            "download_url": "https://export.hotosm.org/downloads/0595bee7-2f3c-499b-ade9-50bd2886a922/hotosm_bra_east_gmapsupp_img.zip",
            "id": "dade90f9-eefb-4e3e-a94b-dd56156e867b",
            "last_modified": "2020-07-02T13:50:30",
            "metadata_modified": "2023-03-04T16:45:25.287068",
            "microdata": false,
            "dataset_id": "d65e0c75-dcf9-4a6a-9245-75f3ed7c007a",
            "resource_type": "api",
            "name": "hotosm_bra_east_gmapsupp_img.zip",
            "mimetype": null,
            "size": "0.0B"
        }
    ]
}