{
    "id": "a671790e-024b-469b-858b-d6923b64fb25",
    "title": "Brazil - Data on Conflict Events",
    "name": "ucdp-data-for-brazil",
    "notes": "This dataset is UCDP's most disaggregated dataset, covering individual events of organized violence (phenomena of lethal violence occurring at a given time and place). These events are sufficiently fine-grained to be geo-coded down to the level of individual villages, with temporal durations disaggregated to single, individual days. Sundberg, Ralph, and Erik Melander, 2013, \u201cIntroducing the UCDP Georeferenced Event Dataset\u201d, Journal of Peace Research, vol.50, no.4, 523-532 H\u00f6gbladh Stina, 2019, \u201cUCDP GED Codebook version 19.1\u201d, Department of Peace and Conflict Research, Uppsala University",
    "dataset_source": "Uppsala Conflict Data Program",
    "organization": "HDX",
    "dataset_date": "[1993-06-19T00:00:00 TO 2021-12-31T23:59:59]",
    "last_modified": "2024-05-03T23:44:53.280865",
    "data_update_frequency": "Every month",
    "groups": [
        "Brazil"
    ],
    "license_title": "Creative Commons Attribution for Intergovernmental Organisations",
    "methodology": "Other",
    "methodology_other": "[UCDP's Methodology page](https://www.pcr.uu.se/research/ucdp/methodology/) contains information about how UCDP collects, evaluates, codes and validates event data.",
    "caveats": "",
    "tags": [
        "conflict-violence",
        "hxl"
    ],
    "resources": [
        {
            "created": "2019-09-16T10:14:40.639401",
            "description": "Conflict data with HXL tags",
            "format": "CSV",
            "download_url": "https://data.humdata.org/dataset/a671790e-024b-469b-858b-d6923b64fb25/resource/b88963bd-28f1-4696-a9c9-fdb7e99f52f5/download/conflict_data_bra.csv",
            "id": "b88963bd-28f1-4696-a9c9-fdb7e99f52f5",
            "last_modified": "2024-05-03T23:44:53.112947",
            "metadata_modified": "2024-05-03T23:44:55.671239",
            "microdata": false,
            "dataset_id": "a671790e-024b-469b-858b-d6923b64fb25",
            "resource_type": "file.upload",
            "name": "Conflict Data for Brazil",
            "mimetype": "",
            "size": "972.4K"
        },
        {
            "created": "2020-04-22T07:26:51.083381",
            "description": "Cut down data for QuickCharts",
            "format": "CSV",
            "download_url": "https://data.humdata.org/dataset/a671790e-024b-469b-858b-d6923b64fb25/resource/5f730293-507c-410f-be49-94367f9605da/download/qc_conflict_data_bra.csv",
            "id": "5f730293-507c-410f-be49-94367f9605da",
            "last_modified": "2024-05-03T23:44:53.280865",
            "metadata_modified": "2024-05-03T23:44:56.057795",
            "microdata": false,
            "dataset_id": "a671790e-024b-469b-858b-d6923b64fb25",
            "resource_type": "file.upload",
            "name": "QuickCharts-Conflict Data for Brazil",
            "mimetype": "",
            "size": "34.4K"
        }
    ]
}