{
    "id": "09f9a766-d24c-4376-b923-726bede4059d",
    "title": "Brazil Healthsites",
    "name": "brazil-healthsites",
    "notes": "This dataset shows the list of operating health facilities. Attributes included: Name,Nature of Facility, Activities, Lat, Long",
    "dataset_source": "OpenStreetMap contributors",
    "organization": "Global Healthsites Mapping Project",
    "dataset_date": "[2008-12-01T00:00:00 TO 2024-02-08T23:59:59]",
    "last_modified": "2024-02-08T16:34:49.970383",
    "data_update_frequency": "Every three months",
    "groups": [
        "Brazil"
    ],
    "license_title": "ODbL",
    "methodology": "Social Media and institutional sharing",
    "methodology_other": null,
    "caveats": "Refer to the project wiki link in the Healthsites description.",
    "tags": [
        "health facilities",
        "hxl"
    ],
    "resources": [
        {
            "created": "2024-02-08T16:34:50.195180",
            "description": "Brazil healthsites shapefiles",
            "format": "SHP",
            "download_url": "https://data.humdata.org/dataset/09f9a766-d24c-4376-b923-726bede4059d/resource/36dc69d1-09a4-4e12-bcae-0a4e1ecaec4d/download/brazil-shapefiles.zip",
            "id": "36dc69d1-09a4-4e12-bcae-0a4e1ecaec4d",
            "last_modified": "2024-02-08T16:34:48.993418",
            "metadata_modified": "2024-04-24T08:16:12.467481",
            "microdata": false,
            "dataset_id": "09f9a766-d24c-4376-b923-726bede4059d",
            "resource_type": "file.upload",
            "name": "brazil-healthsites-shp",
            "mimetype": "application/zip",
            "size": "1.7M"
        },
        {
            "created": "2024-02-08T16:34:50.195184",
            "description": "Brazil healthsites CSV with HXL tags",
            "format": "CSV",
            "download_url": "https://data.humdata.org/dataset/09f9a766-d24c-4376-b923-726bede4059d/resource/9211f94a-156c-46ec-8a1b-d3fbea0c8303/download/brazil_hxl.csv",
            "id": "9211f94a-156c-46ec-8a1b-d3fbea0c8303",
            "last_modified": "2024-02-08T16:34:49.202347",
            "metadata_modified": "2024-04-24T08:16:12.467691",
            "microdata": false,
            "dataset_id": "09f9a766-d24c-4376-b923-726bede4059d",
            "resource_type": "file.upload",
            "name": "brazil-healthsites-csv-with-hxl-tags",
            "mimetype": "text/csv",
            "size": "6.0M"
        },
        {
            "created": "2024-02-08T16:34:50.195186",
            "description": "Brazil healthsites geojson",
            "format": "GeoJSON",
            "download_url": "https://data.humdata.org/dataset/09f9a766-d24c-4376-b923-726bede4059d/resource/b149c162-8f6c-42fd-8fef-930c5c0f4015/download/brazil.geojson",
            "id": "b149c162-8f6c-42fd-8fef-930c5c0f4015",
            "last_modified": "2024-02-08T16:34:49.429608",
            "metadata_modified": "2024-04-24T08:16:12.467849",
            "microdata": false,
            "dataset_id": "09f9a766-d24c-4376-b923-726bede4059d",
            "resource_type": "file.upload",
            "name": "brazil-healthsites-geojson",
            "mimetype": "application/vnd.geo+json",
            "size": "32.0M"
        },
        {
            "created": "2024-02-08T16:34:50.195188",
            "description": "Brazil healthsites geojson with HXL tags",
            "format": "GeoJSON",
            "download_url": "https://data.humdata.org/dataset/09f9a766-d24c-4376-b923-726bede4059d/resource/57778dc8-4a27-401b-9d4d-a105e37b4295/download/brazil_hxl.geojson",
            "id": "57778dc8-4a27-401b-9d4d-a105e37b4295",
            "last_modified": "2024-02-08T16:34:49.771219",
            "metadata_modified": "2024-04-24T08:16:12.467999",
            "microdata": false,
            "dataset_id": "09f9a766-d24c-4376-b923-726bede4059d",
            "resource_type": "file.upload",
            "name": "brazil-healthsites-hxl-geojson",
            "mimetype": "application/vnd.geo+json",
            "size": "36.4M"
        },
        {
            "created": "2024-02-08T16:34:50.195189",
            "description": "Brazil healthsites CSV",
            "format": "CSV",
            "download_url": "https://data.humdata.org/dataset/09f9a766-d24c-4376-b923-726bede4059d/resource/d610ad21-ed34-4f5d-8b0e-790883925c08/download/brazil.csv",
            "id": "d610ad21-ed34-4f5d-8b0e-790883925c08",
            "last_modified": "2024-02-08T16:34:49.970383",
            "metadata_modified": "2024-04-24T08:16:12.468142",
            "microdata": false,
            "dataset_id": "09f9a766-d24c-4376-b923-726bede4059d",
            "resource_type": "file.upload",
            "name": "brazil-healthsites-csv",
            "mimetype": "text/csv",
            "size": "6.0M"
        }
    ]
}