{
    "id": "d6e52fbf-888a-4887-889e-69660f4488c0",
    "title": "Brazil - Livelihoods Programme Monitoring Beneficiary Survey, 2019",
    "name": "unhcr-bra-2019-lis-data-v1-1",
    "notes": "    The UNHCR Livelihoods Monitoring Framework takes a program-based approach to monitoring, with the aim of tracking both outputs and the impact of UNHCR dollars spent on programming (either via partners or through direct implementation).  The process for developing the indicators began in 2015 with a review of existing tools and approaches. Consultations were held with governments, the private sector, field-based staff and civil society partners to devise a set of common, standardized measures rooted in global good practices. Since 2017, a data collection (survey) has been rolled out globally, and the participating operations conducted a household surveys to a sample of beneficiaries of each livelihoods project implemented by UNHCR and its partner. The dataset consists of baseline and endline data from the same sample beneficiaries, in order to compare before and after the project implementation and thus to measure the impact. More info is available on the official website: https://lis.unhcr.org",
    "dataset_source": "UNHCR",
    "organization": "UNHCR - The UN Refugee Agency",
    "dataset_date": "[2019-01-01T00:00:00 TO 2019-12-31T23:59:59]",
    "last_modified": "2021-04-10T00:00:00",
    "data_update_frequency": "Never",
    "groups": [
        "Brazil"
    ],
    "license_title": "Other",
    "methodology": "Other",
    "methodology_other": "Kind of Data:   \nUnit of Analysis:   \nSampling Procedure: The sampling was conducted by each participating operations based on general sampling guidance provided as the following: \n- At least 100 randomly selected beneficiaries for each project \n- Representativeness of sub-groups (gender, camp, etc.) should be kept as much as possible \n- Baseline and endline beneficiaries should be the same  \nData Collection Mode: Face-to-face [f2f]  \n",
    "caveats": "The data must be requested via the resource download link",
    "tags": [
        "agriculture-livestock",
        "employment",
        "livelihoods",
        "operational capacity",
        "survey"
    ],
    "resources": [
        {
            "created": "2021-04-11T01:29:38.275638",
            "description": "Clicking \"Download\" leads outside HDX where you can request access to the data in csv, xlsx &amp; dta formats",
            "format": "Web App",
            "download_url": "https://microdata.unhcr.org/index.php/auth/login/?destination=catalog/330/get-microdata",
            "id": "48dfbc5b-8290-4a19-8eec-9dd617818bdb",
            "last_modified": "2021-04-10T00:00:00",
            "metadata_modified": "2023-07-30T02:05:49.808350",
            "microdata": false,
            "dataset_id": "d6e52fbf-888a-4887-889e-69660f4488c0",
            "resource_type": "api",
            "name": "Brazil - Livelihoods Programme Monitoring Beneficiary Survey, 2019",
            "mimetype": null,
            "size": null
        },
        {
            "created": "2021-04-11T01:29:38.275645",
            "description": "Contains information about the dataset's metadata and data",
            "format": "PDF",
            "download_url": "https://microdata.unhcr.org/index.php/catalog/330/pdf-documentation",
            "id": "b50e597d-55e7-4cc0-9a1d-e7a3504c2913",
            "last_modified": "2021-04-10T00:00:00",
            "metadata_modified": "2023-07-30T02:05:49.808493",
            "microdata": false,
            "dataset_id": "d6e52fbf-888a-4887-889e-69660f4488c0",
            "resource_type": "api",
            "name": "Codebook",
            "mimetype": null,
            "size": null
        }
    ]
}