{
    "id": "5572208c-9bbb-42d2-b4cb-8974bebc76c5",
    "title": "Social Connections Survey",
    "name": "social-connections-survey",
    "notes": "Gallup, Meta and a group of academic advisors collaborated to design and conduct the Social Connections Survey, which offers a first look at how social connections vary across diverse geographic regions. The survey was administered through face-to-face or phone interviews with people aged 15 and older in seven countries. The data provides an in-depth look at the extent to which people feel connected, socially supported and lonely in different parts of the world. The data also sheds new light on the characteristics of people\u2019s social connections, the ways people interact with others, the groups with whom they have frequent contact, and how they connect with others to get support when they need it. Please see the State of Social Connections Study on the Data for Good website for more information and a report with key findings. Aggregate country-level data for each item in the survey is publicly available below. Controlled access microdata is available for request through the Data for Good Program at Meta.",
    "dataset_source": "Data for Good at Meta (previously Facebook)",
    "organization": "Data for Good at Meta",
    "dataset_date": "[2022-04-01T00:00:00 TO 2022-06-30T23:59:59]",
    "last_modified": "2022-10-20T15:52:09.337276",
    "data_update_frequency": "As needed",
    "groups": [
        "Brazil",
        "Egypt",
        "France",
        "India",
        "Indonesia",
        "Mexico",
        "United States"
    ],
    "license_title": "Creative Commons Attribution International",
    "methodology": "Other",
    "methodology_other": "Meta and Gallup implemented a collaborative, iterative process, following best practices, to create the survey instrument. This included an academic literature review, cognitive interviews, and expert consultation. For the final survey, Gallup interviewed a minimum of 2,000 people aged 15 or older in each country between April and June 2022. Interviews were conducted face-to-face at respondents\u2019 homes in Brazil, Egypt, India, Indonesia and Mexico, and via landline and mobile telephone in France and the United States. All samples were probability-based and representative of the national population within each country. The data within each country was weighted to minimize bias and project the sample data to its corresponding target population (see the [State of Social Connections Methodology Report](https://dataforgood.facebook.com/dfg/resources/state-of-social-connections-methodology-report) for more detail). All data is de-identified and only country-level data is shared publicly.",
    "caveats": "Citation: Data for Good at Meta. 2022. Social Connections Survey. Accessed DAY MONTH YEAR.",
    "tags": [
        "demographics",
        "health"
    ],
    "resources": [
        {
            "created": "2022-10-20T15:52:07.984972",
            "description": "Aggregated country-level data for the Social Connections Survey, conducted between April and June 2022.",
            "format": "CSV",
            "download_url": "https://data.humdata.org/dataset/5572208c-9bbb-42d2-b4cb-8974bebc76c5/resource/c8774fa5-d5b3-4d1a-8476-633e8d9f30c3/download/sosc_2022_10_19_aggregate_data_weighted.csv",
            "id": "c8774fa5-d5b3-4d1a-8476-633e8d9f30c3",
            "last_modified": "2022-10-20T15:52:07.478931",
            "metadata_modified": "2022-10-20T15:52:35.359265",
            "microdata": false,
            "dataset_id": "5572208c-9bbb-42d2-b4cb-8974bebc76c5",
            "resource_type": "file.upload",
            "name": "sosc_2022_10_19_aggregate_data_weighted.csv",
            "mimetype": "text/csv",
            "size": "797.6K"
        },
        {
            "created": "2022-10-03T16:02:08.034742",
            "description": "Codebook for the Social Connections Survey, conducted between April and June 2022.",
            "format": "CSV",
            "download_url": "https://data.humdata.org/dataset/5572208c-9bbb-42d2-b4cb-8974bebc76c5/resource/00de0000-1bc9-49af-a2ef-ce2f96f575cd/download/sosc_2022_10_19_codebook_aggregate.csv",
            "id": "00de0000-1bc9-49af-a2ef-ce2f96f575cd",
            "last_modified": "2022-10-20T15:52:09.337276",
            "metadata_modified": "2022-10-20T15:52:27.585488",
            "microdata": false,
            "dataset_id": "5572208c-9bbb-42d2-b4cb-8974bebc76c5",
            "resource_type": "file.upload",
            "name": "sosc_2022_10_19_codebook_aggregate.csv",
            "mimetype": "text/csv",
            "size": "22.6K"
        }
    ]
}