{
    "id": "60490ae7-44e6-44f3-b0f4-e11442aac24e",
    "title": "Brazil - Subnational Administrative Boundaries",
    "name": "geoboundaries-admin-boundaries-for-brazil",
    "notes": "This dataset contains the following administrative boundaries: ADM0, ADM1, ADM2.   Produced and maintained since 2017, the geoBoundaries Global Database of Political Administrative Boundaries Database www.geoboundaries.org is an open license, standardized resource of boundaries (i.e., state, county) for every country in the world.  ",
    "dataset_source": "Instituto Brasileiro de Geografia e Estat\u00edstica (IBGE)Instituto Brasileiro de Geografia e Estat\u00edstica (IBGE), OCHA ROLACOpenStreetMap, Wambacher",
    "organization": "geoBoundaries",
    "dataset_date": "[2017-01-01T00:00:00 TO 2020-12-31T23:59:59]",
    "last_modified": "2022-01-06T14:09:56.337288",
    "data_update_frequency": "Live",
    "groups": [
        "Brazil"
    ],
    "license_title": "Open Database License (ODC-ODbL)",
    "methodology": "Other",
    "methodology_other": "All stages of data collection and processing are publicly available, as described in both [peer-reviewed academic outlets](https://journals.plos.org/plosone/article?id=10.1371/journal.pone.0231866) and in the public code base available through [GitHub](https://github.com/wmgeolab/geoBoundaries).",
    "caveats": "[Acknowledgement](https://www.geoboundaries.org/index.html#citation) of the geoBoundaries project is required for the use of this data.",
    "tags": [
        "administrative boundaries-divisions",
        "gazetteer",
        "geodata"
    ],
    "resources": [
        {
            "created": "2022-01-06T14:04:35.726362",
            "description": "Simplified GeoJSON ADM0 boundaries for Brazil",
            "format": "GeoJSON",
            "download_url": "https://github.com/wmgeolab/geoBoundaries/raw/905b0ba/releaseData/gbOpen/BRA/ADM0/geoBoundaries-BRA-ADM0_simplified.geojson",
            "id": "4d6b1e7d-e643-43ad-918c-af097e84f209",
            "last_modified": "2022-01-06T14:04:35.708548",
            "metadata_modified": "2023-07-31T00:29:20.913411",
            "microdata": false,
            "dataset_id": "60490ae7-44e6-44f3-b0f4-e11442aac24e",
            "resource_type": "api",
            "name": "geoBoundaries-BRA-ADM0_simplified.geojson",
            "mimetype": null,
            "size": "0.0B"
        },
        {
            "created": "2022-01-06T14:04:35.726369",
            "description": "GeoJSON ADM0 boundaries for Brazil",
            "format": "GeoJSON",
            "download_url": "https://github.com/wmgeolab/geoBoundaries/raw/905b0ba/releaseData/gbOpen/BRA/ADM0/geoBoundaries-BRA-ADM0.geojson",
            "id": "bd8a7ee5-1c15-455e-9138-a9d4fcb3f52c",
            "last_modified": "2022-01-06T14:09:56.335352",
            "metadata_modified": "2023-07-31T00:29:23.272147",
            "microdata": false,
            "dataset_id": "60490ae7-44e6-44f3-b0f4-e11442aac24e",
            "resource_type": "api",
            "name": "geoBoundaries-BRA-ADM0.geojson",
            "mimetype": null,
            "size": "0.0B"
        },
        {
            "created": "2022-01-06T14:04:35.726372",
            "description": "TopoJSON ADM0 boundaries for Brazil",
            "format": "GeoJSON",
            "download_url": "https://github.com/wmgeolab/geoBoundaries/raw/905b0ba/releaseData/gbOpen/BRA/ADM0/geoBoundaries-BRA-ADM0.topojson",
            "id": "dc4fe2f3-b12e-46c4-9180-36f4c0169ad0",
            "last_modified": "2022-01-06T14:09:56.335557",
            "metadata_modified": "2023-07-31T00:29:24.787694",
            "microdata": false,
            "dataset_id": "60490ae7-44e6-44f3-b0f4-e11442aac24e",
            "resource_type": "api",
            "name": "geoBoundaries-BRA-ADM0.topojson",
            "mimetype": null,
            "size": "0.0B"
        },
        {
            "created": "2022-01-06T14:04:35.726375",
            "description": "Other formats including shape file ADM0 boundaries for Brazil",
            "format": "SHP",
            "download_url": "https://github.com/wmgeolab/geoBoundaries/raw/0af4921/releaseData/gbOpen/BRA/ADM0/geoBoundaries-BRA-ADM0-all.zip",
            "id": "d51d5c76-5b02-4491-a5f9-6e620264be19",
            "last_modified": "2022-01-06T14:09:56.335752",
            "metadata_modified": "2023-07-31T00:29:26.166715",
            "microdata": false,
            "dataset_id": "60490ae7-44e6-44f3-b0f4-e11442aac24e",
            "resource_type": "api",
            "name": "geoBoundaries-BRA-ADM0-all.zip",
            "mimetype": null,
            "size": "0.0B"
        },
        {
            "created": "2022-01-06T14:04:35.726378",
            "description": "Simplified GeoJSON ADM1 boundaries for Brazil",
            "format": "GeoJSON",
            "download_url": "https://github.com/wmgeolab/geoBoundaries/raw/905b0ba/releaseData/gbOpen/BRA/ADM1/geoBoundaries-BRA-ADM1_simplified.geojson",
            "id": "b354b4e4-9bfd-4228-bd82-a877a2b96cf6",
            "last_modified": "2022-01-06T14:09:56.335941",
            "metadata_modified": "2023-07-31T00:29:29.711049",
            "microdata": false,
            "dataset_id": "60490ae7-44e6-44f3-b0f4-e11442aac24e",
            "resource_type": "api",
            "name": "geoBoundaries-BRA-ADM1_simplified.geojson",
            "mimetype": null,
            "size": "0.0B"
        },
        {
            "created": "2022-01-06T14:04:35.726381",
            "description": "GeoJSON ADM1 boundaries for Brazil",
            "format": "GeoJSON",
            "download_url": "https://github.com/wmgeolab/geoBoundaries/raw/905b0ba/releaseData/gbOpen/BRA/ADM1/geoBoundaries-BRA-ADM1.geojson",
            "id": "61d5b726-48b4-4e54-afa3-111893fb1143",
            "last_modified": "2022-01-06T14:09:56.336133",
            "metadata_modified": "2023-07-31T00:29:34.143704",
            "microdata": false,
            "dataset_id": "60490ae7-44e6-44f3-b0f4-e11442aac24e",
            "resource_type": "api",
            "name": "geoBoundaries-BRA-ADM1.geojson",
            "mimetype": null,
            "size": "0.0B"
        },
        {
            "created": "2022-01-06T14:04:35.726383",
            "description": "TopoJSON ADM1 boundaries for Brazil",
            "format": "GeoJSON",
            "download_url": "https://github.com/wmgeolab/geoBoundaries/raw/905b0ba/releaseData/gbOpen/BRA/ADM1/geoBoundaries-BRA-ADM1.topojson",
            "id": "69f8dfa0-b643-470a-b6ce-0dc6380b7193",
            "last_modified": "2022-01-06T14:09:56.336312",
            "metadata_modified": "2023-07-31T00:29:28.289214",
            "microdata": false,
            "dataset_id": "60490ae7-44e6-44f3-b0f4-e11442aac24e",
            "resource_type": "api",
            "name": "geoBoundaries-BRA-ADM1.topojson",
            "mimetype": null,
            "size": "0.0B"
        },
        {
            "created": "2022-01-06T14:04:35.726386",
            "description": "Other formats including shape file ADM1 boundaries for Brazil",
            "format": "SHP",
            "download_url": "https://github.com/wmgeolab/geoBoundaries/raw/0af4921/releaseData/gbOpen/BRA/ADM1/geoBoundaries-BRA-ADM1-all.zip",
            "id": "4e1cb84a-0e84-4565-8278-d297a0237edf",
            "last_modified": "2022-01-06T14:09:56.336483",
            "metadata_modified": "2023-07-31T00:29:31.226516",
            "microdata": false,
            "dataset_id": "60490ae7-44e6-44f3-b0f4-e11442aac24e",
            "resource_type": "api",
            "name": "geoBoundaries-BRA-ADM1-all.zip",
            "mimetype": null,
            "size": "0.0B"
        },
        {
            "created": "2022-01-06T14:04:35.726388",
            "description": "Simplified GeoJSON ADM2 boundaries for Brazil",
            "format": "GeoJSON",
            "download_url": "https://github.com/wmgeolab/geoBoundaries/raw/905b0ba/releaseData/gbOpen/BRA/ADM2/geoBoundaries-BRA-ADM2_simplified.geojson",
            "id": "6ee0a6a3-e510-40ee-9336-eed9fd298aa8",
            "last_modified": "2022-01-06T14:09:56.336649",
            "metadata_modified": "2023-07-31T00:29:42.743878",
            "microdata": false,
            "dataset_id": "60490ae7-44e6-44f3-b0f4-e11442aac24e",
            "resource_type": "api",
            "name": "geoBoundaries-BRA-ADM2_simplified.geojson",
            "mimetype": null,
            "size": "0.0B"
        },
        {
            "created": "2022-01-06T14:04:35.726391",
            "description": "GeoJSON ADM2 boundaries for Brazil",
            "format": "GeoJSON",
            "download_url": "https://github.com/wmgeolab/geoBoundaries/raw/905b0ba/releaseData/gbOpen/BRA/ADM2/geoBoundaries-BRA-ADM2.geojson",
            "id": "51158788-59bc-49b1-8525-125e66e58252",
            "last_modified": "2022-01-06T14:09:56.336836",
            "metadata_modified": "2023-07-31T00:29:48.970448",
            "microdata": false,
            "dataset_id": "60490ae7-44e6-44f3-b0f4-e11442aac24e",
            "resource_type": "api",
            "name": "geoBoundaries-BRA-ADM2.geojson",
            "mimetype": null,
            "size": "0.0B"
        },
        {
            "created": "2022-01-06T14:04:35.726393",
            "description": "TopoJSON ADM2 boundaries for Brazil",
            "format": "GeoJSON",
            "download_url": "https://github.com/wmgeolab/geoBoundaries/raw/905b0ba/releaseData/gbOpen/BRA/ADM2/geoBoundaries-BRA-ADM2.topojson",
            "id": "6596d0b5-0b01-4a7b-98ab-7644a85e4690",
            "last_modified": "2022-01-06T14:09:56.337076",
            "metadata_modified": "2023-07-31T00:29:32.630769",
            "microdata": false,
            "dataset_id": "60490ae7-44e6-44f3-b0f4-e11442aac24e",
            "resource_type": "api",
            "name": "geoBoundaries-BRA-ADM2.topojson",
            "mimetype": null,
            "size": "0.0B"
        },
        {
            "created": "2022-01-06T14:04:35.726441",
            "description": "Other formats including shape file ADM2 boundaries for Brazil",
            "format": "SHP",
            "download_url": "https://github.com/wmgeolab/geoBoundaries/raw/0af4921/releaseData/gbOpen/BRA/ADM2/geoBoundaries-BRA-ADM2-all.zip",
            "id": "e2c6ed1c-e676-44bc-b16b-183c25765bcf",
            "last_modified": "2022-01-06T14:09:56.337288",
            "metadata_modified": "2023-07-31T00:29:35.755727",
            "microdata": false,
            "dataset_id": "60490ae7-44e6-44f3-b0f4-e11442aac24e",
            "resource_type": "api",
            "name": "geoBoundaries-BRA-ADM2-all.zip",
            "mimetype": null,
            "size": "0.0B"
        }
    ]
}