{
    "id": "e9988552-74e4-4ff4-943f-c782ac8bca87",
    "title": "Facebook Social Connectedness Index",
    "name": "social-connectedness-index",
    "notes": "We use an anonymized snapshot of all active Facebook users and their friendship networks to measure the intensity of connectedness between locations. The Social Connectedness Index (SCI) is a measure of the social connectedness between different geographies. Specifically, it measures the relative probability that two individuals across two locations are friends with each other on Facebook. Details on the underlying data and the construction of the index are provided in the \u201cFacebook Social Connectedness Index - Data Notes.pdf\u201d file. Please also see https://dataforgood.facebook.com/ as well as the associated research paper \u201cSocial Connectedness: Measurement, Determinants and Effects,\u201d published in the Journal of Economic Perspectives (https://www.aeaweb.org/articles?id=10.1257/jep.32.3.259). Region identifiers are taken from GADM v2.8 https://gadm.org/download_country_v2.html. Future versions will update IDs to be compatible with the newest GADM version.",
    "dataset_source": "Facebook",
    "organization": "Data for Good at Meta",
    "dataset_date": "[2021-10-13T00:00:00 TO 2021-10-13T23:59:59]",
    "last_modified": "2024-03-15T14:32:57.199816",
    "data_update_frequency": "As needed",
    "groups": [
        "Albania",
        "Algeria",
        "Angola",
        "Antigua and Barbuda",
        "Argentina",
        "Armenia",
        "Aruba",
        "Australia",
        "Austria",
        "Azerbaijan",
        "Bahamas",
        "Bahrain",
        "Bangladesh",
        "Barbados",
        "Belarus",
        "Belgium",
        "Belize",
        "Benin",
        "Bhutan",
        "Bolivia (Plurinational State of)",
        "Bosnia and Herzegovina",
        "Botswana",
        "Brazil",
        "Brunei Darussalam",
        "Bulgaria",
        "Burkina Faso",
        "Burundi",
        "Cabo Verde",
        "Cambodia",
        "Cameroon",
        "Canada",
        "Cayman Islands",
        "Central African Republic",
        "Chad",
        "Chile",
        "China, Hong Kong Special Administrative Region",
        "China, Macao Special Administrative Region",
        "Colombia",
        "Comoros",
        "Congo",
        "Costa Rica",
        "C\u00f4te d'Ivoire",
        "Croatia",
        "Cura\u00e7ao",
        "Cyprus",
        "Czechia",
        "Democratic Republic of the Congo",
        "Denmark",
        "Djibouti",
        "Dominican Republic",
        "Ecuador",
        "Egypt",
        "El Salvador",
        "Equatorial Guinea",
        "Estonia",
        "Eswatini",
        "Ethiopia",
        "Fiji",
        "Finland",
        "France",
        "French Guiana",
        "French Polynesia",
        "Gabon",
        "Gambia",
        "Georgia",
        "Germany",
        "Ghana",
        "Greece",
        "Grenada",
        "Guadeloupe",
        "Guam",
        "Guatemala",
        "Guinea",
        "Guinea-Bissau",
        "Guyana",
        "Haiti",
        "Honduras",
        "Hungary",
        "Iceland",
        "India",
        "Indonesia",
        "Ireland",
        "Isle of Man",
        "Italy",
        "Jamaica",
        "Japan",
        "Jersey",
        "Jordan",
        "Kazakhstan",
        "Kenya",
        "Kiribati",
        "Kuwait",
        "Kyrgyzstan",
        "Lao People's Democratic Republic",
        "Latvia",
        "Lebanon",
        "Lesotho",
        "Liberia",
        "Libya",
        "Lithuania",
        "Luxembourg",
        "Madagascar",
        "Malawi",
        "Malaysia",
        "Maldives",
        "Mali",
        "Malta",
        "Martinique",
        "Mauritania",
        "Mauritius",
        "Mayotte",
        "Mexico",
        "Mongolia",
        "Montenegro",
        "Morocco",
        "Mozambique",
        "Myanmar",
        "Namibia",
        "Nepal",
        "Netherlands",
        "New Caledonia",
        "New Zealand",
        "Nicaragua",
        "Niger",
        "Nigeria",
        "North Macedonia",
        "Norway",
        "Oman",
        "Pakistan",
        "Panama",
        "Papua New Guinea",
        "Paraguay",
        "Peru",
        "Philippines",
        "Poland",
        "Portugal",
        "Puerto Rico",
        "Qatar",
        "Republic of Korea",
        "Republic of Moldova",
        "R\u00e9union",
        "Romania",
        "Rwanda",
        "Saint Lucia",
        "Saint Vincent and the Grenadines",
        "Samoa",
        "Sao Tome and Principe",
        "Saudi Arabia",
        "Senegal",
        "Serbia",
        "Seychelles",
        "Sierra Leone",
        "Singapore",
        "Slovakia",
        "Slovenia",
        "Solomon Islands",
        "South Africa",
        "Spain",
        "Sri Lanka",
        "Suriname",
        "Sweden",
        "Switzerland",
        "Taiwan (Province of China)",
        "Tajikistan",
        "Thailand",
        "Timor-Leste",
        "Togo",
        "Tonga",
        "Trinidad and Tobago",
        "Tunisia",
        "T\u00fcrkiye",
        "Uganda",
        "Ukraine",
        "United Arab Emirates",
        "United Kingdom",
        "United Republic of Tanzania",
        "United States",
        "Uruguay",
        "Uzbekistan",
        "Vanuatu",
        "Viet Nam",
        "World",
        "Zambia",
        "Zimbabwe"
    ],
    "license_title": "Public Domain / No Restrictions",
    "methodology": "Other",
    "methodology_other": "We use an anonymized snapshot of all active Facebook users and their friendship networks to measure the intensity of connectedness between locations. The Social Connectedness Index (SCI) is a measure of the social connectedness between different geographies. Specifically, it measures the relative probability that two individuals across two locations are friends with each other on Facebook.\r\n\r\nDetails on the underlying data and the construction of the index are provided in the \u201cFacebook Social Connectedness Index - Data Notes.pdf\u201d file. Please also see https://dataforgood.fb.com/ as well as the associated research paper \u201cSocial Connectedness: Measurement, Determinants and Effects,\u201d published in the Journal of Economic Perspectives (https://www.aeaweb.org/articles?id=10.1257/jep.32.3.259).\r\n",
    "caveats": "We do not provide older versions of the Social Connectedness Index as we do not recommend it being interpreted as a time series. The methodology for constructing SCI has changed over time (and continues to improve), and we do not backfill for previous dates. ",
    "tags": [
        "social media data"
    ],
    "resources": [
        {
            "created": "2020-06-02T14:34:06.558807",
            "description": "Summary of Facebook's Social Connectedness Index data sets updated in October 2021",
            "format": "PDF",
            "download_url": "https://data.humdata.org/dataset/e9988552-74e4-4ff4-943f-c782ac8bca87/resource/a0c37eb4-b45c-436d-b2b2-c0c9b1974318/download/documentation-fb-social-connectedness-index-october-2021.pdf",
            "id": "a0c37eb4-b45c-436d-b2b2-c0c9b1974318",
            "last_modified": "2021-10-13T14:47:13.818678",
            "metadata_modified": "2022-07-13T10:00:54.279889",
            "microdata": false,
            "dataset_id": "e9988552-74e4-4ff4-943f-c782ac8bca87",
            "resource_type": "file.upload",
            "name": "Documentation - FB Social Connectedness Index - October 2021.pdf",
            "mimetype": "application/pdf",
            "size": "433.6K"
        },
        {
            "created": "2021-10-14T14:19:05.092787",
            "description": "Each row is a country \u2013 country pair. Countries are denoted by their ISO2 codes. Excludes certain countries, for example countries where Facebook is banned or countries with few active users.",
            "format": "TSV",
            "download_url": "https://data.humdata.org/dataset/e9988552-74e4-4ff4-943f-c782ac8bca87/resource/35ca6ade-a5bd-4782-b266-797169dca74b/download/countries-countries-fb-social-connectedness-index-october-2021.tsv",
            "id": "35ca6ade-a5bd-4782-b266-797169dca74b",
            "last_modified": "2021-12-14T17:58:58.256996",
            "metadata_modified": "2024-03-15T14:32:53.843135",
            "microdata": false,
            "dataset_id": "e9988552-74e4-4ff4-943f-c782ac8bca87",
            "resource_type": "file.upload",
            "name": "Countries-Countries - FB Social Connectedness Index - October 2021.tsv",
            "mimetype": "text/tab-separated-values",
            "size": "359.3K"
        },
        {
            "created": "2021-10-14T14:19:14.888679",
            "description": "Each row is a US county \u2013 country pair. Counties are denoted by their 5-digit FIPS code, countries are denoted by ISO2 code. Excludes counties and countries with few active users.",
            "format": "TSV",
            "download_url": "https://data.humdata.org/dataset/e9988552-74e4-4ff4-943f-c782ac8bca87/resource/868a2fdb-f5c8-4a98-af7c-cfc8bf0daeb3/download/us-counties-countries-fb-social-connectedness-index-october-2021.tsv",
            "id": "868a2fdb-f5c8-4a98-af7c-cfc8bf0daeb3",
            "last_modified": "2021-12-14T17:59:09.711299",
            "metadata_modified": "2024-03-15T14:32:53.843230",
            "microdata": false,
            "dataset_id": "e9988552-74e4-4ff4-943f-c782ac8bca87",
            "resource_type": "file.upload",
            "name": "US counties-Countries - FB Social Connectedness Index - October 2021.tsv",
            "mimetype": "text/tab-separated-values",
            "size": "8.1M"
        },
        {
            "created": "2021-10-14T14:19:39.783731",
            "description": "Each row is a US county \u2013 US county pair. Counties are denoted by their 5-digit FIPS code. Excludes counties with few active users.",
            "format": "TSV",
            "download_url": "https://data.humdata.org/dataset/e9988552-74e4-4ff4-943f-c782ac8bca87/resource/c59fd5ac-0458-4e83-b6be-5334f0ea9a69/download/us-counties-us-counties-fb-social-connectedness-index-october-2021.zip",
            "id": "c59fd5ac-0458-4e83-b6be-5334f0ea9a69",
            "last_modified": "2021-10-14T14:19:36.312298",
            "metadata_modified": "2024-03-15T14:32:53.843317",
            "microdata": false,
            "dataset_id": "e9988552-74e4-4ff4-943f-c782ac8bca87",
            "resource_type": "file.upload",
            "name": "US counties-US counties - FB Social Connectedness Index - October 2021.zip",
            "mimetype": "application/zip",
            "size": "47.1M"
        },
        {
            "created": "2021-10-14T15:22:07.588387",
            "description": "Built on the Database of Global Administrative Areas (GADM, version 2.8) and the European Nomenclature of Territorial Units for Statistics (NUTS 2016) areas. Excludes regions with few active users. European countries are divided into their NUTS2 regions (e.g., 12 provinces in the Netherlands). Countries outside of Europe are divided into their GADM level 1 regions (e.g., states in the US). Countries with a population less than 1 million are not divided. Each row is a pair of these areas.",
            "format": "TSV",
            "download_url": "https://data.humdata.org/dataset/e9988552-74e4-4ff4-943f-c782ac8bca87/resource/5de92e01-606e-4e4d-ad7c-4a3d493a0cc3/download/gadm1_nuts2-gadm1_nuts2-fb-social-connectedness-index-october-2021.tsv",
            "id": "5de92e01-606e-4e4d-ad7c-4a3d493a0cc3",
            "last_modified": "2021-12-14T17:59:55.254088",
            "metadata_modified": "2024-03-15T14:32:53.843401",
            "microdata": false,
            "dataset_id": "e9988552-74e4-4ff4-943f-c782ac8bca87",
            "resource_type": "file.upload",
            "name": "gadm1_nuts2-gadm1_nuts2 - FB Social Connectedness Index - October 2021.tsv",
            "mimetype": "text/tab-separated-values",
            "size": "79.5M"
        },
        {
            "created": "2021-10-14T15:23:48.903690",
            "description": "Built on the Database of Global Administrative Areas (GADM, version 2.8) and the European Nomenclature of Territorial Units for Statistics (NUTS 2016) areas. Excludes regions with few active users. European countries are divided into their NUTS3 regions (e.g., 40 regions in the Netherlands). The United States, Canada, and some countries in South Asia (Bangladesh, India, Nepal, Pakistan, and Sri Lanka) are divided into their GADM level 2 regions (e.g., US counties). Other countries are usually divided into their GADM level 1 region. Countries with a population less than 1 million are not divided. Each row is a pair of these areas.",
            "format": "TSV",
            "download_url": "https://data.humdata.org/dataset/e9988552-74e4-4ff4-943f-c782ac8bca87/resource/dd9753a9-188d-4c65-a9a1-b25d6bca0621/download/gadm1_nuts3_counties-gadm1_nuts3_counties-fb-social-connectedness-index-october-2021.zip",
            "id": "dd9753a9-188d-4c65-a9a1-b25d6bca0621",
            "last_modified": "2021-12-15T20:36:04.833038",
            "metadata_modified": "2024-03-15T14:32:53.843484",
            "microdata": false,
            "dataset_id": "e9988552-74e4-4ff4-943f-c782ac8bca87",
            "resource_type": "file.upload",
            "name": "gadm1_nuts3_counties-gadm1_nuts3_counties - FB Social Connectedness Index - October 2021.zip",
            "mimetype": "application/zip",
            "size": "180.9M"
        },
        {
            "created": "2021-10-19T10:14:35.339467",
            "description": "Each row is a US ZCTA (zip code tabulation) \u2013 US ZCTA pair. Excludes ZCTAs with few active users. Due to the large size of this data set, it is split across ten files. The files are split according to the first digit of the zip code for location i. For instance, all pairs in which the first zip code begins with the digit 7 will be contained in file 7 .",
            "format": "TSV",
            "download_url": "https://data.humdata.org/dataset/e9988552-74e4-4ff4-943f-c782ac8bca87/resource/3fff416a-824a-43a3-a6cd-aab2880ce684/download/us-zip-code-us-zip-code-fb-social-connectedness-index-october-2021.zip",
            "id": "3fff416a-824a-43a3-a6cd-aab2880ce684",
            "last_modified": "2021-10-19T10:14:34.019801",
            "metadata_modified": "2024-03-15T14:32:53.843566",
            "microdata": false,
            "dataset_id": "e9988552-74e4-4ff4-943f-c782ac8bca87",
            "resource_type": "file.upload",
            "name": "US zip code-US zip code - FB Social Connectedness Index - October 2021.zip",
            "mimetype": "application/zip",
            "size": "8.0G"
        },
        {
            "created": "2024-03-15T14:32:54.022448",
            "description": "Useful reference for the administrative regions used in this dataset",
            "format": "CSV",
            "download_url": "https://data.humdata.org/dataset/e9988552-74e4-4ff4-943f-c782ac8bca87/resource/749786b6-4fd9-4f5d-8bd0-5cbb06e9759b/download/gadm1_nuts2_levels.csv",
            "id": "749786b6-4fd9-4f5d-8bd0-5cbb06e9759b",
            "last_modified": "2024-03-15T14:32:53.659896",
            "metadata_modified": "2024-03-15T14:34:46.268693",
            "microdata": false,
            "dataset_id": "e9988552-74e4-4ff4-943f-c782ac8bca87",
            "resource_type": "file.upload",
            "name": "gadm1_nuts2_levels.csv",
            "mimetype": "text/csv",
            "size": "27.4K"
        },
        {
            "created": "2024-03-15T14:32:57.708149",
            "description": "Useful reference for the administrative regions used in this dataset",
            "format": "CSV",
            "download_url": "https://data.humdata.org/dataset/e9988552-74e4-4ff4-943f-c782ac8bca87/resource/598c0219-d863-4c64-a510-47012f96d641/download/gadm1_nuts3_counties_levels.csv",
            "id": "598c0219-d863-4c64-a510-47012f96d641",
            "last_modified": "2024-03-15T14:32:57.199816",
            "metadata_modified": "2024-03-15T14:34:53.843825",
            "microdata": false,
            "dataset_id": "e9988552-74e4-4ff4-943f-c782ac8bca87",
            "resource_type": "file.upload",
            "name": "gadm1_nuts3_counties_levels.csv",
            "mimetype": "text/csv",
            "size": "110.0K"
        }
    ]
}