{
    "id": "6cbc0c90-f232-4d1c-83f1-f0435561fb5a",
    "title": "Brazil: Restaurants establishments in Ouro Preto",
    "name": "brazil-restaurants-establishments-in-ouro-preto",
    "notes": "Through the tripadvisor platform, information about restaurants establishments  until 2021 for the city of Ouro Preto was obtained.",
    "dataset_source": "Instituto de Geografia \u2013 USFQ and U.S Department of State",
    "organization": "Hub Latin America",
    "dataset_date": "[2018-01-01T00:00:00 TO 2021-06-18T23:59:59]",
    "last_modified": "2021-10-10T05:05:49.830032",
    "data_update_frequency": "Every year",
    "groups": [
        "Brazil"
    ],
    "license_title": "Creative Commons Attribution Share-Alike",
    "methodology": "Registry",
    "methodology_other": null,
    "caveats": "Created by TripAdvisor",
    "tags": [
        "transportation"
    ],
    "resources": [
        {
            "created": "2021-10-10T05:05:50.254398",
            "description": "Restaurants establishments dedicated to tourism in the city of Ouro Preto",
            "format": "SHP",
            "download_url": "https://data.humdata.org/dataset/6cbc0c90-f232-4d1c-83f1-f0435561fb5a/resource/f7d50b8a-320d-4a54-b360-544bf375e49a/download/p_restaurant_ouropreto.zip",
            "id": "f7d50b8a-320d-4a54-b360-544bf375e49a",
            "last_modified": "2021-10-10T05:05:49.830032",
            "metadata_modified": "2023-03-03T03:55:22.567969",
            "microdata": false,
            "dataset_id": "6cbc0c90-f232-4d1c-83f1-f0435561fb5a",
            "resource_type": "file.upload",
            "name": "P_Restaurant_OuroPreto.zip",
            "mimetype": "application/x-zip-compressed",
            "size": "27.7K"
        }
    ]
}