﻿ID_CLIENT;NOM_CLIENT;AGE;SEXE
CL1;John Doe;28;M
CL2;Jane Smith;32;F
CL3;Michael Johnson;45;M
CL4;Emily Davis;39;F
CL5;David Brown;31;M
CL6;Sarah Wilson;27;F
CL7;Robert Taylor;41;M
CL8;Olivia Moore;36;F
CL9;James Anderson;29;M
CL10;Emma Jackson;33;F
CL11;Matthew Thompson;38;M
CL12;Ava White;34;F
CL13;Liam Harris;30;M
CL14;Sophia Clark;35;F
CL15;Noah Turner;40;M
CL16;Isabella Lewis;26;F
CL17;William Rodriguez;37;M
CL18;Charlotte Hill;31;F
CL19;Benjamin Green;43;M
CL20;Mia Adams;29;F
CL21;Alexander Carter;33;M
CL22;Avery James;38;F
CL23;Ethan Phillips;27;M
CL24;Evelyn Martinez;42;F
CL25;Daniel Evans;34;M
CL26;Sofia Perez;30;F
CL27;Joseph Turner;36;M
CL28;Scarlett Cooper;31;F
CL29;Davidson Rivera;39;M
CL30;Chloe Rogers;35;F
CL31;Michael Hughes;41;M
CL32;Natalie Morgan;26;F
CL33;Matthew Adams;43;M
CL34;Ava Wilson;29;F
CL35;Andrew Martinez;33;M
CL36;Samantha Harris;38;F
CL37;Emma Carter;30;F
CL38;Oliver Johnson;34;M
CL39;Sophia Adams;32;F
CL40;Emily Evans;36;F
CL41;Ethan Turner;40;M
CL42;Samantha Thompson;26;F
CL43;Oliver Clark;34;M
CL44;Charlotte Lewis;31;F
CL45;John Smith;33;M
CL46;Jane Johnson;38;F
CL47;Michael White;27;M
CL48;Emily Perez;42;F
CL49;David Harris;39;M
CL50;Chloe Wilson;35;F
CL51;Matthew Carter;41;M
CL52;Natalie Adams;29;F
CL53;Liam Turner;30;M
CL54;Olivia Thompson;36;F
CL55;Jack Evans;40;M
CL56;Sophia Anderson;28;F
CL57;Oliver Taylor;33;M
CL58;Samantha Moore;39;F
CL59;Emma Davis;35;F
CL60;Noah Martinez;31;M
CL61;Isabella Johnson;37;F
CL62;William Turner;43;M
CL63;Ava Clark;29;F
CL64;Matthew Hill;38;M
CL65;Olivia Martinez;34;F
CL66;David White;31;M
CL67;Ethan Adams;36;M
CL68;Michael Wilson;42;M
CL69;Chloe Johnson;30;F
CL70;Charlotte Perez;33;F
CL71;Samantha Clark;39;F
CL72;Emily Lewis;35;F
CL73;Oliver Thompson;41;M
CL74;Ava Adams;29;F
CL75;Emma Carter;26;F
CL76;John Harris;37;M
CL77;Michael Evans;43;M
CL78;Jane Turner;32;F
CL79;David Davis;38;M
CL80;Sophia Wilson;34;F
CL81;Matthew Hill;40;M
CL82;Olivia Adams;27;F
CL83;Liam Taylor;42;M
CL84;Alexander Clark;39;M
CL85;Charlotte Turner;35;F
CL86;Samantha Anderson;41;F
CL87;Oliver Moore;31;M
CL88;Ethan Johnson;28;M
CL89;Noah Perez;33;M
CL90;Emily Davis;39;F
CL91;Emma Thompson;36;F
CL92;James Clark;45;M
CL93;Ava Lewis;29;F
CL94;Isabella White;32;F
CL95;William Adams;43;M
CL96;Natalie Hill;37;F
CL97;Olivia Turner;41;F
CL98;Michael Carter;45;M
CL99;Emily Anderson;32;F
CL100;Liam Taylor;36;M
