%YAML 1.1
%TAG !u! tag:unity3d.com,2011:
--- !u!162 &1
EditorUserSettings:
  m_ObjectHideFlags: 0
  serializedVersion: 4
  m_ConfigSettings:
    RecentlyUsedSceneGuid-0:
      value: 5a08575f5207595a0f5d59741173094444164f7d7d2a23317c7a4465bbe1646d
      flags: 0
    RecentlyUsedSceneGuid-1:
      value: 0054520707540d0d5e5f5c2448770744144e417b2e2b77627d7a4462b0b66d6d
      flags: 0
    RecentlyUsedSceneGuid-2:
      value: 02020705520c595e5d5f5c7042775e1246151d282f2e7464287d4a6bb6b5353b
      flags: 0
    RecentlyUsedSceneGuid-3:
      value: 54525205040d0b5e0c0b5b7144770d4642151d282d2b70662e2d4c60b0b2606c
      flags: 0
    RecentlyUsedSceneGuid-4:
      value: 5152055e500d5f09555e557613775b134f4e4c28797d27652b784b35bbb06169
      flags: 0
    vcSharedLogLevel:
      value: 0d5e400f0650
      flags: 0
  m_VCAutomaticAdd: 1
  m_VCDebugCom: 0
  m_VCDebugCmd: 0
  m_VCDebugOut: 0
  m_SemanticMergeMode: 2
  m_DesiredImportWorkerCount: 1
  m_StandbyImportWorkerCount: 1
  m_IdleImportWorkerShutdownDelay: 60000
  m_VCShowFailedCheckout: 1
  m_VCOverwriteFailedCheckoutAssets: 1
  m_VCProjectOverlayIcons: 1
  m_VCHierarchyOverlayIcons: 1
  m_VCOtherOverlayIcons: 1
  m_VCAllowAsyncUpdate: 1
  m_ArtifactGarbageCollection: 1
