\relax 
\providecommand\zref@newlabel[2]{}
\providecommand*\new@tpo@label[2]{}
\providecommand\hyper@newdestlabel[2]{}
\providecommand\HyperFirstAtBeginDocument{\AtBeginDocument}
\HyperFirstAtBeginDocument{\ifx\hyper@anchor\@undefined
\global\let\oldnewlabel\newlabel
\gdef\newlabel#1#2{\newlabelxx{#1}#2}
\gdef\newlabelxx#1#2#3#4#5#6{\oldnewlabel{#1}{{#2}{#3}}}
\AtEndDocument{\ifx\hyper@anchor\@undefined
\let\newlabel\oldnewlabel
\fi}
\fi}
\global\let\hyper@last\relax 
\gdef\HyperFirstAtBeginDocument#1{#1}
\providecommand\HyField@AuxAddToFields[1]{}
\providecommand\HyField@AuxAddToCoFields[2]{}
\providecommand\BKM@entry[2]{}
\providecommand\babel@aux[2]{}
\@nameuse{bbl@beforestart}
\catcode `:\active 
\catcode `;\active 
\catcode `!\active 
\catcode `?\active 
\BKM@entry{id=1,open,dest={636861707465722A2E31},srcline={65}}{5C3337365C3337375C303030545C303030615C303030625C3030306C5C303030655C3030305C3034305C303030645C303030655C303030735C3030305C3034305C3030306D5C303030615C303030745C303030695C3030305C3335305C303030725C303030655C30303073}
\providecommand \oddpage@label [2]{}
\@writefile{toc}{\@ifundefined {etoctocstyle}{\let \etoc@startlocaltoc \@gobble \let \etoc@settocdepth \@gobble \let \etoc@depthtag \@gobble \let \etoc@setlocaltop \@gobble }{}}
\providecommand\@newglossary[4]{}
\@newglossary{main}{glg}{gls}{glo}
\babel@aux{french}{}
\@writefile{toc}{\contentsline {chapter}{\nonumberline Table des mati\`eres}{1}{chapter*.1}\protected@file@percent }
\BKM@entry{id=2,open,dest={636861707465722E31},srcline={2}}{5C3337365C3337375C303030415C303030725C303030695C303030745C303030685C3030306D5C3030305C3335315C303030745C303030695C303030715C303030755C30303065}
\BKM@entry{id=3,open,dest={73656374696F6E2E312E31},srcline={5}}{5C3337365C3337375C303030445C303030695C303030765C303030695C303030735C303030695C3030306F5C3030306E5C3030305C3034305C303030655C303030755C303030635C3030306C5C303030695C303030645C303030695C303030655C3030306E5C3030306E5C30303065}
\BKM@entry{id=4,open,dest={73656374696F6E2E312E31},srcline={5}}{5C3337365C3337375C303030445C303030695C303030765C303030695C303030735C303030695C3030306F5C3030306E5C3030305C3034305C303030655C303030755C303030635C3030306C5C303030695C303030645C303030695C303030655C3030306E5C3030306E5C30303065}
\BKM@entry{id=5,open,dest={73656374696F6E2E312E32},srcline={46}}{5C3337365C3337375C303030415C303030725C303030695C303030745C303030685C3030306D5C3030305C3335315C303030745C303030695C303030715C303030755C303030655C3030305C3034305C3030306D5C3030306F5C303030645C303030755C3030306C5C303030615C303030695C303030725C30303065}
\BKM@entry{id=6,open,dest={73656374696F6E2E312E32},srcline={46}}{5C3337365C3337375C303030415C303030725C303030695C303030745C303030685C3030306D5C3030305C3335315C303030745C303030695C303030715C303030755C303030655C3030305C3034305C3030306D5C3030306F5C303030645C303030755C3030306C5C303030615C303030695C303030725C30303065}
\@writefile{toc}{\contentsline {chapter}{\numberline {1}Arithmétique}{1}{chapter.1}\protected@file@percent }
\@writefile{lof}{\addvspace {10\p@ }}
\@writefile{lot}{\addvspace {10\p@ }}
\@writefile{loi}{\addvspace {10\p@ }}
\@writefile{lol}{\addvspace {10\p@ }}
\new@tpo@label{1}{1}
\@writefile{toc}{\contentsline {section}{\numberline {1.1}Division euclidienne}{1}{section.1.1}\protected@file@percent }
\@writefile{toc}{\contentsline {mtocsection}{\numberline {1.1}Division euclidienne}{1}{section.1.1}\protected@file@percent }
\zref@newlabel{mdf@pagelabel-1}{\default{1.1}\page{1}\abspage{3}\mdf@pagevalue{1}}
\oddpage@label{1}{1}
\@writefile{loe}{\addvspace {10\p@ }}
\@writefile{loe}{\contentsline {theorem}{\ifthmt@listswap Theorem~1.1.1\else \numberline {1.1.1}Theorem\fi \thmtformatoptarg {Division euclidienne}}{1}{theorem.1.1.1}\protected@file@percent }
\pgfsyspdfmark {pgfid1}{4624382}{40145783}
\zref@newlabel{mdf@pagelabel-2}{\default{1.1}\page{1}\abspage{3}\mdf@pagevalue{1}}
\oddpage@label{2}{1}
\@writefile{loe}{\contentsline {definition}{\ifthmt@listswap Definition~1.1.1\else \numberline {1.1.1}Definition\fi \thmtformatoptarg {pgcd}}{1}{definition.1.1.1}\protected@file@percent }
\newmarginnote{note.3.1}{{3}{20901783sp}}
\pgfsyspdfmark {pgfid2}{4624382}{32864296}
\zref@newlabel{mdf@pagelabel-3}{\default{1.1}\page{1}\abspage{3}\mdf@pagevalue{1}}
\oddpage@label{3}{1}
\@writefile{loe}{\contentsline {lemma}{\ifthmt@listswap Lemma~1.1.2\else \numberline {1.1.2}Lemma\fi }{1}{lemma.1.1.2}\protected@file@percent }
\pgfsyspdfmark {pgfid3}{4624382}{26953557}
\zref@newlabel{mdf@pagelabel-4}{\default{1.1}\page{1}\abspage{3}\mdf@pagevalue{1}}
\oddpage@label{4}{1}
\@writefile{loe}{\contentsline {lemma}{\ifthmt@listswap Lemma~1.1.3\else \numberline {1.1.3}Lemma\fi }{1}{lemma.1.1.3}\protected@file@percent }
\pgfsyspdfmark {pgfid4}{4624382}{23245521}
\zref@newlabel{mdf@pagelabel-5}{\default{1.1}\page{1}\abspage{3}\mdf@pagevalue{1}}
\oddpage@label{5}{1}
\@writefile{loe}{\contentsline {theorem}{\ifthmt@listswap Theorem~1.1.4\else \numberline {1.1.4}Theorem\fi }{1}{theorem.1.1.4}\protected@file@percent }
\pgfsyspdfmark {pgfid5}{4624382}{18004721}
\@writefile{toc}{\contentsline {section}{\numberline {1.2}Arithmétique modulaire}{1}{section.1.2}\protected@file@percent }
\@writefile{toc}{\contentsline {mtocsection}{\numberline {1.2}Arithmétique modulaire}{1}{section.1.2}\protected@file@percent }
\BKM@entry{id=7,open,dest={636861707465722E32},srcline={2}}{5C3337365C3337375C303030475C303030725C3030306F5C303030755C303030705C303030655C30303073}
\BKM@entry{id=8,open,dest={73656374696F6E2E322E31},srcline={5}}{5C3337365C3337375C3030304C5C3030306F5C303030695C303030735C3030305C3034305C303030645C303030655C3030305C3034305C303030635C3030306F5C3030306D5C303030705C3030306F5C303030735C303030695C303030745C303030695C3030306F5C3030306E}
\BKM@entry{id=9,open,dest={73656374696F6E2E322E31},srcline={5}}{5C3337365C3337375C3030304C5C3030306F5C303030695C303030735C3030305C3034305C303030645C303030655C3030305C3034305C303030635C3030306F5C3030306D5C303030705C3030306F5C303030735C303030695C303030745C303030695C3030306F5C3030306E}
\BKM@entry{id=10,open,dest={73656374696F6E2E322E32},srcline={36}}{5C3337365C3337375C303030475C303030725C3030306F5C303030755C303030705C303030655C303030735C3030305C3034305C3030303A5C3030305C3034305C303030445C3030305C3335315C303030665C303030695C3030306E5C303030695C303030745C303030695C3030306F5C3030306E5C3030305C3034305C303030655C303030745C3030305C3034305C303030655C303030785C303030655C3030306D5C303030705C3030306C5C303030655C30303073}
\BKM@entry{id=11,open,dest={73656374696F6E2E322E32},srcline={36}}{5C3337365C3337375C303030475C303030725C3030306F5C303030755C303030705C303030655C303030735C3030305C3034305C3030303A5C3030305C3034305C303030445C3030305C3335315C303030665C303030695C3030306E5C303030695C303030745C303030695C3030306F5C3030306E5C3030305C3034305C303030655C303030745C3030305C3034305C303030655C303030785C303030655C3030306D5C303030705C3030306C5C303030655C30303073}
\@writefile{toc}{\contentsline {chapter}{\numberline {2}Groupes}{3}{chapter.2}\protected@file@percent }
\@writefile{lof}{\addvspace {10\p@ }}
\@writefile{lot}{\addvspace {10\p@ }}
\@writefile{loi}{\addvspace {10\p@ }}
\@writefile{lol}{\addvspace {10\p@ }}
\new@tpo@label{2}{3}
\@writefile{toc}{\contentsline {section}{\numberline {2.1}Lois de composition}{3}{section.2.1}\protected@file@percent }
\@writefile{toc}{\contentsline {mtocsection}{\numberline {2.1}Lois de composition}{3}{section.2.1}\protected@file@percent }
\zref@newlabel{mdf@pagelabel-6}{\default{2.1}\page{3}\abspage{5}\mdf@pagevalue{3}}
\oddpage@label{6}{3}
\@writefile{loe}{\addvspace {10\p@ }}
\@writefile{loe}{\contentsline {definition}{\ifthmt@listswap Definition~2.1.1\else \numberline {2.1.1}Definition\fi \thmtformatoptarg {Loi de composition}}{3}{definition.2.1.1}\protected@file@percent }
\pgfsyspdfmark {pgfid6}{4624382}{42942040}
\zref@newlabel{mdf@pagelabel-7}{\default{2.1}\page{3}\abspage{5}\mdf@pagevalue{3}}
\oddpage@label{7}{3}
\@writefile{loe}{\contentsline {lemma}{\ifthmt@listswap Lemma~2.1.1\else \numberline {2.1.1}Lemma\fi }{3}{lemma.2.1.1}\protected@file@percent }
\newmarginnote{note.5.1}{{5}{20452726sp}}
\pgfsyspdfmark {pgfid7}{4624382}{23435648}
\@writefile{toc}{\contentsline {section}{\numberline {2.2}Groupes : Définition et exemples}{3}{section.2.2}\protected@file@percent }
\@writefile{toc}{\contentsline {mtocsection}{\numberline {2.2}Groupes : Définition et exemples}{3}{section.2.2}\protected@file@percent }
\zref@newlabel{mdf@pagelabel-8}{\default{2.2}\page{3}\abspage{5}\mdf@pagevalue{3}}
\oddpage@label{8}{3}
\@writefile{loe}{\contentsline {definition}{\ifthmt@listswap Definition~2.2.1\else \numberline {2.2.1}Definition\fi \thmtformatoptarg {Groupe}}{3}{definition.2.2.1}\protected@file@percent }
\pgfsyspdfmark {pgfid8}{4624382}{16264241}
\zref@newlabel{mdf@pagelabel-9}{\default{2.2}\page{3}\abspage{5}\mdf@pagevalue{3}}
\oddpage@label{9}{3}
\@writefile{loe}{\contentsline {definition}{\ifthmt@listswap Definition~2.2.2\else \numberline {2.2.2}Definition\fi \thmtformatoptarg {Ordre d'un groupe}}{3}{definition.2.2.2}\protected@file@percent }
\pgfsyspdfmark {pgfid9}{4624382}{11844937}
\BKM@entry{id=12,open,dest={73656374696F6E2E322E33},srcline={90}}{5C3337365C3337375C303030535C3030306F5C303030755C303030735C3030302D5C303030675C303030725C3030306F5C303030755C303030705C303030655C30303073}
\BKM@entry{id=13,open,dest={73656374696F6E2E322E33},srcline={90}}{5C3337365C3337375C303030535C3030306F5C303030755C303030735C3030302D5C303030675C303030725C3030306F5C303030755C303030705C303030655C30303073}
\BKM@entry{id=14,open,dest={73656374696F6E2E322E34},srcline={112}}{5C3337365C3337375C303030485C3030306F5C3030306D5C3030306F5C3030306D5C3030306F5C303030725C303030705C303030685C303030695C303030735C3030306D5C303030655C303030735C3030305C3034305C303030655C303030745C3030305C3034305C303030695C303030735C3030306F5C3030306D5C3030306F5C303030725C303030705C303030685C303030695C303030735C3030306D5C303030655C30303073}
\BKM@entry{id=15,open,dest={73656374696F6E2E322E34},srcline={112}}{5C3337365C3337375C303030485C3030306F5C3030306D5C3030306F5C3030306D5C3030306F5C303030725C303030705C303030685C303030695C303030735C3030306D5C303030655C303030735C3030305C3034305C303030655C303030745C3030305C3034305C303030695C303030735C3030306F5C3030306D5C3030306F5C303030725C303030705C303030685C303030695C303030735C3030306D5C303030655C30303073}
\zref@newlabel{mdf@pagelabel-10}{\default{2.2}\page{4}\abspage{6}\mdf@pagevalue{4}}
\oddpage@label{10}{4}
\@writefile{loe}{\contentsline {lemma}{\ifthmt@listswap Lemma~2.2.1\else \numberline {2.2.1}Lemma\fi }{4}{lemma.2.2.1}\protected@file@percent }
\pgfsyspdfmark {pgfid10}{14581719}{48738291}
\zref@newlabel{mdf@pagelabel-11}{\default{2.2}\page{4}\abspage{6}\mdf@pagevalue{4}}
\oddpage@label{11}{4}
\@writefile{loe}{\contentsline {lemma}{\ifthmt@listswap Lemma~2.2.2\else \numberline {2.2.2}Lemma\fi }{4}{lemma.2.2.2}\protected@file@percent }
\pgfsyspdfmark {pgfid11}{14581719}{42330070}
\zref@newlabel{mdf@pagelabel-12}{\default{2.2}\page{4}\abspage{6}\mdf@pagevalue{4}}
\oddpage@label{12}{4}
\@writefile{loe}{\contentsline {definition}{\ifthmt@listswap Definition~2.2.3\else \numberline {2.2.3}Definition\fi \thmtformatoptarg {n-ième puissance de g}}{4}{definition.2.2.3}\protected@file@percent }
\pgfsyspdfmark {pgfid12}{14581719}{37887871}
\zref@newlabel{mdf@pagelabel-13}{\default{2.2}\page{4}\abspage{6}\mdf@pagevalue{4}}
\oddpage@label{13}{4}
\@writefile{loe}{\contentsline {definition}{\ifthmt@listswap Definition~2.2.4\else \numberline {2.2.4}Definition\fi \thmtformatoptarg {Ordre d'un élément d'un groupe}}{4}{definition.2.2.4}\protected@file@percent }
\pgfsyspdfmark {pgfid13}{14581719}{35736580}
\zref@newlabel{mdf@pagelabel-14}{\default{2.2}\page{4}\abspage{6}\mdf@pagevalue{4}}
\oddpage@label{14}{4}
\@writefile{loe}{\contentsline {definition}{\ifthmt@listswap Definition~2.2.5\else \numberline {2.2.5}Definition\fi \thmtformatoptarg {Éléments conjugués}}{4}{definition.2.2.5}\protected@file@percent }
\pgfsyspdfmark {pgfid14}{14581719}{33491523}
\@writefile{toc}{\contentsline {section}{\numberline {2.3}Sous-groupes}{4}{section.2.3}\protected@file@percent }
\@writefile{toc}{\contentsline {mtocsection}{\numberline {2.3}Sous-groupes}{4}{section.2.3}\protected@file@percent }
\zref@newlabel{mdf@pagelabel-15}{\default{2.3}\page{4}\abspage{6}\mdf@pagevalue{4}}
\oddpage@label{15}{4}
\@writefile{loe}{\contentsline {definition}{\ifthmt@listswap Definition~2.3.1\else \numberline {2.3.1}Definition\fi \thmtformatoptarg {Sous-groupe}}{4}{definition.2.3.1}\protected@file@percent }
\pgfsyspdfmark {pgfid15}{14581719}{25091967}
\zref@newlabel{mdf@pagelabel-16}{\default{2.3}\page{4}\abspage{6}\mdf@pagevalue{4}}
\oddpage@label{16}{4}
\@writefile{loe}{\contentsline {lemma}{\ifthmt@listswap Lemma~2.3.1\else \numberline {2.3.1}Lemma\fi }{4}{lemma.2.3.1}\protected@file@percent }
\pgfsyspdfmark {pgfid16}{14581719}{22949257}
\zref@newlabel{mdf@pagelabel-17}{\default{2.3}\page{4}\abspage{6}\mdf@pagevalue{4}}
\oddpage@label{17}{4}
\@writefile{loe}{\contentsline {lemma}{\ifthmt@listswap Lemma~2.3.2\else \numberline {2.3.2}Lemma\fi \thmtformatoptarg {Subgroup Test}}{4}{lemma.2.3.2}\protected@file@percent }
\newmarginnote{note.6.1}{{6}{18585669sp}}
\pgfsyspdfmark {pgfid17}{14581719}{15709004}
\@writefile{toc}{\contentsline {section}{\numberline {2.4}Homomorphismes et isomorphismes}{4}{section.2.4}\protected@file@percent }
\@writefile{toc}{\contentsline {mtocsection}{\numberline {2.4}Homomorphismes et isomorphismes}{4}{section.2.4}\protected@file@percent }
\zref@newlabel{mdf@pagelabel-18}{\default{2.4}\page{4}\abspage{6}\mdf@pagevalue{4}}
\oddpage@label{18}{4}
\@writefile{loe}{\contentsline {definition}{\ifthmt@listswap Definition~2.4.1\else \numberline {2.4.1}Definition\fi \thmtformatoptarg {Homomorphisme}}{4}{definition.2.4.1}\protected@file@percent }
\pgfsyspdfmark {pgfid18}{14581719}{8833229}
\zref@newlabel{mdf@pagelabel-19}{\default{2.4}\page{4}\abspage{6}\mdf@pagevalue{4}}
\oddpage@label{19}{4}
\@writefile{loe}{\contentsline {proposition}{\ifthmt@listswap Proposition~2.4.1\else \numberline {2.4.1}Proposition\fi }{4}{proposition.2.4.1}\protected@file@percent }
\pgfsyspdfmark {pgfid19}{14581719}{5377645}
\BKM@entry{id=16,open,dest={73656374696F6E2E322E35},srcline={163}}{5C3337365C3337375C303030495C3030306E5C303030645C303030695C303030635C303030655C3030305C3034305C303030655C303030745C3030305C3034305C303030745C303030685C3030305C3335315C3030306F5C303030725C3030305C3335305C3030306D5C303030655C3030305C3034305C303030645C303030655C3030305C3034305C3030304C5C303030615C303030675C303030725C303030615C3030306E5C303030675C30303065}
\BKM@entry{id=17,open,dest={73656374696F6E2E322E35},srcline={163}}{5C3337365C3337375C303030495C3030306E5C303030645C303030695C303030635C303030655C3030305C3034305C303030655C303030745C3030305C3034305C303030745C303030685C3030305C3335315C3030306F5C303030725C3030305C3335305C3030306D5C303030655C3030305C3034305C303030645C303030655C3030305C3034305C3030304C5C303030615C303030675C303030725C303030615C3030306E5C303030675C30303065}
\BKM@entry{id=18,open,dest={73656374696F6E2E322E36},srcline={165}}{5C3337365C3337375C303030535C3030306F5C303030755C303030735C3030302D5C303030675C303030725C3030306F5C303030755C303030705C303030655C303030735C3030305C3034305C3030306E5C3030306F5C303030725C3030306D5C303030615C303030755C303030785C3030305C3034305C303030655C303030745C3030305C3034305C303030715C303030755C3030306F5C303030745C303030695C303030655C3030306E5C303030745C30303073}
\BKM@entry{id=19,open,dest={73656374696F6E2E322E36},srcline={165}}{5C3337365C3337375C303030535C3030306F5C303030755C303030735C3030302D5C303030675C303030725C3030306F5C303030755C303030705C303030655C303030735C3030305C3034305C3030306E5C3030306F5C303030725C3030306D5C303030615C303030755C303030785C3030305C3034305C303030655C303030745C3030305C3034305C303030715C303030755C3030306F5C303030745C303030695C303030655C3030306E5C303030745C30303073}
\BKM@entry{id=20,open,dest={73656374696F6E2E322E37},srcline={171}}{5C3337365C3337375C303030475C303030725C3030306F5C303030755C303030705C303030655C303030735C3030305C3034305C303030735C303030695C3030306D5C303030705C3030306C5C303030655C30303073}
\BKM@entry{id=21,open,dest={73656374696F6E2E322E37},srcline={171}}{5C3337365C3337375C303030475C303030725C3030306F5C303030755C303030705C303030655C303030735C3030305C3034305C303030735C303030695C3030306D5C303030705C3030306C5C303030655C30303073}
\BKM@entry{id=22,open,dest={73656374696F6E2E322E38},srcline={173}}{5C3337365C3337375C303030475C303030725C3030306F5C303030755C303030705C303030655C303030735C3030305C3034305C303030635C303030795C303030635C3030306C5C303030695C303030715C303030755C303030655C30303073}
\BKM@entry{id=23,open,dest={73656374696F6E2E322E38},srcline={173}}{5C3337365C3337375C303030475C303030725C3030306F5C303030755C303030705C303030655C303030735C3030305C3034305C303030635C303030795C303030635C3030306C5C303030695C303030715C303030755C303030655C30303073}
\BKM@entry{id=24,open,dest={73656374696F6E2E322E39},srcline={175}}{5C3337365C3337375C303030475C303030725C3030306F5C303030755C303030705C303030655C303030735C3030305C3034305C303030735C303030795C3030306D5C3030305C3335315C303030745C303030725C303030695C303030715C303030755C303030655C30303073}
\BKM@entry{id=25,open,dest={73656374696F6E2E322E39},srcline={175}}{5C3337365C3337375C303030475C303030725C3030306F5C303030755C303030705C303030655C303030735C3030305C3034305C303030735C303030795C3030306D5C3030305C3335315C303030745C303030725C303030695C303030715C303030755C303030655C30303073}
\BKM@entry{id=26,open,dest={73656374696F6E2E322E3130},srcline={177}}{5C3337365C3337375C303030415C303030635C303030745C303030695C3030306F5C3030306E5C303030735C3030305C3034305C303030645C303030655C3030305C3034305C303030675C303030725C3030306F5C303030755C303030705C303030655C30303073}
\BKM@entry{id=27,open,dest={73656374696F6E2E322E3130},srcline={177}}{5C3337365C3337375C303030415C303030635C303030745C303030695C3030306F5C3030306E5C303030735C3030305C3034305C303030645C303030655C3030305C3034305C303030675C303030725C3030306F5C303030755C303030705C303030655C30303073}
\BKM@entry{id=28,open,dest={73756273656374696F6E2E322E31302E31},srcline={179}}{5C3337365C3337375C3030304F5C303030725C303030625C303030695C303030745C303030655C303030735C3030305C3034305C303030655C303030745C3030305C3034305C303030735C303030745C303030615C303030625C303030695C3030306C5C303030695C303030735C303030615C303030745C303030655C303030755C303030725C30303073}
\zref@newlabel{mdf@pagelabel-20}{\default{2.4}\page{5}\abspage{7}\mdf@pagevalue{5}}
\oddpage@label{20}{5}
\pgfsyspdfmark {pgfid20}{4624382}{48394221}
\zref@newlabel{mdf@pagelabel-21}{\default{2.4}\page{5}\abspage{7}\mdf@pagevalue{5}}
\oddpage@label{21}{5}
\@writefile{loe}{\contentsline {lemma}{\ifthmt@listswap Lemma~2.4.2\else \numberline {2.4.2}Lemma\fi }{5}{lemma.2.4.2}\protected@file@percent }
\pgfsyspdfmark {pgfid21}{4624382}{38083123}
\zref@newlabel{mdf@pagelabel-22}{\default{2.4}\page{5}\abspage{7}\mdf@pagevalue{5}}
\oddpage@label{22}{5}
\@writefile{loe}{\contentsline {definition}{\ifthmt@listswap Definition~2.4.2\else \numberline {2.4.2}Definition\fi \thmtformatoptarg {Noyau et image}}{5}{definition.2.4.2}\protected@file@percent }
\pgfsyspdfmark {pgfid22}{4624382}{33538175}
\zref@newlabel{mdf@pagelabel-23}{\default{2.4}\page{5}\abspage{7}\mdf@pagevalue{5}}
\oddpage@label{23}{5}
\@writefile{loe}{\contentsline {lemma}{\ifthmt@listswap Lemma~2.4.3\else \numberline {2.4.3}Lemma\fi }{5}{lemma.2.4.3}\protected@file@percent }
\pgfsyspdfmark {pgfid23}{4624382}{29867494}
\zref@newlabel{mdf@pagelabel-24}{\default{2.4}\page{5}\abspage{7}\mdf@pagevalue{5}}
\oddpage@label{24}{5}
\@writefile{loe}{\contentsline {lemma}{\ifthmt@listswap Lemma~2.4.4\else \numberline {2.4.4}Lemma\fi }{5}{lemma.2.4.4}\protected@file@percent }
\pgfsyspdfmark {pgfid24}{4624382}{22005049}
\zref@newlabel{mdf@pagelabel-25}{\default{2.4}\page{5}\abspage{7}\mdf@pagevalue{5}}
\oddpage@label{25}{5}
\@writefile{loe}{\contentsline {definition}{\ifthmt@listswap Definition~2.4.3\else \numberline {2.4.3}Definition\fi \thmtformatoptarg {Isomorphisme}}{5}{definition.2.4.3}\protected@file@percent }
\pgfsyspdfmark {pgfid25}{4624382}{17460101}
\zref@newlabel{mdf@pagelabel-26}{\default{2.4}\page{5}\abspage{7}\mdf@pagevalue{5}}
\oddpage@label{26}{5}
\@writefile{loe}{\contentsline {proposition}{\ifthmt@listswap Proposition~2.4.5\else \numberline {2.4.5}Proposition\fi }{5}{proposition.2.4.5}\protected@file@percent }
\pgfsyspdfmark {pgfid26}{4624382}{14453305}
\@writefile{toc}{\contentsline {section}{\numberline {2.5}Indice et théorème de Lagrange}{5}{section.2.5}\protected@file@percent }
\@writefile{toc}{\contentsline {mtocsection}{\numberline {2.5}Indice et théorème de Lagrange}{5}{section.2.5}\protected@file@percent }
\@writefile{toc}{\contentsline {section}{\numberline {2.6}Sous-groupes normaux et quotients}{5}{section.2.6}\protected@file@percent }
\@writefile{toc}{\contentsline {mtocsection}{\numberline {2.6}Sous-groupes normaux et quotients}{5}{section.2.6}\protected@file@percent }
\zref@newlabel{mdf@pagelabel-27}{\default{2.6}\page{5}\abspage{7}\mdf@pagevalue{5}}
\oddpage@label{27}{5}
\@writefile{loe}{\contentsline {definition}{\ifthmt@listswap Definition~2.6.1\else \numberline {2.6.1}Definition\fi \thmtformatoptarg {Centre}}{5}{definition.2.6.1}\protected@file@percent }
\pgfsyspdfmark {pgfid27}{4624382}{5109194}
\@writefile{toc}{\contentsline {section}{\numberline {2.7}Groupes simples}{6}{section.2.7}\protected@file@percent }
\@writefile{toc}{\contentsline {mtocsection}{\numberline {2.7}Groupes simples}{6}{section.2.7}\protected@file@percent }
\@writefile{toc}{\contentsline {section}{\numberline {2.8}Groupes cycliques}{6}{section.2.8}\protected@file@percent }
\@writefile{toc}{\contentsline {mtocsection}{\numberline {2.8}Groupes cycliques}{6}{section.2.8}\protected@file@percent }
\@writefile{toc}{\contentsline {section}{\numberline {2.9}Groupes symétriques}{6}{section.2.9}\protected@file@percent }
\@writefile{toc}{\contentsline {mtocsection}{\numberline {2.9}Groupes symétriques}{6}{section.2.9}\protected@file@percent }
\@writefile{toc}{\contentsline {section}{\numberline {2.10}Actions de groupes}{6}{section.2.10}\protected@file@percent }
\@writefile{toc}{\contentsline {mtocsection}{\numberline {2.10}Actions de groupes}{6}{section.2.10}\protected@file@percent }
\@writefile{toc}{\contentsline {subsection}{\numberline {2.10.1}Orbites et stabilisateurs}{6}{subsection.2.10.1}\protected@file@percent }
\@writefile{toc}{\contentsline {mtocsubsection}{\numberline {2.10.1}Orbites et stabilisateurs}{6}{subsection.2.10.1}\protected@file@percent }
\zref@newlabel{mdf@pagelabel-28}{\default{2.10.1}\page{6}\abspage{8}\mdf@pagevalue{6}}
\oddpage@label{28}{6}
\@writefile{loe}{\contentsline {definition}{\ifthmt@listswap Definition~2.10.1\else \numberline {2.10.1}Definition\fi \thmtformatoptarg {Action de groupe}}{6}{definition.2.10.1}\protected@file@percent }
\pgfsyspdfmark {pgfid28}{14581719}{38575058}
\zref@newlabel{mdf@pagelabel-29}{\default{2.10.1}\page{6}\abspage{8}\mdf@pagevalue{6}}
\oddpage@label{29}{6}
\@writefile{loe}{\contentsline {definition}{\ifthmt@listswap Definition~2.10.2\else \numberline {2.10.2}Definition\fi \thmtformatoptarg {Action transitive}}{6}{definition.2.10.2}\protected@file@percent }
\pgfsyspdfmark {pgfid29}{14581719}{25962678}
\zref@newlabel{mdf@pagelabel-30}{\default{2.10.1}\page{6}\abspage{8}\mdf@pagevalue{6}}
\oddpage@label{30}{6}
\@writefile{loe}{\contentsline {definition}{\ifthmt@listswap Definition~2.10.3\else \numberline {2.10.3}Definition\fi \thmtformatoptarg {Orbite}}{6}{definition.2.10.3}\protected@file@percent }
\pgfsyspdfmark {pgfid30}{14581719}{23852708}
\zref@newlabel{mdf@pagelabel-31}{\default{2.10.1}\page{6}\abspage{8}\mdf@pagevalue{6}}
\oddpage@label{31}{6}
\@writefile{loe}{\contentsline {definition}{\ifthmt@listswap Definition~2.10.4\else \numberline {2.10.4}Definition\fi \thmtformatoptarg {Action fidèle}}{6}{definition.2.10.4}\protected@file@percent }
\pgfsyspdfmark {pgfid31}{14581719}{21742738}
\zref@newlabel{mdf@pagelabel-32}{\default{2.10.1}\page{6}\abspage{8}\mdf@pagevalue{6}}
\oddpage@label{32}{6}
\@writefile{loe}{\contentsline {lemma}{\ifthmt@listswap Lemma~2.10.1\else \numberline {2.10.1}Lemma\fi }{6}{lemma.2.10.1}\protected@file@percent }
\pgfsyspdfmark {pgfid32}{14581719}{19600028}
\zref@newlabel{mdf@pagelabel-33}{\default{2.10.1}\page{6}\abspage{8}\mdf@pagevalue{6}}
\oddpage@label{33}{6}
\@writefile{loe}{\contentsline {definition}{\ifthmt@listswap Definition~2.10.5\else \numberline {2.10.5}Definition\fi \thmtformatoptarg {Ensemble de représentants}}{6}{definition.2.10.5}\protected@file@percent }
\pgfsyspdfmark {pgfid33}{14581719}{17448737}
\zref@newlabel{mdf@pagelabel-34}{\default{2.10.1}\page{6}\abspage{8}\mdf@pagevalue{6}}
\oddpage@label{34}{6}
\@writefile{loe}{\contentsline {definition}{\ifthmt@listswap Definition~2.10.6\else \numberline {2.10.6}Definition\fi \thmtformatoptarg {Stabilisateur}}{6}{definition.2.10.6}\protected@file@percent }
\pgfsyspdfmark {pgfid34}{14581719}{15338767}
\zref@newlabel{mdf@pagelabel-35}{\default{2.10.1}\page{6}\abspage{8}\mdf@pagevalue{6}}
\oddpage@label{35}{6}
\@writefile{loe}{\contentsline {proposition}{\ifthmt@listswap Proposition~2.10.2\else \numberline {2.10.2}Proposition\fi }{6}{proposition.2.10.2}\protected@file@percent }
\pgfsyspdfmark {pgfid35}{14581719}{11234088}
\zref@newlabel{mdf@pagelabel-36}{\default{2.10.1}\page{6}\abspage{8}\mdf@pagevalue{6}}
\oddpage@label{36}{6}
\@writefile{loe}{\contentsline {theorem}{\ifthmt@listswap Theorem~2.10.3\else \numberline {2.10.3}Theorem\fi \thmtformatoptarg {Formule des orbites}}{6}{theorem.2.10.3}\protected@file@percent }
\pgfsyspdfmark {pgfid36}{14581719}{6374458}
\BKM@entry{id=29,open,dest={73756273656374696F6E2E322E31302E32},srcline={247}}{5C3337365C3337375C3030305C3331315C303030715C303030755C303030615C303030745C303030695C3030306F5C3030306E5C3030305C3034305C303030645C303030655C3030305C3034305C303030635C3030306C5C303030615C303030735C303030735C303030655C303030735C3030305C3034305C303030655C303030745C3030305C3034305C303030615C303030705C303030705C3030306C5C303030695C303030635C303030615C303030745C303030695C3030306F5C3030306E5C30303073}
\zref@newlabel{mdf@pagelabel-37}{\default{2.10.1}\page{7}\abspage{9}\mdf@pagevalue{7}}
\oddpage@label{37}{7}
\pgfsyspdfmark {pgfid37}{4624382}{47727550}
\zref@newlabel{mdf@pagelabel-38}{\default{2.10.1}\page{7}\abspage{9}\mdf@pagevalue{7}}
\oddpage@label{38}{7}
\@writefile{loe}{\contentsline {corollary}{\ifthmt@listswap Corollary~2.10.4\else \numberline {2.10.4}Corollary\fi }{7}{corollary.2.10.4}\protected@file@percent }
\pgfsyspdfmark {pgfid38}{4624382}{42171990}
\zref@newlabel{mdf@pagelabel-39}{\default{2.10.1}\page{7}\abspage{9}\mdf@pagevalue{7}}
\oddpage@label{39}{7}
\@writefile{loe}{\contentsline {corollary}{\ifthmt@listswap Corollary~2.10.5\else \numberline {2.10.5}Corollary\fi }{7}{corollary.2.10.5}\protected@file@percent }
\pgfsyspdfmark {pgfid39}{4624382}{34746705}
\@writefile{toc}{\contentsline {subsection}{\numberline {2.10.2}Équation de classes et applications}{7}{subsection.2.10.2}\protected@file@percent }
\@writefile{toc}{\contentsline {mtocsubsection}{\numberline {2.10.2}Équation de classes et applications}{7}{subsection.2.10.2}\protected@file@percent }
\zref@newlabel{mdf@pagelabel-40}{\default{2.10.2}\page{7}\abspage{9}\mdf@pagevalue{7}}
\oddpage@label{40}{7}
\@writefile{loe}{\contentsline {definition}{\ifthmt@listswap Definition~2.10.7\else \numberline {2.10.7}Definition\fi \thmtformatoptarg {Centralisateur}}{7}{definition.2.10.7}\protected@file@percent }
\pgfsyspdfmark {pgfid40}{4624382}{28545160}
\zref@newlabel{mdf@pagelabel-41}{\default{2.10.2}\page{7}\abspage{9}\mdf@pagevalue{7}}
\oddpage@label{41}{7}
\@writefile{loe}{\contentsline {corollary}{\ifthmt@listswap Corollary~2.10.6\else \numberline {2.10.6}Corollary\fi \thmtformatoptarg {Équation des classes}}{7}{corollary.2.10.6}\protected@file@percent }
\pgfsyspdfmark {pgfid41}{4624382}{23054944}
\BKM@entry{id=30,open,dest={706172742A2E36},srcline={79}}{5C3337365C3337375C303030535C3030305C3335315C303030725C303030695C303030655C30303073}
\@writefile{toc}{\contentsline {part}{\nonumberline Séries}{9}{part*.6}\protected@file@percent }
\BKM@entry{id=31,open,dest={636861707465722E33},srcline={3}}{5C3337365C3337375C303030535C3030305C3335315C303030725C303030695C303030655C3030305C3034305C30303031}
\BKM@entry{id=32,open,dest={73656374696F6E2E332E31},srcline={2}}{5C3337365C3337375C303030455C303030785C303030655C303030725C303030695C303030635C303030655C3030305C3034305C30303031}
\BKM@entry{id=33,open,dest={73656374696F6E2E332E31},srcline={2}}{5C3337365C3337375C303030455C303030785C303030655C303030725C303030695C303030635C303030655C3030305C3034305C30303031}
\@writefile{toc}{\contentsline {chapter}{\numberline {3}Série 1}{11}{chapter.3}\protected@file@percent }
\@writefile{lof}{\addvspace {10\p@ }}
\@writefile{lot}{\addvspace {10\p@ }}
\@writefile{loi}{\addvspace {10\p@ }}
\@writefile{lol}{\addvspace {10\p@ }}
\new@tpo@label{3}{11}
\@writefile{toc}{\contentsline {section}{\numberline {3.1}Exerice 1}{11}{section.3.1}\protected@file@percent }
\@writefile{toc}{\contentsline {mtocsection}{\numberline {3.1}Exerice 1}{11}{section.3.1}\protected@file@percent }
\@writefile{loe}{\addvspace {10\p@ }}
\@writefile{loe}{\contentsline {solution}{\ifthmt@listswap Solution refname={Example,Examples}~\thesolution \else \numberline {\thesolution }Solution refname={Example,Examples}\fi }{11}{thmt@dummyctr.dummy.40}\protected@file@percent }
\zref@newlabel{mdf@pagelabel-42}{\default{3.1}\page{11}\abspage{13}\mdf@pagevalue{11}}
\oddpage@label{42}{11}
\@writefile{loe}{\contentsline {exercise}{\ifthmt@listswap Exercice~3.1.1\else \numberline {3.1.1}Exercice\fi }{11}{exercise.3.1.1}\protected@file@percent }
\pgfsyspdfmark {pgfid42}{4624382}{26178181}
\@writefile{loe}{\contentsline {solution}{\ifthmt@listswap Solution refname={Example,Examples}~\thesolution \else \numberline {\thesolution }Solution refname={Example,Examples}\fi }{11}{thmt@dummyctr.dummy.42}\protected@file@percent }
\@writefile{loe}{\contentsline {solution}{\ifthmt@listswap Solution refname={Example,Examples}~\thesolution \else \numberline {\thesolution }Solution refname={Example,Examples}\fi }{11}{thmt@dummyctr.dummy.44}\protected@file@percent }
\BKM@entry{id=34,open,dest={636861707465722E34},srcline={6}}{5C3337365C3337375C303030535C3030305C3335315C303030725C303030695C303030655C3030305C3034305C30303032}
\@writefile{toc}{\contentsline {chapter}{\numberline {4}Série 2}{13}{chapter.4}\protected@file@percent }
\@writefile{lof}{\addvspace {10\p@ }}
\@writefile{lot}{\addvspace {10\p@ }}
\@writefile{loi}{\addvspace {10\p@ }}
\@writefile{lol}{\addvspace {10\p@ }}
\new@tpo@label{4}{13}
\BKM@entry{id=35,open,dest={636861707465722E35},srcline={9}}{5C3337365C3337375C303030535C3030305C3335315C303030725C303030695C303030655C3030305C3034305C30303033}
\@writefile{toc}{\contentsline {chapter}{\numberline {5}Série 3}{15}{chapter.5}\protected@file@percent }
\@writefile{lof}{\addvspace {10\p@ }}
\@writefile{lot}{\addvspace {10\p@ }}
\@writefile{loi}{\addvspace {10\p@ }}
\@writefile{lol}{\addvspace {10\p@ }}
\new@tpo@label{5}{15}
\BKM@entry{id=36,open,dest={636861707465722E36},srcline={12}}{5C3337365C3337375C303030535C3030305C3335315C303030725C303030695C303030655C3030305C3034305C30303034}
\@writefile{toc}{\contentsline {chapter}{\numberline {6}Série 4}{17}{chapter.6}\protected@file@percent }
\@writefile{lof}{\addvspace {10\p@ }}
\@writefile{lot}{\addvspace {10\p@ }}
\@writefile{loi}{\addvspace {10\p@ }}
\@writefile{lol}{\addvspace {10\p@ }}
\new@tpo@label{6}{17}
\BKM@entry{id=37,open,dest={636861707465722E37},srcline={15}}{5C3337365C3337375C303030535C3030305C3335315C303030725C303030695C303030655C3030305C3034305C30303035}
\@writefile{toc}{\contentsline {chapter}{\numberline {7}Série 5}{19}{chapter.7}\protected@file@percent }
\@writefile{lof}{\addvspace {10\p@ }}
\@writefile{lot}{\addvspace {10\p@ }}
\@writefile{loi}{\addvspace {10\p@ }}
\@writefile{lol}{\addvspace {10\p@ }}
\new@tpo@label{7}{19}
\BKM@entry{id=38,open,dest={636861707465722E38},srcline={18}}{5C3337365C3337375C303030535C3030305C3335315C303030725C303030695C303030655C3030305C3034305C30303036}
\@writefile{toc}{\contentsline {chapter}{\numberline {8}Série 6}{21}{chapter.8}\protected@file@percent }
\@writefile{lof}{\addvspace {10\p@ }}
\@writefile{lot}{\addvspace {10\p@ }}
\@writefile{loi}{\addvspace {10\p@ }}
\@writefile{lol}{\addvspace {10\p@ }}
\new@tpo@label{8}{21}
\BKM@entry{id=39,open,dest={636861707465722E39},srcline={21}}{5C3337365C3337375C303030535C3030305C3335315C303030725C303030695C303030655C3030305C3034305C30303037}
\@writefile{toc}{\contentsline {chapter}{\numberline {9}Série 7}{23}{chapter.9}\protected@file@percent }
\@writefile{lof}{\addvspace {10\p@ }}
\@writefile{lot}{\addvspace {10\p@ }}
\@writefile{loi}{\addvspace {10\p@ }}
\@writefile{lol}{\addvspace {10\p@ }}
\new@tpo@label{9}{23}
\BKM@entry{id=40,open,dest={636861707465722E3130},srcline={24}}{5C3337365C3337375C303030535C3030305C3335315C303030725C303030695C303030655C3030305C3034305C30303038}
\@writefile{toc}{\contentsline {chapter}{\numberline {10}Série 8}{25}{chapter.10}\protected@file@percent }
\@writefile{lof}{\addvspace {10\p@ }}
\@writefile{lot}{\addvspace {10\p@ }}
\@writefile{loi}{\addvspace {10\p@ }}
\@writefile{lol}{\addvspace {10\p@ }}
\new@tpo@label{10}{25}
\BKM@entry{id=41,open,dest={636861707465722E3131},srcline={27}}{5C3337365C3337375C303030535C3030305C3335315C303030725C303030695C303030655C3030305C3034305C30303039}
\@writefile{toc}{\contentsline {chapter}{\numberline {11}Série 9}{27}{chapter.11}\protected@file@percent }
\@writefile{lof}{\addvspace {10\p@ }}
\@writefile{lot}{\addvspace {10\p@ }}
\@writefile{loi}{\addvspace {10\p@ }}
\@writefile{lol}{\addvspace {10\p@ }}
\new@tpo@label{11}{27}
\BKM@entry{id=42,open,dest={636861707465722E3132},srcline={30}}{5C3337365C3337375C303030535C3030305C3335315C303030725C303030695C303030655C3030305C3034305C303030315C30303030}
\@writefile{toc}{\contentsline {chapter}{\numberline {12}Série 10}{29}{chapter.12}\protected@file@percent }
\@writefile{lof}{\addvspace {10\p@ }}
\@writefile{lot}{\addvspace {10\p@ }}
\@writefile{loi}{\addvspace {10\p@ }}
\@writefile{lol}{\addvspace {10\p@ }}
\new@tpo@label{12}{29}
\BKM@entry{id=43,open,dest={636861707465722E3133},srcline={33}}{5C3337365C3337375C303030535C3030305C3335315C303030725C303030695C303030655C3030305C3034305C303030315C30303031}
\@writefile{toc}{\contentsline {chapter}{\numberline {13}Série 11}{31}{chapter.13}\protected@file@percent }
\@writefile{lof}{\addvspace {10\p@ }}
\@writefile{lot}{\addvspace {10\p@ }}
\@writefile{loi}{\addvspace {10\p@ }}
\@writefile{lol}{\addvspace {10\p@ }}
\new@tpo@label{13}{31}
\BKM@entry{id=44,open,dest={636861707465722E3134},srcline={36}}{5C3337365C3337375C303030535C3030305C3335315C303030725C303030695C303030655C3030305C3034305C303030315C30303032}
\@writefile{toc}{\contentsline {chapter}{\numberline {14}Série 12}{33}{chapter.14}\protected@file@percent }
\@writefile{lof}{\addvspace {10\p@ }}
\@writefile{lot}{\addvspace {10\p@ }}
\@writefile{loi}{\addvspace {10\p@ }}
\@writefile{lol}{\addvspace {10\p@ }}
\new@tpo@label{14}{33}
\BKM@entry{id=45,open,dest={636861707465722E3135},srcline={39}}{5C3337365C3337375C303030535C3030305C3335315C303030725C303030695C303030655C3030305C3034305C303030315C30303033}
\@writefile{toc}{\contentsline {chapter}{\numberline {15}Série 13}{35}{chapter.15}\protected@file@percent }
\@writefile{lof}{\addvspace {10\p@ }}
\@writefile{lot}{\addvspace {10\p@ }}
\@writefile{loi}{\addvspace {10\p@ }}
\@writefile{lol}{\addvspace {10\p@ }}
\new@tpo@label{15}{35}
\BKM@entry{id=46,open,dest={636861707465722E3136},srcline={42}}{5C3337365C3337375C303030535C3030305C3335315C303030725C303030695C303030655C3030305C3034305C303030315C30303034}
\@writefile{toc}{\contentsline {chapter}{\numberline {16}Série 14}{37}{chapter.16}\protected@file@percent }
\@writefile{lof}{\addvspace {10\p@ }}
\@writefile{lot}{\addvspace {10\p@ }}
\@writefile{loi}{\addvspace {10\p@ }}
\@writefile{lol}{\addvspace {10\p@ }}
\new@tpo@label{16}{37}
\global\@namedef{scr@dte@chapter@lastmaxnumwidth}{13.62843pt}
\global\@namedef{scr@dte@section@lastmaxnumwidth}{20.33115pt}
\global\@namedef{scr@dte@subsection@lastmaxnumwidth}{27.91655pt}
\gdef \@abspage@last{39}
