\@ifundefined {etoctocstyle}{\let \etoc@startlocaltoc \@gobble \let \etoc@settocdepth \@gobble \let \etoc@depthtag \@gobble \let \etoc@setlocaltop \@gobble }{}
\babel@toc {french}{}\relax
\contentsline {chapter}{\nonumberline Table des mati\`eres}{1}{chapter*.1}%
\contentsline {chapter}{\numberline {1}Arithmétique}{1}{chapter.1}%
\contentsline {section}{\numberline {1.1}Division euclidienne}{1}{section.1.1}%
\contentsline {mtocsection}{\numberline {1.1}Division euclidienne}{1}{section.1.1}%
\contentsline {section}{\numberline {1.2}Arithmétique modulaire}{1}{section.1.2}%
\contentsline {mtocsection}{\numberline {1.2}Arithmétique modulaire}{1}{section.1.2}%
\contentsline {chapter}{\numberline {2}Groupes}{3}{chapter.2}%
\contentsline {section}{\numberline {2.1}Lois de composition}{3}{section.2.1}%
\contentsline {mtocsection}{\numberline {2.1}Lois de composition}{3}{section.2.1}%
\contentsline {section}{\numberline {2.2}Groupes : Définition et exemples}{3}{section.2.2}%
\contentsline {mtocsection}{\numberline {2.2}Groupes : Définition et exemples}{3}{section.2.2}%
\contentsline {section}{\numberline {2.3}Sous-groupes}{4}{section.2.3}%
\contentsline {mtocsection}{\numberline {2.3}Sous-groupes}{4}{section.2.3}%
\contentsline {section}{\numberline {2.4}Homomorphismes et isomorphismes}{4}{section.2.4}%
\contentsline {mtocsection}{\numberline {2.4}Homomorphismes et isomorphismes}{4}{section.2.4}%
\contentsline {section}{\numberline {2.5}Indice et théorème de Lagrange}{5}{section.2.5}%
\contentsline {mtocsection}{\numberline {2.5}Indice et théorème de Lagrange}{5}{section.2.5}%
\contentsline {section}{\numberline {2.6}Sous-groupes normaux et quotients}{5}{section.2.6}%
\contentsline {mtocsection}{\numberline {2.6}Sous-groupes normaux et quotients}{5}{section.2.6}%
\contentsline {section}{\numberline {2.7}Groupes simples}{6}{section.2.7}%
\contentsline {mtocsection}{\numberline {2.7}Groupes simples}{6}{section.2.7}%
\contentsline {section}{\numberline {2.8}Groupes cycliques}{6}{section.2.8}%
\contentsline {mtocsection}{\numberline {2.8}Groupes cycliques}{6}{section.2.8}%
\contentsline {section}{\numberline {2.9}Groupes symétriques}{6}{section.2.9}%
\contentsline {mtocsection}{\numberline {2.9}Groupes symétriques}{6}{section.2.9}%
\contentsline {section}{\numberline {2.10}Actions de groupes}{6}{section.2.10}%
\contentsline {mtocsection}{\numberline {2.10}Actions de groupes}{6}{section.2.10}%
\contentsline {subsection}{\numberline {2.10.1}Orbites et stabilisateurs}{6}{subsection.2.10.1}%
\contentsline {mtocsubsection}{\numberline {2.10.1}Orbites et stabilisateurs}{6}{subsection.2.10.1}%
\contentsline {subsection}{\numberline {2.10.2}Équation de classes et applications}{7}{subsection.2.10.2}%
\contentsline {mtocsubsection}{\numberline {2.10.2}Équation de classes et applications}{7}{subsection.2.10.2}%
\contentsline {part}{\nonumberline Séries}{9}{part*.6}%
\contentsline {chapter}{\numberline {3}Série 1}{11}{chapter.3}%
\contentsline {section}{\numberline {3.1}Exerice 1}{11}{section.3.1}%
\contentsline {mtocsection}{\numberline {3.1}Exerice 1}{11}{section.3.1}%
\contentsline {chapter}{\numberline {4}Série 2}{13}{chapter.4}%
\contentsline {chapter}{\numberline {5}Série 3}{15}{chapter.5}%
\contentsline {chapter}{\numberline {6}Série 4}{17}{chapter.6}%
\contentsline {chapter}{\numberline {7}Série 5}{19}{chapter.7}%
\contentsline {chapter}{\numberline {8}Série 6}{21}{chapter.8}%
\contentsline {chapter}{\numberline {9}Série 7}{23}{chapter.9}%
\contentsline {chapter}{\numberline {10}Série 8}{25}{chapter.10}%
\contentsline {chapter}{\numberline {11}Série 9}{27}{chapter.11}%
\contentsline {chapter}{\numberline {12}Série 10}{29}{chapter.12}%
\contentsline {chapter}{\numberline {13}Série 11}{31}{chapter.13}%
\contentsline {chapter}{\numberline {14}Série 12}{33}{chapter.14}%
\contentsline {chapter}{\numberline {15}Série 13}{35}{chapter.15}%
\contentsline {chapter}{\numberline {16}Série 14}{37}{chapter.16}%
