\relax 
\providecommand\hyper@newdestlabel[2]{}
\providecommand\zref@newlabel[2]{}
\providecommand*\new@tpo@label[2]{}
\providecommand \oddpage@label [2]{}
\@writefile{toc}{\@ifundefined {etoctocstyle}{\let \etoc@startlocaltoc \@gobble \let \etoc@settocdepth \@gobble \let \etoc@depthtag \@gobble \let \etoc@setlocaltop \@gobble }{}}
\providecommand\@newglossary[4]{}
\@newglossary{main}{glg}{gls}{glo}
\providecommand\HyperFirstAtBeginDocument{\AtBeginDocument}
\HyperFirstAtBeginDocument{\ifx\hyper@anchor\@undefined
\global\let\oldcontentsline\contentsline
\gdef\contentsline#1#2#3#4{\oldcontentsline{#1}{#2}{#3}}
\global\let\oldnewlabel\newlabel
\gdef\newlabel#1#2{\newlabelxx{#1}#2}
\gdef\newlabelxx#1#2#3#4#5#6{\oldnewlabel{#1}{{#2}{#3}}}
\AtEndDocument{\ifx\hyper@anchor\@undefined
\let\contentsline\oldcontentsline
\let\newlabel\oldnewlabel
\fi}
\fi}
\global\let\hyper@last\relax 
\gdef\HyperFirstAtBeginDocument#1{#1}
\providecommand\HyField@AuxAddToFields[1]{}
\providecommand\HyField@AuxAddToCoFields[2]{}
\providecommand\BKM@entry[2]{}
\providecommand\babel@aux[2]{}
\@nameuse{bbl@beforestart}
\catcode `:\active 
\catcode `;\active 
\catcode `!\active 
\catcode `?\active 
\@writefile{toc}{\boolfalse {citerequest}\boolfalse {citetracker}\boolfalse {pagetracker}\boolfalse {backtracker}\relax }
\@writefile{lof}{\boolfalse {citerequest}\boolfalse {citetracker}\boolfalse {pagetracker}\boolfalse {backtracker}\relax }
\@writefile{lot}{\boolfalse {citerequest}\boolfalse {citetracker}\boolfalse {pagetracker}\boolfalse {backtracker}\relax }
\abx@aux@refcontext{none/global//global/global}
\babel@aux{french}{}
\BKM@entry{id=1,open,dest={636861707465722A2E31},srcline={81}}{5C3337365C3337375C303030545C303030615C303030625C3030306C5C303030655C3030305C3034305C303030645C303030655C303030735C3030305C3034305C3030306D5C303030615C303030745C303030695C3030305C3335305C303030725C303030655C30303073}
\@writefile{toc}{\defcounter {refsection}{0}\relax }\@writefile{toc}{\contentsline {chapter}{\nonumberline Table des mati\`eres}{3}{chapter*.1}\protected@file@percent }
\BKM@entry{id=2,open,dest={706172742A2E33},srcline={92}}{5C3337365C3337375C303030435C3030306F5C303030755C303030725C30303073}
\@writefile{toc}{\defcounter {refsection}{0}\relax }\@writefile{toc}{\contentsline {part}{\nonumberline Cours}{1}{part*.3}\protected@file@percent }
\BKM@entry{id=3,open,dest={636861707465722E31},srcline={2}}{5C3337365C3337375C303030445C3030305C3335315C3030306E5C3030306F5C3030306D5C303030625C303030725C303030655C3030306D5C303030655C3030306E5C30303074}
\BKM@entry{id=4,open,dest={73656374696F6E2E312E31},srcline={8}}{5C3337365C3337375C303030505C303030725C303030695C3030306E5C303030635C303030695C303030705C303030655C303030735C3030305C3034305C303030665C3030306F5C3030306E5C303030645C303030615C3030306D5C303030655C3030306E5C303030745C303030615C303030755C30303078}
\BKM@entry{id=5,open,dest={73656374696F6E2E312E31},srcline={8}}{5C3337365C3337375C303030505C303030725C303030695C3030306E5C303030635C303030695C303030705C303030655C303030735C3030305C3034305C303030665C3030306F5C3030306E5C303030645C303030615C3030306D5C303030655C3030306E5C303030745C303030615C303030755C30303078}
\BKM@entry{id=6,open,dest={73756273656374696F6E2E312E312E31},srcline={10}}{5C3337365C3337375C3030302B5C3030302C5C3030305C3034305C3030302C5C3030305C3034305C3030303D5C3030305C3034305C303030655C303030745C3030305C3034305C303030445C303030695C303030725C303030695C303030635C303030685C3030306C5C303030655C30303074}
\@writefile{toc}{\defcounter {refsection}{0}\relax }\@writefile{toc}{\contentsline {chapter}{\numberline {1}Dénombrement}{3}{chapter.1}\protected@file@percent }
\@writefile{lof}{\defcounter {refsection}{0}\relax }\@writefile{lof}{\addvspace {10\p@ }}
\@writefile{lot}{\defcounter {refsection}{0}\relax }\@writefile{lot}{\addvspace {10\p@ }}
\@writefile{loi}{\defcounter {refsection}{0}\relax }\@writefile{loi}{\addvspace {10\p@ }}
\@writefile{lol}{\defcounter {refsection}{0}\relax }\@writefile{lol}{\addvspace {10\p@ }}
\new@tpo@label{1}{3}
\newlabel{ch:dnb}{{1}{3}{Dénombrement}{chapter.1}{}}
\newlabel{ch:dnb@cref}{{[chapter][1][]1}{[1][3][]3}}
\@writefile{toc}{\defcounter {refsection}{0}\relax }\@writefile{toc}{\contentsline {section}{\numberline {1.1}Principes fondamentaux}{3}{section.1.1}\protected@file@percent }
\@writefile{toc}{\defcounter {refsection}{0}\relax }\@writefile{toc}{\contentsline {mtocsection}{\numberline {1.1}Principes fondamentaux}{3}{section.1.1}\protected@file@percent }
\@writefile{toc}{\defcounter {refsection}{0}\relax }\@writefile{toc}{\contentsline {subsection}{\numberline {1.1.1}$+$, $\times $, $=$ et Dirichlet}{3}{subsection.1.1.1}\protected@file@percent }
\@writefile{toc}{\defcounter {refsection}{0}\relax }\@writefile{toc}{\contentsline {mtocsubsection}{\numberline {1.1.1}$+$, $\times $, $=$ et Dirichlet}{3}{subsection.1.1.1}\protected@file@percent }
\zref@newlabel{mdf@pagelabel-1}{\default{1.1.1}\page{3}\abspage{7}\mdf@pagevalue{3}}
\oddpage@label{1}{3}
\@writefile{loe}{\defcounter {refsection}{0}\relax }\@writefile{loe}{\addvspace {10\p@ }}
\@writefile{loe}{\defcounter {refsection}{0}\relax }\@writefile{loe}{\contentsline {theorem}{\ifthmt@listswap Theorem~1.1.1\else \numberline {1.1.1}Theorem\fi \thmtformatoptarg {Principe de multiplication}}{3}{theorem.1.1.1}\protected@file@percent }
\pgfsyspdfmark {pgfid1}{4624382}{36270433}
\zref@newlabel{mdf@pagelabel-2}{\default{1.1.1}\page{3}\abspage{7}\mdf@pagevalue{3}}
\oddpage@label{2}{3}
\@writefile{loe}{\defcounter {refsection}{0}\relax }\@writefile{loe}{\contentsline {theorem}{\ifthmt@listswap Theorem~1.1.2\else \numberline {1.1.2}Theorem\fi \thmtformatoptarg {Principe d'addition}}{3}{theorem.1.1.2}\protected@file@percent }
\pgfsyspdfmark {pgfid2}{4624382}{23112332}
\zref@newlabel{mdf@pagelabel-3}{\default{1.1.1}\page{4}\abspage{8}\mdf@pagevalue{4}}
\oddpage@label{3}{4}
\@writefile{loe}{\defcounter {refsection}{0}\relax }\@writefile{loe}{\contentsline {proposition}{\ifthmt@listswap Proposition~1.1.3\else \numberline {1.1.3}Proposition\fi \thmtformatoptarg {Principe de Dirichlet}}{4}{proposition.1.1.3}\protected@file@percent }
\pgfsyspdfmark {pgfid4}{14581719}{35106137}
\zref@newlabel{mdf@pagelabel-4}{\default{1.1.1}\page{4}\abspage{8}\mdf@pagevalue{4}}
\oddpage@label{4}{4}
\@writefile{loe}{\defcounter {refsection}{0}\relax }\@writefile{loe}{\contentsline {theorem}{\ifthmt@listswap Theorem~1.1.4\else \numberline {1.1.4}Theorem\fi \thmtformatoptarg {Principe de Dirichlet généralisé}}{4}{theorem.1.1.4}\protected@file@percent }
\pgfsyspdfmark {pgfid5}{14581719}{27309366}
\zref@newlabel{mdf@pagelabel-5}{\default{1.1.1}\page{4}\abspage{8}\mdf@pagevalue{4}}
\oddpage@label{5}{4}
\@writefile{loe}{\defcounter {refsection}{0}\relax }\@writefile{loe}{\contentsline {theorem}{\ifthmt@listswap Theorem~1.1.5\else \numberline {1.1.5}Theorem\fi \thmtformatoptarg {Principe d'égalité}}{4}{theorem.1.1.5}\protected@file@percent }
\pgfsyspdfmark {pgfid6}{14581719}{14842899}
\zref@newlabel{mdf@pagelabel-6}{\default{1.1.1}\page{4}\abspage{8}\mdf@pagevalue{4}}
\oddpage@label{6}{4}
\@writefile{loe}{\defcounter {refsection}{0}\relax }\@writefile{loe}{\contentsline {proposition}{\ifthmt@listswap Proposition~1.1.6\else \numberline {1.1.6}Proposition\fi \thmtformatoptarg {Cardinalité de l'ensemble des parties}}{4}{proposition.1.1.6}\protected@file@percent }
\pgfsyspdfmark {pgfid7}{14581719}{8100219}
\BKM@entry{id=7,open,dest={73756273656374696F6E2E312E312E32},srcline={170}}{5C3337365C3337375C303030445C3030306F5C303030755C303030625C3030306C5C303030655C3030305C3034305C303030635C3030306F5C3030306D5C303030705C303030745C303030615C303030675C30303065}
\BKM@entry{id=8,open,dest={73656374696F6E2E312E32},srcline={186}}{5C3337365C3337375C303030435C3030306F5C3030306D5C303030625C303030695C3030306E5C303030615C303030745C3030306F5C303030695C303030725C303030655C3030305C3034305C3030305C3335315C3030306E5C303030755C3030306D5C3030305C3335315C303030725C303030615C303030745C303030695C303030765C303030655C3030305C3034305C303030635C3030306C5C303030615C303030735C303030735C303030695C303030715C303030755C30303065}
\BKM@entry{id=9,open,dest={73656374696F6E2E312E32},srcline={186}}{5C3337365C3337375C303030435C3030306F5C3030306D5C303030625C303030695C3030306E5C303030615C303030745C3030306F5C303030695C303030725C303030655C3030305C3034305C3030305C3335315C3030306E5C303030755C3030306D5C3030305C3335315C303030725C303030615C303030745C303030695C303030765C303030655C3030305C3034305C303030635C3030306C5C303030615C303030735C303030735C303030695C303030715C303030755C30303065}
\BKM@entry{id=10,open,dest={73756273656374696F6E2E312E322E31},srcline={188}}{5C3337365C3337375C303030435C3030306F5C3030306D5C303030625C303030695C3030306E5C303030615C303030695C303030735C3030306F5C3030306E5C30303073}
\BKM@entry{id=11,open,dest={73756273656374696F6E2E312E322E32},srcline={206}}{5C3337365C3337375C303030505C303030655C303030725C3030306D5C303030755C303030745C303030615C303030745C303030695C3030306F5C3030306E5C30303073}
\@writefile{toc}{\defcounter {refsection}{0}\relax }\@writefile{toc}{\contentsline {subsection}{\numberline {1.1.2}Double comptage}{5}{subsection.1.1.2}\protected@file@percent }
\@writefile{toc}{\defcounter {refsection}{0}\relax }\@writefile{toc}{\contentsline {mtocsubsection}{\numberline {1.1.2}Double comptage}{5}{subsection.1.1.2}\protected@file@percent }
\zref@newlabel{mdf@pagelabel-7}{\default{1.1.2}\page{5}\abspage{9}\mdf@pagevalue{5}}
\oddpage@label{7}{5}
\@writefile{loe}{\defcounter {refsection}{0}\relax }\@writefile{loe}{\contentsline {definition}{\ifthmt@listswap Definition~1.1.1\else \numberline {1.1.1}Definition\fi \thmtformatoptarg {Système d'incidence}}{5}{definition.1.1.1}\protected@file@percent }
\pgfsyspdfmark {pgfid8}{4624382}{25400021}
\zref@newlabel{mdf@pagelabel-8}{\default{1.1.2}\page{5}\abspage{9}\mdf@pagevalue{5}}
\oddpage@label{8}{5}
\@writefile{loe}{\defcounter {refsection}{0}\relax }\@writefile{loe}{\contentsline {theorem}{\ifthmt@listswap Theorem~1.1.7\else \numberline {1.1.7}Theorem\fi }{5}{theorem.1.1.7}\protected@file@percent }
\pgfsyspdfmark {pgfid9}{4624382}{18418107}
\@writefile{toc}{\defcounter {refsection}{0}\relax }\@writefile{toc}{\contentsline {section}{\numberline {1.2}Combinatoire énumérative classique}{5}{section.1.2}\protected@file@percent }
\@writefile{toc}{\defcounter {refsection}{0}\relax }\@writefile{toc}{\contentsline {mtocsection}{\numberline {1.2}Combinatoire énumérative classique}{5}{section.1.2}\protected@file@percent }
\@writefile{toc}{\defcounter {refsection}{0}\relax }\@writefile{toc}{\contentsline {subsection}{\numberline {1.2.1}Combinaisons}{5}{subsection.1.2.1}\protected@file@percent }
\@writefile{toc}{\defcounter {refsection}{0}\relax }\@writefile{toc}{\contentsline {mtocsubsection}{\numberline {1.2.1}Combinaisons}{5}{subsection.1.2.1}\protected@file@percent }
\zref@newlabel{mdf@pagelabel-9}{\default{1.2.1}\page{5}\abspage{9}\mdf@pagevalue{5}}
\oddpage@label{9}{5}
\@writefile{loe}{\defcounter {refsection}{0}\relax }\@writefile{loe}{\contentsline {definition}{\ifthmt@listswap Definition~1.2.1\else \numberline {1.2.1}Definition\fi \thmtformatoptarg {Coefficient binomial}}{5}{definition.1.2.1}\protected@file@percent }
\pgfsyspdfmark {pgfid10}{4624382}{11527786}
\zref@newlabel{mdf@pagelabel-10}{\default{1.2.1}\page{5}\abspage{9}\mdf@pagevalue{5}}
\oddpage@label{10}{5}
\@writefile{loe}{\defcounter {refsection}{0}\relax }\@writefile{loe}{\contentsline {proposition}{\ifthmt@listswap Proposition~1.2.1\else \numberline {1.2.1}Proposition\fi \thmtformatoptarg {Triangle de Pascal}}{5}{proposition.1.2.1}\protected@file@percent }
\pgfsyspdfmark {pgfid11}{4624382}{9378084}
\zref@newlabel{mdf@pagelabel-11}{\default{1.2.1}\page{5}\abspage{9}\mdf@pagevalue{5}}
\oddpage@label{11}{5}
\@writefile{loe}{\defcounter {refsection}{0}\relax }\@writefile{loe}{\contentsline {proposition}{\ifthmt@listswap Proposition~1.2.2\else \numberline {1.2.2}Proposition\fi \thmtformatoptarg {Formule du binôme}}{5}{proposition.1.2.2}\protected@file@percent }
\pgfsyspdfmark {pgfid12}{4624382}{7243639}
\zref@newlabel{mdf@pagelabel-12}{\default{1.2.1}\page{5}\abspage{9}\mdf@pagevalue{5}}
\oddpage@label{12}{5}
\@writefile{loe}{\defcounter {refsection}{0}\relax }\@writefile{loe}{\contentsline {proposition}{\ifthmt@listswap Proposition~1.2.3\else \numberline {1.2.3}Proposition\fi \thmtformatoptarg {Binôme de Newton}}{5}{proposition.1.2.3}\protected@file@percent }
\pgfsyspdfmark {pgfid13}{4624382}{5109194}
\BKM@entry{id=12,open,dest={73756273656374696F6E2E312E322E33},srcline={224}}{5C3337365C3337375C303030445C303030695C303030735C303030745C303030725C303030695C303030625C303030755C303030745C303030695C3030306F5C3030306E5C30303073}
\BKM@entry{id=13,open,dest={73756273656374696F6E2E312E322E34},srcline={239}}{5C3337365C3337375C303030505C303030615C303030725C303030745C303030695C303030745C303030695C3030306F5C3030306E5C30303073}
\@writefile{toc}{\defcounter {refsection}{0}\relax }\@writefile{toc}{\contentsline {subsection}{\numberline {1.2.2}Permutations}{6}{subsection.1.2.2}\protected@file@percent }
\@writefile{toc}{\defcounter {refsection}{0}\relax }\@writefile{toc}{\contentsline {mtocsubsection}{\numberline {1.2.2}Permutations}{6}{subsection.1.2.2}\protected@file@percent }
\zref@newlabel{mdf@pagelabel-13}{\default{1.2.2}\page{6}\abspage{10}\mdf@pagevalue{6}}
\oddpage@label{13}{6}
\@writefile{loe}{\defcounter {refsection}{0}\relax }\@writefile{loe}{\contentsline {definition}{\ifthmt@listswap Definition~1.2.2\else \numberline {1.2.2}Definition\fi \thmtformatoptarg {Arrangement}}{6}{definition.1.2.2}\protected@file@percent }
\pgfsyspdfmark {pgfid14}{14581719}{47679930}
\zref@newlabel{mdf@pagelabel-14}{\default{1.2.2}\page{6}\abspage{10}\mdf@pagevalue{6}}
\oddpage@label{14}{6}
\@writefile{loe}{\defcounter {refsection}{0}\relax }\@writefile{loe}{\contentsline {definition}{\ifthmt@listswap Definition~1.2.3\else \numberline {1.2.3}Definition\fi \thmtformatoptarg {Permutation}}{6}{definition.1.2.3}\protected@file@percent }
\pgfsyspdfmark {pgfid15}{14581719}{45571549}
\zref@newlabel{mdf@pagelabel-15}{\default{1.2.2}\page{6}\abspage{10}\mdf@pagevalue{6}}
\oddpage@label{15}{6}
\@writefile{loe}{\defcounter {refsection}{0}\relax }\@writefile{loe}{\contentsline {proposition}{\ifthmt@listswap Proposition~1.2.4\else \numberline {1.2.4}Proposition\fi \thmtformatoptarg {Formule d'arrangement}}{6}{proposition.1.2.4}\protected@file@percent }
\pgfsyspdfmark {pgfid16}{14581719}{43421847}
\zref@newlabel{mdf@pagelabel-16}{\default{1.2.2}\page{6}\abspage{10}\mdf@pagevalue{6}}
\oddpage@label{16}{6}
\@writefile{loe}{\defcounter {refsection}{0}\relax }\@writefile{loe}{\contentsline {proposition}{\ifthmt@listswap Proposition~1.2.5\else \numberline {1.2.5}Proposition\fi \thmtformatoptarg {Formule de combinaison}}{6}{proposition.1.2.5}\protected@file@percent }
\pgfsyspdfmark {pgfid17}{14581719}{41287402}
\@writefile{toc}{\defcounter {refsection}{0}\relax }\@writefile{toc}{\contentsline {subsection}{\numberline {1.2.3}Distributions}{6}{subsection.1.2.3}\protected@file@percent }
\@writefile{toc}{\defcounter {refsection}{0}\relax }\@writefile{toc}{\contentsline {mtocsubsection}{\numberline {1.2.3}Distributions}{6}{subsection.1.2.3}\protected@file@percent }
\zref@newlabel{mdf@pagelabel-17}{\default{1.2.3}\page{6}\abspage{10}\mdf@pagevalue{6}}
\oddpage@label{17}{6}
\@writefile{loe}{\defcounter {refsection}{0}\relax }\@writefile{loe}{\contentsline {definition}{\ifthmt@listswap Definition~1.2.4\else \numberline {1.2.4}Definition\fi \thmtformatoptarg {Coefficient multinomial}}{6}{definition.1.2.4}\protected@file@percent }
\pgfsyspdfmark {pgfid18}{14581719}{37062384}
\zref@newlabel{mdf@pagelabel-18}{\default{1.2.3}\page{6}\abspage{10}\mdf@pagevalue{6}}
\oddpage@label{18}{6}
\@writefile{loe}{\defcounter {refsection}{0}\relax }\@writefile{loe}{\contentsline {proposition}{\ifthmt@listswap Proposition~1.2.6\else \numberline {1.2.6}Proposition\fi \thmtformatoptarg {Formule de distribution}}{6}{proposition.1.2.6}\protected@file@percent }
\pgfsyspdfmark {pgfid19}{14581719}{34927939}
\zref@newlabel{mdf@pagelabel-19}{\default{1.2.3}\page{6}\abspage{10}\mdf@pagevalue{6}}
\oddpage@label{19}{6}
\@writefile{loe}{\defcounter {refsection}{0}\relax }\@writefile{loe}{\contentsline {theorem}{\ifthmt@listswap Theorem~1.2.7\else \numberline {1.2.7}Theorem\fi \thmtformatoptarg {Théorème multinomial}}{6}{theorem.1.2.7}\protected@file@percent }
\pgfsyspdfmark {pgfid20}{14581719}{32819558}
\zref@newlabel{mdf@pagelabel-20}{\default{1.2.3}\page{6}\abspage{10}\mdf@pagevalue{6}}
\oddpage@label{20}{6}
\@writefile{loe}{\defcounter {refsection}{0}\relax }\@writefile{loe}{\contentsline {corollary}{\ifthmt@listswap Corollary~1.2.8\else \numberline {1.2.8}Corollary\fi \thmtformatoptarg {Formule du multinôme}}{6}{corollary.1.2.8}\protected@file@percent }
\pgfsyspdfmark {pgfid21}{14581719}{30680027}
\@writefile{toc}{\defcounter {refsection}{0}\relax }\@writefile{toc}{\contentsline {subsection}{\numberline {1.2.4}Partitions}{6}{subsection.1.2.4}\protected@file@percent }
\@writefile{toc}{\defcounter {refsection}{0}\relax }\@writefile{toc}{\contentsline {mtocsubsection}{\numberline {1.2.4}Partitions}{6}{subsection.1.2.4}\protected@file@percent }
\zref@newlabel{mdf@pagelabel-21}{\default{1.2.4}\page{6}\abspage{10}\mdf@pagevalue{6}}
\oddpage@label{21}{6}
\@writefile{loe}{\defcounter {refsection}{0}\relax }\@writefile{loe}{\contentsline {definition}{\ifthmt@listswap Definition~1.2.5\else \numberline {1.2.5}Definition\fi \thmtformatoptarg {Partition d'un ensemble}}{6}{definition.1.2.5}\protected@file@percent }
\pgfsyspdfmark {pgfid22}{14581719}{23889224}
\zref@newlabel{mdf@pagelabel-22}{\default{1.2.4}\page{6}\abspage{10}\mdf@pagevalue{6}}
\oddpage@label{22}{6}
\@writefile{loe}{\defcounter {refsection}{0}\relax }\@writefile{loe}{\contentsline {definition}{\ifthmt@listswap Definition~1.2.6\else \numberline {1.2.6}Definition\fi \thmtformatoptarg {$S(n,k)$}}{6}{definition.1.2.6}\protected@file@percent }
\pgfsyspdfmark {pgfid23}{14581719}{20022235}
\zref@newlabel{mdf@pagelabel-23}{\default{1.2.4}\page{6}\abspage{10}\mdf@pagevalue{6}}
\oddpage@label{23}{6}
\@writefile{loe}{\defcounter {refsection}{0}\relax }\@writefile{loe}{\contentsline {proposition}{\ifthmt@listswap Proposition~1.2.9\else \numberline {1.2.9}Proposition\fi \thmtformatoptarg {Propriétés de $S(n, k)$}}{6}{proposition.1.2.9}\protected@file@percent }
\pgfsyspdfmark {pgfid24}{14581719}{12266537}
\newlabel{bhfn:1}{{1}{6}{Partitions}{BackrefHyperFootnoteCounter.1}{}}
\newlabel{bhfn:1@cref}{{[BackrefHyperFootnoteCounter][1][]1}{[1][6][]6}}
\BKM@entry{id=14,open,dest={73756273656374696F6E2E312E322E35},srcline={312}}{5C3337365C3337375C303030435C3030306F5C3030306D5C303030625C303030695C3030306E5C303030615C303030695C303030735C3030306F5C3030306E5C303030735C3030305C3034305C303030615C303030765C303030655C303030635C3030305C3034305C303030725C3030305C3335315C303030705C3030305C3335315C303030745C303030695C303030745C303030695C3030306F5C3030306E5C30303073}
\BKM@entry{id=15,open,dest={73756273656374696F6E2E312E322E36},srcline={329}}{5C3337365C3337375C303030435C3030306F5C3030306D5C303030705C3030306F5C303030735C303030695C303030745C303030695C3030306F5C3030306E5C30303073}
\newlabel{bhfn:2}{{2}{7}{Partitions}{BackrefHyperFootnoteCounter.2}{}}
\newlabel{bhfn:2@cref}{{[BackrefHyperFootnoteCounter][2][]2}{[1][7][]7}}
\zref@newlabel{mdf@pagelabel-24}{\default{1.2.4}\page{7}\abspage{11}\mdf@pagevalue{7}}
\oddpage@label{24}{7}
\@writefile{loe}{\defcounter {refsection}{0}\relax }\@writefile{loe}{\contentsline {definition}{\ifthmt@listswap Definition~1.2.7\else \numberline {1.2.7}Definition\fi \thmtformatoptarg {Nombre de Bell}}{7}{definition.1.2.7}\protected@file@percent }
\pgfsyspdfmark {pgfid25}{4624382}{40864716}
\zref@newlabel{mdf@pagelabel-25}{\default{1.2.4}\page{7}\abspage{11}\mdf@pagevalue{7}}
\oddpage@label{25}{7}
\@writefile{loe}{\defcounter {refsection}{0}\relax }\@writefile{loe}{\contentsline {definition}{\ifthmt@listswap Definition~1.2.8\else \numberline {1.2.8}Definition\fi \thmtformatoptarg {Partition entière}}{7}{definition.1.2.8}\protected@file@percent }
\pgfsyspdfmark {pgfid26}{4624382}{38756335}
\zref@newlabel{mdf@pagelabel-26}{\default{1.2.4}\page{7}\abspage{11}\mdf@pagevalue{7}}
\oddpage@label{26}{7}
\@writefile{loe}{\defcounter {refsection}{0}\relax }\@writefile{loe}{\contentsline {definition}{\ifthmt@listswap Definition~1.2.9\else \numberline {1.2.9}Definition\fi \thmtformatoptarg {Partition conjuguée}}{7}{definition.1.2.9}\protected@file@percent }
\pgfsyspdfmark {pgfid27}{4624382}{36606633}
\@writefile{toc}{\defcounter {refsection}{0}\relax }\@writefile{toc}{\contentsline {subsection}{\numberline {1.2.5}Combinaisons avec répétitions}{7}{subsection.1.2.5}\protected@file@percent }
\@writefile{toc}{\defcounter {refsection}{0}\relax }\@writefile{toc}{\contentsline {mtocsubsection}{\numberline {1.2.5}Combinaisons avec répétitions}{7}{subsection.1.2.5}\protected@file@percent }
\zref@newlabel{mdf@pagelabel-27}{\default{1.2.5}\page{7}\abspage{11}\mdf@pagevalue{7}}
\oddpage@label{27}{7}
\@writefile{loe}{\defcounter {refsection}{0}\relax }\@writefile{loe}{\contentsline {definition}{\ifthmt@listswap Definition~1.2.10\else \numberline {1.2.10}Definition\fi \thmtformatoptarg {Multi-ensemble}}{7}{definition.1.2.10}\protected@file@percent }
\pgfsyspdfmark {pgfid28}{4624382}{30515549}
\zref@newlabel{mdf@pagelabel-28}{\default{1.2.5}\page{7}\abspage{11}\mdf@pagevalue{7}}
\oddpage@label{28}{7}
\@writefile{loe}{\defcounter {refsection}{0}\relax }\@writefile{loe}{\contentsline {definition}{\ifthmt@listswap Definition~1.2.11\else \numberline {1.2.11}Definition\fi \thmtformatoptarg {Combinaison avec répétitions}}{7}{definition.1.2.11}\protected@file@percent }
\pgfsyspdfmark {pgfid29}{4624382}{25790007}
\zref@newlabel{mdf@pagelabel-29}{\default{1.2.5}\page{7}\abspage{11}\mdf@pagevalue{7}}
\oddpage@label{29}{7}
\@writefile{loe}{\defcounter {refsection}{0}\relax }\@writefile{loe}{\contentsline {proposition}{\ifthmt@listswap Proposition~1.2.10\else \numberline {1.2.10}Proposition\fi \thmtformatoptarg {Stars and Bars Property for Multiset Combinations}}{7}{proposition.1.2.10}\protected@file@percent }
\pgfsyspdfmark {pgfid30}{4624382}{21242364}
\@writefile{toc}{\defcounter {refsection}{0}\relax }\@writefile{toc}{\contentsline {subsection}{\numberline {1.2.6}Compositions}{7}{subsection.1.2.6}\protected@file@percent }
\@writefile{toc}{\defcounter {refsection}{0}\relax }\@writefile{toc}{\contentsline {mtocsubsection}{\numberline {1.2.6}Compositions}{7}{subsection.1.2.6}\protected@file@percent }
\zref@newlabel{mdf@pagelabel-30}{\default{1.2.6}\page{7}\abspage{11}\mdf@pagevalue{7}}
\oddpage@label{30}{7}
\@writefile{loe}{\defcounter {refsection}{0}\relax }\@writefile{loe}{\contentsline {definition}{\ifthmt@listswap Definition~1.2.12\else \numberline {1.2.12}Definition\fi \thmtformatoptarg {Composition}}{7}{definition.1.2.12}\protected@file@percent }
\pgfsyspdfmark {pgfid31}{4624382}{15115369}
\BKM@entry{id=16,open,dest={73756273656374696F6E2E312E322E37},srcline={359}}{5C3337365C3337375C303030545C303030685C303030655C3030305C3034305C303030545C303030775C303030655C3030306C5C303030765C303030655C303030665C3030306F5C3030306C5C303030645C3030305C3034305C303030575C303030615C303030795C3030305C303430}
\zref@newlabel{mdf@pagelabel-31}{\default{1.2.6}\page{8}\abspage{12}\mdf@pagevalue{8}}
\oddpage@label{31}{8}
\@writefile{loe}{\defcounter {refsection}{0}\relax }\@writefile{loe}{\contentsline {proposition}{\ifthmt@listswap Proposition~1.2.11\else \numberline {1.2.11}Proposition\fi \thmtformatoptarg {Stars and Bars Property for Strong Integer Composition}}{8}{proposition.1.2.11}\protected@file@percent }
\pgfsyspdfmark {pgfid32}{14581719}{46241276}
\zref@newlabel{mdf@pagelabel-32}{\default{1.2.6}\page{8}\abspage{12}\mdf@pagevalue{8}}
\oddpage@label{32}{8}
\@writefile{loe}{\defcounter {refsection}{0}\relax }\@writefile{loe}{\contentsline {corollary}{\ifthmt@listswap Corollary~1.2.12\else \numberline {1.2.12}Corollary\fi \thmtformatoptarg {Total Compositions Theorem}}{8}{corollary.1.2.12}\protected@file@percent }
\pgfsyspdfmark {pgfid33}{14581719}{43255489}
\zref@newlabel{mdf@pagelabel-33}{\default{1.2.6}\page{8}\abspage{12}\mdf@pagevalue{8}}
\oddpage@label{33}{8}
\@writefile{loe}{\defcounter {refsection}{0}\relax }\@writefile{loe}{\contentsline {definition}{\ifthmt@listswap Definition~1.2.13\else \numberline {1.2.13}Definition\fi \thmtformatoptarg {Composition faible}}{8}{definition.1.2.13}\protected@file@percent }
\pgfsyspdfmark {pgfid34}{14581719}{40269702}
\zref@newlabel{mdf@pagelabel-34}{\default{1.2.6}\page{8}\abspage{12}\mdf@pagevalue{8}}
\oddpage@label{34}{8}
\@writefile{loe}{\defcounter {refsection}{0}\relax }\@writefile{loe}{\contentsline {proposition}{\ifthmt@listswap Proposition~1.2.13\else \numberline {1.2.13}Proposition\fi \thmtformatoptarg {Total Weak Compositions Theorem}}{8}{proposition.1.2.13}\protected@file@percent }
\pgfsyspdfmark {pgfid35}{14581719}{36806987}
\@writefile{toc}{\defcounter {refsection}{0}\relax }\@writefile{toc}{\contentsline {subsection}{\numberline {1.2.7}\guillemetleft The Twelvefold Way \guillemetright }{8}{subsection.1.2.7}\protected@file@percent }
\@writefile{toc}{\defcounter {refsection}{0}\relax }\@writefile{toc}{\contentsline {mtocsubsection}{\numberline {1.2.7}\guillemetleft The Twelvefold Way \guillemetright }{8}{subsection.1.2.7}\protected@file@percent }
\BKM@entry{id=17,open,dest={636861707465722E32},srcline={2}}{5C3337365C3337375C303030505C303030725C303030695C3030306E5C303030635C303030695C303030705C303030655C3030305C3034305C303030645C303030275C303030695C3030306E5C303030635C3030306C5C303030755C303030735C303030695C3030306F5C3030306E5C3030302F5C303030655C303030785C303030635C3030306C5C303030755C303030735C303030695C3030306F5C3030306E}
\BKM@entry{id=18,open,dest={73656374696F6E2E322E31},srcline={9}}{5C3337365C3337375C303030435C303030615C303030735C3030305C3034305C303030705C303030615C303030725C303030745C303030695C303030635C303030755C3030306C5C303030695C303030655C303030725C303030735C3030305C3034305C303030735C303030695C3030306D5C303030705C3030306C5C303030655C30303073}
\BKM@entry{id=19,open,dest={73656374696F6E2E322E31},srcline={9}}{5C3337365C3337375C303030435C303030615C303030735C3030305C3034305C303030705C303030615C303030725C303030745C303030695C303030635C303030755C3030306C5C303030695C303030655C303030725C303030735C3030305C3034305C303030735C303030695C3030306D5C303030705C3030306C5C303030655C30303073}
\@writefile{toc}{\defcounter {refsection}{0}\relax }\@writefile{toc}{\contentsline {chapter}{\numberline {2}Principe d'inclusion/exclusion}{11}{chapter.2}\protected@file@percent }
\@writefile{lof}{\defcounter {refsection}{0}\relax }\@writefile{lof}{\addvspace {10\p@ }}
\@writefile{lot}{\defcounter {refsection}{0}\relax }\@writefile{lot}{\addvspace {10\p@ }}
\@writefile{loi}{\defcounter {refsection}{0}\relax }\@writefile{loi}{\addvspace {10\p@ }}
\@writefile{lol}{\defcounter {refsection}{0}\relax }\@writefile{lol}{\addvspace {10\p@ }}
\new@tpo@label{2}{11}
\newlabel{ch:inc}{{2}{11}{Principe d'inclusion/exclusion}{chapter.2}{}}
\newlabel{ch:inc@cref}{{[chapter][2][]2}{[1][11][]11}}
\@writefile{toc}{\defcounter {refsection}{0}\relax }\@writefile{toc}{\contentsline {section}{\numberline {2.1}Cas particuliers simples}{11}{section.2.1}\protected@file@percent }
\@writefile{toc}{\defcounter {refsection}{0}\relax }\@writefile{toc}{\contentsline {mtocsection}{\numberline {2.1}Cas particuliers simples}{11}{section.2.1}\protected@file@percent }
\zref@newlabel{mdf@pagelabel-35}{\default{2.1}\page{11}\abspage{15}\mdf@pagevalue{11}}
\oddpage@label{35}{11}
\@writefile{loe}{\defcounter {refsection}{0}\relax }\@writefile{loe}{\addvspace {10\p@ }}
\@writefile{loe}{\defcounter {refsection}{0}\relax }\@writefile{loe}{\contentsline {theorem}{\ifthmt@listswap Theorem~2.1.1\else \numberline {2.1.1}Theorem\fi \thmtformatoptarg {Principe de soustraction}}{11}{theorem.2.1.1}\protected@file@percent }
\newmarginnote{note.15.1}{{15}{17012131sp}}
\pgfsyspdfmark {pgfid36}{4624382}{36811241}
\zref@newlabel{mdf@pagelabel-36}{\default{2.1}\page{11}\abspage{15}\mdf@pagevalue{11}}
\oddpage@label{36}{11}
\@writefile{loe}{\defcounter {refsection}{0}\relax }\@writefile{loe}{\contentsline {proposition}{\ifthmt@listswap Proposition~2.1.2\else \numberline {2.1.2}Proposition\fi }{11}{proposition.2.1.2}\protected@file@percent }
\pgfsyspdfmark {pgfid37}{4624382}{14066779}
\BKM@entry{id=20,open,dest={73656374696F6E2E322E32},srcline={65}}{5C3337365C3337375C303030475C3030305C3335315C3030306E5C3030305C3335315C303030725C303030615C3030306C5C303030695C303030735C303030615C303030745C303030695C3030306F5C3030306E}
\BKM@entry{id=21,open,dest={73656374696F6E2E322E32},srcline={65}}{5C3337365C3337375C303030475C3030305C3335315C3030306E5C3030305C3335315C303030725C303030615C3030306C5C303030695C303030735C303030615C303030745C303030695C3030306F5C3030306E}
\zref@newlabel{mdf@pagelabel-37}{\default{2.1}\page{12}\abspage{16}\mdf@pagevalue{12}}
\oddpage@label{37}{12}
\@writefile{loe}{\defcounter {refsection}{0}\relax }\@writefile{loe}{\contentsline {corollary}{\ifthmt@listswap Corollary~2.1.3\else \numberline {2.1.3}Corollary\fi }{12}{corollary.2.1.3}\protected@file@percent }
\pgfsyspdfmark {pgfid38}{14581719}{33443469}
\@writefile{toc}{\defcounter {refsection}{0}\relax }\@writefile{toc}{\contentsline {section}{\numberline {2.2}Généralisation}{12}{section.2.2}\protected@file@percent }
\@writefile{toc}{\defcounter {refsection}{0}\relax }\@writefile{toc}{\contentsline {mtocsection}{\numberline {2.2}Généralisation}{12}{section.2.2}\protected@file@percent }
\zref@newlabel{mdf@pagelabel-38}{\default{2.2}\page{12}\abspage{16}\mdf@pagevalue{12}}
\oddpage@label{38}{12}
\@writefile{loe}{\defcounter {refsection}{0}\relax }\@writefile{loe}{\contentsline {theorem}{\ifthmt@listswap Theorem~2.2.1\else \numberline {2.2.1}Theorem\fi \thmtformatoptarg {Principe d'inclusion-exclusion généralisé}}{12}{theorem.2.2.1}\protected@file@percent }
\newlabel{eq1}{{1}{12}{Principe d'inclusion-exclusion généralisé}{equation.2.2.1}{}}
\newlabel{eq1@cref}{{[equation][1][2]1}{[1][12][]12}}
\pgfsyspdfmark {pgfid39}{14581719}{20134813}
\BKM@entry{id=22,open,dest={73656374696F6E2E322E33},srcline={107}}{5C3337365C3337375C303030455C303030785C303030655C3030306D5C303030705C3030306C5C303030655C303030735C3030305C3034305C303030645C303030275C303030615C303030705C303030705C3030306C5C303030695C303030635C303030615C303030695C303030745C3030306F5C3030306E}
\BKM@entry{id=23,open,dest={73656374696F6E2E322E33},srcline={107}}{5C3337365C3337375C303030455C303030785C303030655C3030306D5C303030705C3030306C5C303030655C303030735C3030305C3034305C303030645C303030275C303030615C303030705C303030705C3030306C5C303030695C303030635C303030615C303030695C303030745C3030306F5C3030306E}
\BKM@entry{id=24,open,dest={73756273656374696F6E2E322E332E31},srcline={109}}{5C3337365C3337375C303030445C303030695C303030765C303030695C303030735C303030695C303030625C303030695C3030306C5C303030695C303030745C3030305C333531}
\@writefile{toc}{\defcounter {refsection}{0}\relax }\@writefile{toc}{\contentsline {section}{\numberline {2.3}Exemples d'applicaiton}{13}{section.2.3}\protected@file@percent }
\@writefile{toc}{\defcounter {refsection}{0}\relax }\@writefile{toc}{\contentsline {mtocsection}{\numberline {2.3}Exemples d'applicaiton}{13}{section.2.3}\protected@file@percent }
\@writefile{toc}{\defcounter {refsection}{0}\relax }\@writefile{toc}{\contentsline {subsection}{\numberline {2.3.1}Divisibilité}{13}{subsection.2.3.1}\protected@file@percent }
\@writefile{toc}{\defcounter {refsection}{0}\relax }\@writefile{toc}{\contentsline {mtocsubsection}{\numberline {2.3.1}Divisibilité}{13}{subsection.2.3.1}\protected@file@percent }
\BKM@entry{id=25,open,dest={73756273656374696F6E2E322E332E32},srcline={130}}{5C3337365C3337375C303030445C3030305C3335315C303030725C303030615C3030306E5C303030675C303030655C3030306D5C303030655C3030306E5C303030745C30303073}
\@writefile{toc}{\defcounter {refsection}{0}\relax }\@writefile{toc}{\contentsline {subsection}{\numberline {2.3.2}Dérangements}{14}{subsection.2.3.2}\protected@file@percent }
\@writefile{toc}{\defcounter {refsection}{0}\relax }\@writefile{toc}{\contentsline {mtocsubsection}{\numberline {2.3.2}Dérangements}{14}{subsection.2.3.2}\protected@file@percent }
\zref@newlabel{mdf@pagelabel-39}{\default{2.3.2}\page{14}\abspage{18}\mdf@pagevalue{14}}
\oddpage@label{39}{14}
\@writefile{loe}{\defcounter {refsection}{0}\relax }\@writefile{loe}{\contentsline {definition}{\ifthmt@listswap Definition~2.3.1\else \numberline {2.3.1}Definition\fi \thmtformatoptarg {Dérangement}}{14}{definition.2.3.1}\protected@file@percent }
\newmarginnote{note.18.1}{{18}{18763008sp}}
\pgfsyspdfmark {pgfid40}{14581719}{37331061}
\zref@newlabel{mdf@pagelabel-40}{\default{2.3.2}\page{14}\abspage{18}\mdf@pagevalue{14}}
\oddpage@label{40}{14}
\@writefile{loe}{\defcounter {refsection}{0}\relax }\@writefile{loe}{\contentsline {theorem}{\ifthmt@listswap Theorem~2.3.1\else \numberline {2.3.1}Theorem\fi \thmtformatoptarg {Formule du dérangement}}{14}{theorem.2.3.1}\protected@file@percent }
\pgfsyspdfmark {pgfid41}{14581719}{32594629}
\BKM@entry{id=26,open,dest={636861707465722E33},srcline={2}}{5C3337365C3337375C303030535C3030305C3335315C303030725C303030695C303030655C303030735C3030305C3034305C303030675C3030305C3335315C3030306E5C3030305C3335315C303030725C303030615C303030745C303030725C303030695C303030635C303030655C30303073}
\BKM@entry{id=27,open,dest={73656374696F6E2E332E31},srcline={21}}{5C3337365C3337375C3030304C5C303030275C303030615C3030306E5C3030306E5C303030655C303030615C303030755C3030305C3034305C303030645C303030655C303030735C3030305C3034305C303030735C3030305C3335315C303030725C303030695C303030655C303030735C3030305C3034305C303030665C3030306F5C303030725C3030306D5C303030655C3030306C5C3030306C5C303030655C30303073}
\BKM@entry{id=28,open,dest={73656374696F6E2E332E31},srcline={21}}{5C3337365C3337375C3030304C5C303030275C303030615C3030306E5C3030306E5C303030655C303030615C303030755C3030305C3034305C303030645C303030655C303030735C3030305C3034305C303030735C3030305C3335315C303030725C303030695C303030655C303030735C3030305C3034305C303030665C3030306F5C303030725C3030306D5C303030655C3030306C5C3030306C5C303030655C30303073}
\@writefile{toc}{\defcounter {refsection}{0}\relax }\@writefile{toc}{\contentsline {chapter}{\numberline {3}Séries génératrices}{15}{chapter.3}\protected@file@percent }
\@writefile{lof}{\defcounter {refsection}{0}\relax }\@writefile{lof}{\addvspace {10\p@ }}
\@writefile{lot}{\defcounter {refsection}{0}\relax }\@writefile{lot}{\addvspace {10\p@ }}
\@writefile{loi}{\defcounter {refsection}{0}\relax }\@writefile{loi}{\addvspace {10\p@ }}
\@writefile{lol}{\defcounter {refsection}{0}\relax }\@writefile{lol}{\addvspace {10\p@ }}
\new@tpo@label{3}{15}
\newlabel{ch:sgen}{{3}{15}{Séries génératrices}{chapter.3}{}}
\newlabel{ch:sgen@cref}{{[chapter][3][]3}{[1][15][]15}}
\@writefile{toc}{\defcounter {refsection}{0}\relax }\@writefile{toc}{\contentsline {section}{\numberline {3.1}L'anneau des séries formelles}{15}{section.3.1}\protected@file@percent }
\@writefile{toc}{\defcounter {refsection}{0}\relax }\@writefile{toc}{\contentsline {mtocsection}{\numberline {3.1}L'anneau des séries formelles}{15}{section.3.1}\protected@file@percent }
\zref@newlabel{mdf@pagelabel-41}{\default{3.1}\page{15}\abspage{19}\mdf@pagevalue{15}}
\oddpage@label{41}{15}
\@writefile{loe}{\defcounter {refsection}{0}\relax }\@writefile{loe}{\addvspace {10\p@ }}
\@writefile{loe}{\defcounter {refsection}{0}\relax }\@writefile{loe}{\contentsline {definition}{\ifthmt@listswap Definition~3.1.1\else \numberline {3.1.1}Definition\fi \thmtformatoptarg {Série formelle}}{15}{definition.3.1.1}\protected@file@percent }
\pgfsyspdfmark {pgfid42}{4624382}{13034622}
\zref@newlabel{mdf@pagelabel-42}{\default{3.1}\page{15}\abspage{19}\mdf@pagevalue{15}}
\oddpage@label{42}{15}
\@writefile{loe}{\defcounter {refsection}{0}\relax }\@writefile{loe}{\contentsline {definition}{\ifthmt@listswap Definition~3.1.2\else \numberline {3.1.2}Definition\fi \thmtformatoptarg {Égalité}}{15}{definition.3.1.2}\protected@file@percent }
\pgfsyspdfmark {pgfid43}{4624382}{10024497}
\zref@newlabel{mdf@pagelabel-43}{\default{3.1}\page{15}\abspage{19}\mdf@pagevalue{15}}
\oddpage@label{43}{15}
\@writefile{loe}{\defcounter {refsection}{0}\relax }\@writefile{loe}{\contentsline {proposition}{\ifthmt@listswap Proposition~3.1.1\else \numberline {3.1.1}Proposition\fi }{15}{proposition.3.1.1}\protected@file@percent }
\pgfsyspdfmark {pgfid44}{4624382}{8479161}
\zref@newlabel{mdf@pagelabel-44}{\default{3.1}\page{16}\abspage{20}\mdf@pagevalue{16}}
\oddpage@label{44}{16}
\pgfsyspdfmark {pgfid45}{14581719}{38700093}
\zref@newlabel{mdf@pagelabel-45}{\default{3.1}\page{16}\abspage{20}\mdf@pagevalue{16}}
\oddpage@label{45}{16}
\@writefile{loe}{\defcounter {refsection}{0}\relax }\@writefile{loe}{\contentsline {definition}{\ifthmt@listswap Definition~3.1.3\else \numberline {3.1.3}Definition\fi \thmtformatoptarg {Dérivée formelle}}{16}{definition.3.1.3}\protected@file@percent }
\pgfsyspdfmark {pgfid46}{14581719}{20535217}
\zref@newlabel{mdf@pagelabel-46}{\default{3.1}\page{16}\abspage{20}\mdf@pagevalue{16}}
\oddpage@label{46}{16}
\@writefile{loe}{\defcounter {refsection}{0}\relax }\@writefile{loe}{\contentsline {definition}{\ifthmt@listswap Definition~3.1.4\else \numberline {3.1.4}Definition\fi \thmtformatoptarg {Substitution}}{16}{definition.3.1.4}\protected@file@percent }
\pgfsyspdfmark {pgfid47}{14581719}{5427910}
\BKM@entry{id=29,open,dest={73656374696F6E2E332E32},srcline={100}}{5C3337365C3337375C303030535C3030305C3335315C303030725C303030695C303030655C303030735C3030305C3034305C303030665C3030306F5C303030725C3030306D5C303030655C3030306C5C3030306C5C303030655C303030735C3030305C3034305C3030305C3334305C3030305C3034305C303030705C3030306C5C303030755C303030735C303030695C303030655C303030755C303030725C303030735C3030305C3034305C303030765C303030615C303030725C303030695C303030615C303030625C3030306C5C303030655C30303073}
\BKM@entry{id=30,open,dest={73656374696F6E2E332E32},srcline={100}}{5C3337365C3337375C303030535C3030305C3335315C303030725C303030695C303030655C303030735C3030305C3034305C303030665C3030306F5C303030725C3030306D5C303030655C3030306C5C3030306C5C303030655C303030735C3030305C3034305C3030305C3334305C3030305C3034305C303030705C3030306C5C303030755C303030735C303030695C303030655C303030755C303030725C303030735C3030305C3034305C303030765C303030615C303030725C303030695C303030615C303030625C3030306C5C303030655C30303073}
\BKM@entry{id=31,open,dest={73656374696F6E2E332E33},srcline={108}}{5C3337365C3337375C3030304C5C303030655C303030735C3030305C3034305C303030735C3030305C3335315C303030725C303030695C303030655C303030735C3030305C3034305C303030675C3030305C3335315C3030306E5C3030305C3335315C303030725C303030615C303030745C303030725C303030695C303030635C303030655C303030735C3030305C3034305C303030655C3030306E5C3030305C3034305C303030635C3030306F5C3030306D5C303030625C303030695C3030306E5C303030615C303030745C3030306F5C303030695C303030725C30303065}
\BKM@entry{id=32,open,dest={73656374696F6E2E332E33},srcline={108}}{5C3337365C3337375C3030304C5C303030655C303030735C3030305C3034305C303030735C3030305C3335315C303030725C303030695C303030655C303030735C3030305C3034305C303030675C3030305C3335315C3030306E5C3030305C3335315C303030725C303030615C303030745C303030725C303030695C303030635C303030655C303030735C3030305C3034305C303030655C3030306E5C3030305C3034305C303030635C3030306F5C3030306D5C303030625C303030695C3030306E5C303030615C303030745C3030306F5C303030695C303030725C30303065}
\zref@newlabel{mdf@pagelabel-47}{\default{3.1}\page{17}\abspage{21}\mdf@pagevalue{17}}
\oddpage@label{47}{17}
\pgfsyspdfmark {pgfid48}{4624382}{46250251}
\zref@newlabel{mdf@pagelabel-48}{\default{3.1}\page{17}\abspage{21}\mdf@pagevalue{17}}
\oddpage@label{48}{17}
\@writefile{loe}{\defcounter {refsection}{0}\relax }\@writefile{loe}{\contentsline {proposition}{\ifthmt@listswap Proposition~3.1.2\else \numberline {3.1.2}Proposition\fi }{17}{proposition.3.1.2}\protected@file@percent }
\pgfsyspdfmark {pgfid49}{4624382}{39622286}
\@writefile{toc}{\defcounter {refsection}{0}\relax }\@writefile{toc}{\contentsline {section}{\numberline {3.2}Séries formelles à plusieurs variables}{17}{section.3.2}\protected@file@percent }
\@writefile{toc}{\defcounter {refsection}{0}\relax }\@writefile{toc}{\contentsline {mtocsection}{\numberline {3.2}Séries formelles à plusieurs variables}{17}{section.3.2}\protected@file@percent }
\@writefile{toc}{\defcounter {refsection}{0}\relax }\@writefile{toc}{\contentsline {section}{\numberline {3.3}Les séries génératrices en combinatoire}{18}{section.3.3}\protected@file@percent }
\@writefile{toc}{\defcounter {refsection}{0}\relax }\@writefile{toc}{\contentsline {mtocsection}{\numberline {3.3}Les séries génératrices en combinatoire}{18}{section.3.3}\protected@file@percent }
\zref@newlabel{mdf@pagelabel-49}{\default{3.3}\page{18}\abspage{22}\mdf@pagevalue{18}}
\oddpage@label{49}{18}
\@writefile{loe}{\defcounter {refsection}{0}\relax }\@writefile{loe}{\contentsline {definition}{\ifthmt@listswap Definition~3.3.1\else \numberline {3.3.1}Definition\fi }{18}{definition.3.3.1}\protected@file@percent }
\pgfsyspdfmark {pgfid50}{14581719}{41941316}
\zref@newlabel{mdf@pagelabel-50}{\default{3.3}\page{18}\abspage{22}\mdf@pagevalue{18}}
\oddpage@label{50}{18}
\@writefile{loe}{\defcounter {refsection}{0}\relax }\@writefile{loe}{\contentsline {proposition}{\ifthmt@listswap Proposition~3.3.1\else \numberline {3.3.1}Proposition\fi }{18}{proposition.3.3.1}\protected@file@percent }
\pgfsyspdfmark {pgfid51}{14581719}{25747669}
\zref@newlabel{mdf@pagelabel-51}{\default{3.3}\page{18}\abspage{22}\mdf@pagevalue{18}}
\oddpage@label{51}{18}
\@writefile{loe}{\defcounter {refsection}{0}\relax }\@writefile{loe}{\contentsline {definition}{\ifthmt@listswap Definition~3.3.2\else \numberline {3.3.2}Definition\fi \thmtformatoptarg {Classe combinatoire}}{18}{definition.3.3.2}\protected@file@percent }
\pgfsyspdfmark {pgfid52}{14581719}{14566777}
\zref@newlabel{mdf@pagelabel-52}{\default{3.3}\page{18}\abspage{22}\mdf@pagevalue{18}}
\oddpage@label{52}{18}
\@writefile{loe}{\defcounter {refsection}{0}\relax }\@writefile{loe}{\contentsline {definition}{\ifthmt@listswap Definition~3.3.3\else \numberline {3.3.3}Definition\fi }{18}{definition.3.3.3}\protected@file@percent }
\pgfsyspdfmark {pgfid53}{14581719}{5919232}
\zref@newlabel{mdf@pagelabel-53}{\default{3.3}\page{19}\abspage{23}\mdf@pagevalue{19}}
\oddpage@label{53}{19}
\newmarginnote{note.22.1}{{23}{5110987sp}}
\pgfsyspdfmark {pgfid54}{4624382}{44445380}
\zref@newlabel{mdf@pagelabel-54}{\default{3.3}\page{19}\abspage{23}\mdf@pagevalue{19}}
\oddpage@label{54}{19}
\@writefile{loe}{\defcounter {refsection}{0}\relax }\@writefile{loe}{\contentsline {definition}{\ifthmt@listswap Definition~3.3.4\else \numberline {3.3.4}Definition\fi \thmtformatoptarg {Union disjointe}}{19}{definition.3.3.4}\protected@file@percent }
\pgfsyspdfmark {pgfid55}{4624382}{25568636}
\zref@newlabel{mdf@pagelabel-55}{\default{3.3}\page{19}\abspage{23}\mdf@pagevalue{19}}
\oddpage@label{55}{19}
\@writefile{loe}{\defcounter {refsection}{0}\relax }\@writefile{loe}{\contentsline {proposition}{\ifthmt@listswap Proposition~3.3.2\else \numberline {3.3.2}Proposition\fi }{19}{proposition.3.3.2}\protected@file@percent }
\pgfsyspdfmark {pgfid56}{4624382}{22548538}
\zref@newlabel{mdf@pagelabel-56}{\default{3.3}\page{19}\abspage{23}\mdf@pagevalue{19}}
\oddpage@label{56}{19}
\@writefile{loe}{\defcounter {refsection}{0}\relax }\@writefile{loe}{\contentsline {definition}{\ifthmt@listswap Definition~3.3.5\else \numberline {3.3.5}Definition\fi \thmtformatoptarg {Produit cartésien}}{19}{definition.3.3.5}\protected@file@percent }
\pgfsyspdfmark {pgfid57}{4624382}{6276608}
\zref@newlabel{mdf@pagelabel-57}{\default{3.3}\page{20}\abspage{24}\mdf@pagevalue{20}}
\oddpage@label{57}{20}
\pgfsyspdfmark {pgfid58}{14581719}{46586265}
\zref@newlabel{mdf@pagelabel-58}{\default{3.3}\page{20}\abspage{24}\mdf@pagevalue{20}}
\oddpage@label{58}{20}
\@writefile{loe}{\defcounter {refsection}{0}\relax }\@writefile{loe}{\contentsline {proposition}{\ifthmt@listswap Proposition~3.3.3\else \numberline {3.3.3}Proposition\fi }{20}{proposition.3.3.3}\protected@file@percent }
\pgfsyspdfmark {pgfid59}{14581719}{43566167}
\BKM@entry{id=33,open,dest={73656374696F6E2E332E34},srcline={213}}{5C3337365C3337375C303030435C303030615C3030306C5C303030635C303030755C3030306C5C303030735C3030305C3034305C303030645C303030655C3030305C3034305C303030735C3030305C3335315C303030725C303030695C303030655C303030735C3030305C3034305C303030675C3030305C3335315C3030306E5C3030305C3335315C303030725C303030615C303030745C303030725C303030695C303030635C303030655C303030735C3030305C3034305C303030635C3030306C5C303030615C303030735C303030735C303030695C303030715C303030755C303030655C30303073}
\BKM@entry{id=34,open,dest={73656374696F6E2E332E34},srcline={213}}{5C3337365C3337375C303030435C303030615C3030306C5C303030635C303030755C3030306C5C303030735C3030305C3034305C303030645C303030655C3030305C3034305C303030735C3030305C3335315C303030725C303030695C303030655C303030735C3030305C3034305C303030675C3030305C3335315C3030306E5C3030305C3335315C303030725C303030615C303030745C303030725C303030695C303030635C303030655C303030735C3030305C3034305C303030635C3030306C5C303030615C303030735C303030735C303030695C303030715C303030755C303030655C30303073}
\@writefile{toc}{\defcounter {refsection}{0}\relax }\@writefile{toc}{\contentsline {section}{\numberline {3.4}Calculs de séries génératrices classiques}{21}{section.3.4}\protected@file@percent }
\@writefile{toc}{\defcounter {refsection}{0}\relax }\@writefile{toc}{\contentsline {mtocsection}{\numberline {3.4}Calculs de séries génératrices classiques}{21}{section.3.4}\protected@file@percent }
\newlabel{eq:1}{{1}{21}{Nombres de Fibonacci}{equation.3.4.1}{}}
\newlabel{eq:1@cref}{{[equation][1][3]1}{[1][21][]21}}
\zref@newlabel{mdf@pagelabel-59}{\default{3.4}\page{21}\abspage{25}\mdf@pagevalue{21}}
\oddpage@label{59}{21}
\@writefile{loe}{\defcounter {refsection}{0}\relax }\@writefile{loe}{\contentsline {proposition}{\ifthmt@listswap Proposition~3.4.1\else \numberline {3.4.1}Proposition\fi }{21}{proposition.3.4.1}\protected@file@percent }
\pgfsyspdfmark {pgfid60}{4624382}{10268226}
\zref@newlabel{mdf@pagelabel-60}{\default{3.4}\page{22}\abspage{26}\mdf@pagevalue{22}}
\oddpage@label{60}{22}
\@writefile{loe}{\defcounter {refsection}{0}\relax }\@writefile{loe}{\contentsline {proposition}{\ifthmt@listswap Proposition~3.4.2\else \numberline {3.4.2}Proposition\fi }{22}{proposition.3.4.2}\protected@file@percent }
\pgfsyspdfmark {pgfid61}{14581719}{48698126}
\zref@newlabel{mdf@pagelabel-61}{\default{3.4}\page{22}\abspage{26}\mdf@pagevalue{22}}
\oddpage@label{61}{22}
\@writefile{loe}{\defcounter {refsection}{0}\relax }\@writefile{loe}{\contentsline {proposition}{\ifthmt@listswap Proposition~3.4.3\else \numberline {3.4.3}Proposition\fi }{22}{proposition.3.4.3}\protected@file@percent }
\pgfsyspdfmark {pgfid62}{14581719}{25912778}
\BKM@entry{id=35,open,dest={73756273656374696F6E2E332E342E31},srcline={297}}{5C3337365C3337375C303030505C303030615C303030725C303030745C303030695C303030745C303030695C3030306F5C3030306E5C303030735C3030305C3034305C303030645C303030275C303030655C3030306E5C303030745C303030695C303030655C303030725C30303073}
\@writefile{toc}{\defcounter {refsection}{0}\relax }\@writefile{toc}{\contentsline {subsection}{\numberline {3.4.1}Partitions d'entiers}{23}{subsection.3.4.1}\protected@file@percent }
\@writefile{toc}{\defcounter {refsection}{0}\relax }\@writefile{toc}{\contentsline {mtocsubsection}{\numberline {3.4.1}Partitions d'entiers}{23}{subsection.3.4.1}\protected@file@percent }
\zref@newlabel{mdf@pagelabel-62}{\default{3.4.1}\page{23}\abspage{27}\mdf@pagevalue{23}}
\oddpage@label{62}{23}
\@writefile{loe}{\defcounter {refsection}{0}\relax }\@writefile{loe}{\contentsline {proposition}{\ifthmt@listswap Proposition~3.4.4\else \numberline {3.4.4}Proposition\fi }{23}{proposition.3.4.4}\protected@file@percent }
\pgfsyspdfmark {pgfid63}{4624382}{18472745}
\BKM@entry{id=36,open,dest={636861707465722E34},srcline={2}}{5C3337365C3337375C303030545C303030685C3030305C3335315C3030306F5C303030725C303030695C303030655C3030305C3034305C303030645C303030655C303030735C3030305C3034305C303030675C303030725C303030615C303030705C303030685C303030655C30303073}
\BKM@entry{id=37,open,dest={73656374696F6E2E342E31},srcline={6}}{5C3337365C3337375C3030304E5C3030306F5C303030745C303030695C3030306F5C3030306E5C303030735C3030305C3034305C303030645C303030655C3030305C3034305C303030625C303030615C303030735C30303065}
\BKM@entry{id=38,open,dest={73656374696F6E2E342E31},srcline={6}}{5C3337365C3337375C3030304E5C3030306F5C303030745C303030695C3030306F5C3030306E5C303030735C3030305C3034305C303030645C303030655C3030305C3034305C303030625C303030615C303030735C30303065}
\@writefile{toc}{\defcounter {refsection}{0}\relax }\@writefile{toc}{\contentsline {chapter}{\numberline {4}Théorie des graphes}{25}{chapter.4}\protected@file@percent }
\@writefile{lof}{\defcounter {refsection}{0}\relax }\@writefile{lof}{\addvspace {10\p@ }}
\@writefile{lot}{\defcounter {refsection}{0}\relax }\@writefile{lot}{\addvspace {10\p@ }}
\@writefile{loi}{\defcounter {refsection}{0}\relax }\@writefile{loi}{\addvspace {10\p@ }}
\@writefile{lol}{\defcounter {refsection}{0}\relax }\@writefile{lol}{\addvspace {10\p@ }}
\new@tpo@label{4}{25}
\newlabel{ch:grph}{{4}{25}{Théorie des graphes}{chapter.4}{}}
\newlabel{ch:grph@cref}{{[chapter][4][]4}{[1][25][]25}}
\@writefile{toc}{\defcounter {refsection}{0}\relax }\@writefile{toc}{\contentsline {section}{\numberline {4.1}Notions de base}{25}{section.4.1}\protected@file@percent }
\@writefile{toc}{\defcounter {refsection}{0}\relax }\@writefile{toc}{\contentsline {mtocsection}{\numberline {4.1}Notions de base}{25}{section.4.1}\protected@file@percent }
\zref@newlabel{mdf@pagelabel-63}{\default{4.1}\page{25}\abspage{29}\mdf@pagevalue{25}}
\oddpage@label{63}{25}
\@writefile{loe}{\defcounter {refsection}{0}\relax }\@writefile{loe}{\addvspace {10\p@ }}
\@writefile{loe}{\defcounter {refsection}{0}\relax }\@writefile{loe}{\contentsline {definition}{\ifthmt@listswap Definition~4.1.1\else \numberline {4.1.1}Definition\fi \thmtformatoptarg {Graphe simple}}{25}{definition.4.1.1}\protected@file@percent }
\pgfsyspdfmark {pgfid64}{4624382}{41570986}
\zref@newlabel{mdf@pagelabel-64}{\default{4.1}\page{25}\abspage{29}\mdf@pagevalue{25}}
\oddpage@label{64}{25}
\@writefile{loe}{\defcounter {refsection}{0}\relax }\@writefile{loe}{\contentsline {definition}{\ifthmt@listswap Definition~4.1.2\else \numberline {4.1.2}Definition\fi \thmtformatoptarg {Multigraphe}}{25}{definition.4.1.2}\protected@file@percent }
\pgfsyspdfmark {pgfid65}{4624382}{38579796}
\zref@newlabel{mdf@pagelabel-65}{\default{4.1}\page{25}\abspage{29}\mdf@pagevalue{25}}
\oddpage@label{65}{25}
\@writefile{loe}{\defcounter {refsection}{0}\relax }\@writefile{loe}{\contentsline {definition}{\ifthmt@listswap Definition~4.1.3\else \numberline {4.1.3}Definition\fi \thmtformatoptarg {Graphe généralisé}}{25}{definition.4.1.3}\protected@file@percent }
\pgfsyspdfmark {pgfid66}{4624382}{34752521}
\zref@newlabel{mdf@pagelabel-66}{\default{4.1}\page{25}\abspage{29}\mdf@pagevalue{25}}
\oddpage@label{66}{25}
\@writefile{loe}{\defcounter {refsection}{0}\relax }\@writefile{loe}{\contentsline {definition}{\ifthmt@listswap Definition~4.1.4\else \numberline {4.1.4}Definition\fi \thmtformatoptarg {Graphe complet}}{25}{definition.4.1.4}\protected@file@percent }
\pgfsyspdfmark {pgfid67}{4624382}{30890935}
\zref@newlabel{mdf@pagelabel-67}{\default{4.1}\page{25}\abspage{29}\mdf@pagevalue{25}}
\oddpage@label{67}{25}
\@writefile{loe}{\defcounter {refsection}{0}\relax }\@writefile{loe}{\contentsline {definition}{\ifthmt@listswap Definition~4.1.5\else \numberline {4.1.5}Definition\fi \thmtformatoptarg {Degré d'un sommet}}{25}{definition.4.1.5}\protected@file@percent }
\pgfsyspdfmark {pgfid68}{4624382}{27029349}
\zref@newlabel{mdf@pagelabel-68}{\default{4.1}\page{25}\abspage{29}\mdf@pagevalue{25}}
\oddpage@label{68}{25}
\@writefile{loe}{\defcounter {refsection}{0}\relax }\@writefile{loe}{\contentsline {definition}{\ifthmt@listswap Definition~4.1.6\else \numberline {4.1.6}Definition\fi \thmtformatoptarg {Isomorphisme de graphe}}{25}{definition.4.1.6}\protected@file@percent }
\pgfsyspdfmark {pgfid69}{4624382}{21558492}
\zref@newlabel{mdf@pagelabel-69}{\default{4.1}\page{25}\abspage{29}\mdf@pagevalue{25}}
\oddpage@label{69}{25}
\@writefile{loe}{\defcounter {refsection}{0}\relax }\@writefile{loe}{\contentsline {definition}{\ifthmt@listswap Definition~4.1.7\else \numberline {4.1.7}Definition\fi \thmtformatoptarg {Graphe planaire}}{25}{definition.4.1.7}\protected@file@percent }
\pgfsyspdfmark {pgfid70}{4624382}{18572705}
\zref@newlabel{mdf@pagelabel-70}{\default{4.1}\page{25}\abspage{29}\mdf@pagevalue{25}}
\oddpage@label{70}{25}
\@writefile{loe}{\defcounter {refsection}{0}\relax }\@writefile{loe}{\contentsline {theorem}{\ifthmt@listswap Theorem~4.1.1\else \numberline {4.1.1}Theorem\fi }{25}{theorem.4.1.1}\protected@file@percent }
\pgfsyspdfmark {pgfid71}{4624382}{15589461}
\zref@newlabel{mdf@pagelabel-71}{\default{4.1}\page{25}\abspage{29}\mdf@pagevalue{25}}
\oddpage@label{71}{25}
\@writefile{loe}{\defcounter {refsection}{0}\relax }\@writefile{loe}{\contentsline {corollary}{\ifthmt@listswap Corollary~4.1.2\else \numberline {4.1.2}Corollary\fi }{25}{corollary.4.1.2}\protected@file@percent }
\pgfsyspdfmark {pgfid72}{4624382}{13447705}
\zref@newlabel{mdf@pagelabel-72}{\default{4.1}\page{25}\abspage{29}\mdf@pagevalue{25}}
\oddpage@label{72}{25}
\@writefile{loe}{\defcounter {refsection}{0}\relax }\@writefile{loe}{\contentsline {definition}{\ifthmt@listswap Definition~4.1.8\else \numberline {4.1.8}Definition\fi \thmtformatoptarg {Graphe orienté}}{25}{definition.4.1.8}\protected@file@percent }
\pgfsyspdfmark {pgfid73}{4624382}{8945178}
\zref@newlabel{mdf@pagelabel-73}{\default{4.1}\page{25}\abspage{29}\mdf@pagevalue{25}}
\oddpage@label{73}{25}
\@writefile{loe}{\defcounter {refsection}{0}\relax }\@writefile{loe}{\contentsline {theorem}{\ifthmt@listswap Theorem~4.1.3\else \numberline {4.1.3}Theorem\fi \thmtformatoptarg {Degree sum formula}}{25}{theorem.4.1.3}\protected@file@percent }
\pgfsyspdfmark {pgfid74}{4624382}{7399842}
\zref@newlabel{mdf@pagelabel-74}{\default{4.1}\page{26}\abspage{30}\mdf@pagevalue{26}}
\oddpage@label{74}{26}
\pgfsyspdfmark {pgfid75}{14581719}{47100278}
\BKM@entry{id=39,open,dest={706172742A2E37},srcline={101}}{5C3337365C3337375C303030535C3030305C3335315C303030725C303030695C303030655C30303073}
\@writefile{toc}{\defcounter {refsection}{0}\relax }\@writefile{toc}{\contentsline {part}{\nonumberline Séries}{27}{part*.7}\protected@file@percent }
\BKM@entry{id=40,open,dest={706172742A2E37},srcline={2}}{5C3337365C3337375C303030535C3030305C3335315C303030725C303030695C303030655C3030305C3034305C30303031}
\BKM@entry{id=41,open,dest={636861707465722A2E38},srcline={7}}{5C3337365C3337375C303030455C303030785C303030655C303030725C303030635C303030695C303030635C303030655C3030305C3034305C30303031}
\BKM@entry{id=42,open,dest={73656374696F6E2A2E3131},srcline={41}}{5C3337365C3337375C303030455C303030785C303030655C303030725C303030635C303030695C303030635C303030655C3030305C3034305C30303032}
\@writefile{toc}{\defcounter {refsection}{0}\relax }\@writefile{toc}{\contentsline {chapter}{Série 1}{29}{part*.7}\protected@file@percent }
\new@tpo@label{5}{29}
\@writefile{toc}{\defcounter {refsection}{0}\relax }\@writefile{toc}{\contentsline {section}{Exercice 1}{29}{chapter*.8}\protected@file@percent }
\@writefile{toc}{\defcounter {refsection}{0}\relax }\@writefile{toc}{\contentsline {section}{Exercice 2}{29}{section*.11}\protected@file@percent }
\BKM@entry{id=43,open,dest={73656374696F6E2A2E3134},srcline={87}}{5C3337365C3337375C303030455C303030785C303030655C303030725C303030635C303030695C303030635C303030655C3030305C3034305C30303033}
\BKM@entry{id=44,open,dest={73656374696F6E2A2E3137},srcline={107}}{5C3337365C3337375C303030455C303030785C303030655C303030725C303030635C303030695C303030635C303030655C3030305C3034305C30303034}
\@writefile{toc}{\defcounter {refsection}{0}\relax }\@writefile{toc}{\contentsline {section}{Exercice 3}{30}{section*.14}\protected@file@percent }
\BKM@entry{id=45,open,dest={73656374696F6E2A2E3230},srcline={142}}{5C3337365C3337375C303030455C303030785C303030655C303030725C303030635C303030695C303030635C303030655C3030305C3034305C30303035}
\@writefile{toc}{\defcounter {refsection}{0}\relax }\@writefile{toc}{\contentsline {section}{Exercice 4}{31}{section*.17}\protected@file@percent }
\@writefile{toc}{\defcounter {refsection}{0}\relax }\@writefile{toc}{\contentsline {section}{Exercice 5}{31}{section*.20}\protected@file@percent }
\abx@aux@read@bbl@mdfivesum{nobblfile}
\global\@namedef{scr@dte@chapter@lastmaxnumwidth}{9.10825pt}
\global\@namedef{scr@dte@section@lastmaxnumwidth}{16.62575pt}
\global\@namedef{scr@dte@subsection@lastmaxnumwidth}{24.16266pt}
\gdef \@abspage@last{36}
