,loss,val_loss
0,0.031235894188284874,0.005118967965245247
1,0.004928972106426954,0.0027439126279205084
2,0.003534058341756463,0.0031047617085278034
3,0.0027711852453649044,0.0029456831980496645
4,0.002302747219800949,0.0015772120095789433
5,0.0019539319910109043,0.0027013460639864206
6,0.0016747035551816225,0.0017580899875611067
7,0.0015129130333662033,0.002561942907050252
8,0.0013150941813364625,0.0016731731593608856
9,0.0012068359646946192,0.0012792753987014294
10,0.0011452129110693932,0.0009867846965789795
11,0.001077660359442234,0.0009005207102745771
12,0.0009795997757464647,0.0009208034607581794
13,0.0009337228257209063,0.0012625656090676785
14,0.0009216266917064786,0.0011902758851647377
