TM	HGV	DDB	papyri-info	series	volume	fascicle	numbers	side	generic	page	number	format-type	format-subtype	format-variation	text-type	text-subtype	hgv-subjects	hgv-de	hgv-en	iframe	IIIF	canvasID	image	printed-image	image-rights	fibres	height	width	shape	writing-parallel	margin-top	margin-bottom	margin-left	margin-right	columns	blank-after	blank-height	seal	hand-nb	section-nb	m1	m2	m3	m4	m5	m6	m7	m8	m9	m10	m11	section1	section2	section3	section4	section5	section6	section7	section8	section9	section10	section11	section12	section13	section14	section15	section16	section17	section18	section19	section20	section21	section22	section23	section24	section25	section26	section27	section28	section29	section30	section31	section32	section33	section34	section35	section36	section37	section38	section39	section40	section41	section42	section43	section44	section45	section43	section44	section45
1769	1769	p.col;3;53	https://papyri.info/ddbdp/p.col;3;53	P.Col.	3		53					gt_ti	gt_prosangelma				Anzeige; Diebstahl; Sesam		prosangelma,report of a crime,theft				https://papyri.info/ddbdp/p.col;3;53/images			fh	12	12.5	Sq		1	3	1	1	1				1	2	#section1 #section2/											1-1/#m1/date	1-8/#m1/main-text																																														
3213	3213	p.lille;1;6	https://papyri.info/ddbdp/p.lille;1;6	P.Lille	1		6					gt_ti	gt_prosangelma				Eingabe; Petesuchos an Kresilaos; Überfall; Raub der Kleidung und des Geldes		prosangelma,report of a crime,theft				http://ipap.csad.ox.ac.uk/4DLink4/4DACTION/IPAPwebquery?vPub=P.Lille&vVol=&vNum=6			fh	38	10	VR		1.5	3.8	1	0	1				2	4	#section1 #section2/	#section3 #section4/										1-1/#m1/date	1-16/#m1/main-text	17-17/#m2/date	17-25/#m2/main-text																																												
2502	2502	p.lond;7;1981dupl	https://papyri.info/ddbdp/p.lond;7;1981dupl	P.Lond.	7		1980					gt_ti	gt_prosangelma				Anzeige; Bauern; Chrematisten (?); Saatgut; Zuweisung; Land		prosangelma,report of a crime,mistreatment				http://www.bl.uk/manuscripts/FullDisplay.aspx?ref=Papyrus_2672			fh	11.5	8.6	VR		0.6	0.8	0.2	0	1			Y	1	2	#section1 #section2/											1-20/#m1/main-text	21-21/#m1/date																																														
1934	1934	p.mich;1;34	https://papyri.info/ddbdp/p.mich;1;34	P.Mich.	1		34					gt_ti	gt_prosangelma				Eingabe; Eselin; Verlust; Meldung		prosangelma,report of a crime,theft		https://quod.lib.umich.edu/cgi/i/image/api/manifest/apis:1859:3196R_A.TIF		https://quod.lib.umich.edu/a/apis/x-1859		free	fv	20	11	VR		1.5	2.8	0.5	0	1				1	6	#section1 #section2 #section3 #section4 #section5 #section6/											1-1/#m1/date	1-2/#m1/introduction	3-10/#m1/main-text	11-11/#m1/date	11-13/#m1/introduction	13-21/#m1/main-text																																										
1952	1952	p.mich;1;52	https://papyri.info/ddbdp/p.mich;1;52	P.Mich.	1		52					gt_ti	gt_prosangelma				Eingabe; Lagerung im Speicher (Getreide)		prosangelma,report of a crime,mistreatment		https://quod.lib.umich.edu/cgi/i/image/api/manifest/apis:1766:3085R_A.TIF		https://quod.lib.umich.edu/a/apis/x-1766		free	fh	18.5	8.3	VR		1	1.5	0.8	0	1				1	2	#section1 #section2/											1-17/#m1/main-text	17-18/#m1/date																																														
2077	2077	psi;4;393	https://papyri.info/ddbdp/psi;4;393	PSI	4		393					gt_ti	gt_prosangelma				Eingabe; Diebstahl; Anzeige; Wert; Geld		prosangelma,report of a crime,theft				http://www.psi-online.it/documents/psi;4;393			fh	30.5	9	VR		1.5	7	0.3	0	1				1	4	#section1 #section2 #section3 #section4/											1-1/#m1/date	1-12/#m1/main-text	13-13/#m1/date	13-30/#m1/main-text																																												
4176	4176	sb;16;12823	https://papyri.info/ddbdp/sb;16;12823	SB	17		12823					gt_ti	gt_prosangelma				Meldung an Polizei; Namen; Fällung und Diebstahl von Bäumen in Abwesenheit des Besitzers; Geldwert; Schaden		prosangelma,report of a crime,theft		https://quod.lib.umich.edu/cgi/i/image/api/manifest/apis:3038:6949R.TIF		https://quod.lib.umich.edu/a/apis/x-3038/		free	fh	15.8	6.9	VR		0.8	6.8	0.8	0	1				1	2	#section1 #section2/											1-1/#m1/date	1-13/#m1/main-text																																														