TM	HGV	DDB	papyri-info	series	volume	fascicle	numbers	side	generic	page	number	format-type	format-subtype	format-variation	text-type	text-subtype	hgv-subjects	hgv-de	hgv-en	iframe	IIIF	canvasID	image	printed-image	image-rights	fibres	height	width	shape	writing-parallel	margin-top	margin-bottom	margin-left	margin-right	columns	blank-after	blank-height	seal	hand-nb	section-nb	m1	m2	m3	m4	m5	m6	m7	m8	m9	m10	m11	section1	section2	section3	section4	section5	section6	section7	section8	section9	section10	section11	section12	section13	section14	section15	section16	section17	section18	section19	section20	section21	section22	section23	section24	section25	section26	section27	section28	section29	section30	section31	section32	section33	section34	section35	section36	section37	section38	section39	section40	section41	section42	section43	section44	section45	section43	section44	section45
5580	5580	psi;13;1310	https://papyri.info/ddbdp/psi;13;1310	PSI	13		1310					gt_ri	gt_report	gt_officialProcP			Urteil,Vormund,Waisen		Judicial proceedings,orphans				http://www.psi-online.it/documents/psi;13;1310			fh	30	60	HR		3	4	4.5	0	3				1	6	#section1 #section2 #section3 #section4 #section5 #section6/											1-1/#m1/introduction	2-4/#m1/main-text	5-6/#m1/date	6-7/#m1/introduction	7-53/#m1/main-text	54-54/#m1/subscription																																										
8918	8918	chr.wilck;;393	https://papyri.info/ddbdp/chr.wilck;;393	BGU	1		15					gt_ri	gt_report	gt_officialProcR			Protokoll,Prozeß,Klage gegen die gleichzeitige Belastung mit zwei Liturgien im eigenen und in einem fremden Dorf,Kopie,Auszug		Judicial proceedings,liturgy				https://berlpap.smb.museum/16139/			fh	22.5	36.5	HR		1.2	6.5	2.7	0.8	2				1	4	#section1 #section2 #section3 #section4/											1-2/#m1/descr-contents	2-3/#m1/date	3-3/#m1/trans-clause	4-17/#m1/main-text																																												
8929	8929	sb;24;16258	https://papyri.info/ddbdp/sb;24;16258	SB	24		16258					gt_ri	gt_report	gt_officialProcR			Abschrift,Protokoll einer Untersuchung des Strategen wegen Brandstiftung		Judicial proceedings,arson				https://berlpap.smb.museum/01822/			fh	21.5	30	HR		3	4.9	3.8	3.4	1				1	4	#section1 #section2 #section3 #section4/											1-1/#m1/introduction	1-2/#m1/date	2-17/#m1/main-text	17-17/#m1/subscription																																												
8950	8950	chr.mitt;;85	https://papyri.info/ddbdp/chr.mitt;;85	BGU	1		19					gt_ri	gt_report	gt_officialProcR			Auszug aus Akten,Problem der Repräsentation bei einer Erbschaft durch Ägypter		Judicial proceedings,inheritance				https://berlpap.smb.museum/01722/			fv	21.3	41.5	HR		1.7	3	1	0	2				1	4	#section1 #section2 #section3 #section4/											1-2/#m1/descr-contents	3-3/#m1/date	3-4/#m1/introduction	4-42/#m1/main-text																																												
9069	9069	chr.wilck;;76	https://papyri.info/ddbdp/chr.wilck;;76	BGU	1		347					gt_ri	gt_report	gt_officialProc			Kopie eines Antrags auf Beschneidung des Sohnes eines Priesters		Judicial proceedings,priest				https://berlpap.smb.museum/16832/			fh	23	55	HR		2.5	4.6	0	3	2				1	4	#section1 #section2 #section3 #section4/											1-2/#m1/introduction	2-3/#m1/date	3-17/#m1/main-text	17-17/#m1/subscription																																												
9245	9245	bgu;2;587	https://papyri.info/ddbdp/bgu;2;587#	BGU	2		587					gt_ri	gt_report	gt_officialProcR			Protokoll,Prozeß um den Dienst eines Schreibers (Dorf)		Judicial proceedings				https://berlpap.smb.museum/01838/			fh	21.3	 13.5	VR		1	11	1	0	1				2	2	#section1 #section2/	#section2/										1-1/#m1/date	2-14/#m1 #m2/main-text																																														
9263	9263	chr.mitt;;89	https://papyri.info/ddbdp/chr.mitt;;89	BGU	2		613					gt_ri	gt_report	gt_officialProcR			Kopie einer Eingabe mit einer Eingabe,Weg (Dienst),Erbschaft		Judicial proceedings,petition,inheritance				https://berlpap.smb.museum/02138/			fh	32.5	25	VR		0	5	0	0	1				1	3	#section1 #section2 #section3/											25-25/#m1/date	25-26/#m1/introduction	26-36/#m1/main-text																																													
10732	10732	p.fam.tebt;;15	https://papyri.info/ddbdp/p.fam.tebt;;15	P.Fam. Tebt.			15					gt_ri	gt_report	gt_officialProcR			Schreiben (amtlich),Akten,Verwaltung,Grundbuchamt,Erbschaft,Archiv,Aufbewahrung,Urkunden,Theater		Judicial proceedings,inheritance				https://www.bl.uk/manuscripts/FullDisplay.aspx?ref=Papyrus_1885			fh	21	114.5	HR		2	1	0	0	6				1	3	#section1 #section2 #section3/											131-132/#m1/introduction	132-133/#m1/date	133-146/#m1/main-text																																													
10742	10742	p.fam.tebt;;24dupl	https://papyri.info/ddbdp/p.fam.tebt;;24dupl	P.Fam. Tebt.			24					gt_ri	gt_report	gt_officialProcR			Akten,Prozeß,Protokoll,Grundbuchamt,Aufbewahrung,Urkunden,Archiv		Judicial proceedings,petition,land				https://www.bl.uk/manuscripts/FullDisplay.aspx?ref=Papyrus_1888			fh	21	9.3	HR		1	2	0	0	4				1	5	#section1 #section2 #section3 #section4 #section5/											1-3/#m1/introduction	3-4/#m1/date	4-110/#m1/main-text	110-110/#m1/subscription	111-111/#m1/date																																											
12168	12168	p.mich;6;365	https://papyri.info/ddbdp/p.mich;6;365	P.Mich.	6		365					gt_ri	gt_report	gt_officialProcR			Protokoll,Prozeß vor dem Epistrategen,Auszüge,Verletzung von Privilegien		Judicial proceedings,trial				http://ipap.csad.ox.ac.uk/4DLink4/4DACTION/IPAPwebquery?vPub=P.Mich.&vVol=6&vNum=365			fv	30	15.5	VR		2.5	10.5	4	0	1				1	3	#section1 #section2 #section3/											1-2/#m1/introduction	3-4/#m1/date	4-19/#m1/main-text																																													
13049	13049	p.sakaon;;31	https://papyri.info/ddbdp/p.sakaon;;31	P.Sakaon			31					gt_ri	gt_report	gt_officialProcR			Protokoll,Prozeß,Diebstahl,Vieh,Fluchtgefahr des Diebes		Judicial proceedings,theft				http://ipap.csad.ox.ac.uk/4DLink4/4DACTION/IPAPwebquery?vPub=P.Sakaon&vVol=&vNum=31			fh	26	25	Sq		0.5	3.5	1	0	1				1	3	#section1 #section2 #section3/											1-1/#m1/date	1-2/#m1/introduction	3-20/#m1/main-text																																													
13827	13827	psi;10;1100	https://papyri.info/ddbdp/psi;10;1100	PSI	10		1100					gt_ri	gt_report	gt_officialProcR			Auszug,Akten,Anhörung,Epistratege,Verhaftung,Erhebung,Getreide		Judicial proceedings				http://www.psi-online.it/documents/psi;10;1100			fh	28.7	22.2	VR		1.5	6.7	2.8	0	1				1	4	#section1 #section2 #section3 #section4/											1-1/#m1/introduction	2-2/#m1/trans-clause	2-29/#m1/main-text	30-30/#m1/date																																												
14029	14029	sb;5;7558	https://papyri.info/ddbdp/sb;5;7558#	SB	5		7558					gt_ri	gt_report	gt_officialProcR			Kopie einer Petition an Epistrategen,Befreiung von Vormundschaft		Judicial proceedings,guardian		https://quod.lib.umich.edu/cgi/i/image/api/manifest/apis:1689:2922R.TIF		https://quod.lib.umich.edu/a/apis/x-1689/		free	fh	29.5	28	VR		2.5	1	3.1	0	1				1	6	#section1 #section2 #section3 #section4 #section5 #section6/											12-12/#m1/descr-contents	12-13/#m1/date	13-31/#m1/main-text	31-31/#m1/descr-contents	31-34/#m1/main-text	34-35/#m1/date																																										
14146	14146	p.bacch;;20	https://papyri.info/ddbdp/p.bacch;;20#	SB	6		9329					gt_ri	gt_report	gt_officialProcR			Protokoll,Prozeß,Heranziehung zu Liturgien		Judicial proceedings,liturgy				https://findit.library.yale.edu/catalog/digcoll:2757145			fh	22	22	Sq		1.2	5	3	2	1				1	3	#section1 #section2 #section3/											1-2/#m1/introduction	3-11/#m1/main-text	12-13/#m1/date																																													
15020	15020	stud.pal;20;4	https://papyri.info/ddbdp/stud.pal;20;4	SPP	20		4					gt_ri	gt_report	gt_officialProcR			Protokoll,Prozeß,Erbschaft,		Judicial proceedings,inheritance				http://data.onb.ac.at/rec/RZ00001293			fh	28.5	21	VR		0	2.7	0.7	0	1				2	6	#section2 #section3 #section4/	#section1 #section2 #section5 #section6/										1-1/#m2/heading	2-4/#m1 #m2/introduction	4-5/#m1/date	6-41/#m1/main-text	41-42/#m2/addition	42-44/#m2/date																																										
15996	15995	p.oxy;43;3117	https://papyri.info/ddbdp/p.oxy;43;3117	P.Oxy.	43		3117					gt_ri	gt_report	gt_officialProcR			Protokoll,Prozeß,Gericht,Teilung,Erbschaft		Judicial proceedings,inheritance	https://widgets.figshare.com/articles/21167236/embed?show_title=1			https://doi.org/10.25446/oxford.21167236.v1			fh	21	23	VR		0.4	1	0.3	0	1				1	3	#section1 #section2 #section3/											1-1/#m1/date	1-1/#m1/introduction	2-26/#m1/main-text																																													
16518	16518	p.oxy;41;2955dupl	https://papyri.info/ddbdp/p.oxy;41;2955dupl	P.Oxy.	41		2955					gt_ri	gt_report	gt_officialProcR			Protokoll,Prozeß vor dem praefectus Aegypti		Judicial proceedings				https://doi.org/10.25446/oxford.21166678.v1			fh	23	26	HR		1.2	3.4	2	0	1				1	3	#section1 #section2 #section3/											1-1/#m1/introduction	2-2/#m1/date	2-18/#m1/main-text																																													
18024	18024	sb;5;8247	https://papyri.info/ddbdp/sb;5;8247	SB	5		8247					gt_ri	gt_report	gt_officialProcR			Protokoll,Audienz (Präfekt),Beschwerde		Judicial proceedings				https://findit.library.yale.edu/catalog/digcoll:2758681			fh	21.2	35	HR		1	2.5	1.8	0	2				1	3	#section1 #section2 #section3/											1-1/#m1/descr-contents	2-2/#m1/introduction	2-19/#m1/main-text																																													
20196	20196	chr.mitt;;86	https://papyri.info/ddbdp/chr.mitt;;86	BGU	1		136					gt_ri	gt_report	gt_officialProcR			Kopie aus Akten eines Richters,Protokoll,Prozeß		Judicial proceedings,inheritance				https://berlpap.smb.museum/01729/			fh	21.2	16.8	VR		1.1	2.3	0	0	1				2	5	#section1 #section2 #section3 #section4 #section5 #section6/	#section5/										1-1/#m1/descr-contents	1-2/#m1/introduction	2-3/#m1/date	4-5/#m1/introduction	5-27/#m1 #m2/main-text																																											
20699	20699	c.pap.gr;1;19	https://papyri.info/ddbdp/c.pap.gr;1;19	P.Oxy.	1		37					gt_ri	gt_report	gt_officialProcR			Protokoll (Prozeß),Identität eines Kindes (Findel)		Judicial proceedings				https://www.bl.uk/manuscripts/FullDisplay.aspx?ref=Papyrus_746			fh	31	40.7	HR		3.2	2.9	6.8	3.4	2				1	4	#section1 #section2 #section3 #section4/											1-1/#m1/introduction	2-3/#m1/date	3-4/#m1/introduction	4-36/#m1/main-text																																												
20977	20977	p.fouad;;21dupl	https://papyri.info/ddbdp/p.fouad;;21dupl	P.Fouad			21					gt_ri	gt_report	gt_officialProcR			Abschrift,Edikt,Urteil,Bürgerrecht,Status,Veteranan,Schreiben (amtlich)		Judicial proceedings,citizenship				http://ipap.csad.ox.ac.uk/4DLink4/4DACTION/IPAPwebquery?vPub=P.Fouad&vVol=&vNum=21			fh	19	19	Sq		2.6	1	0	0	1				1	5	#section1 #section2 #section3 #section4 #section5/											1-1/#m1/descr-contents	2-3/#m1/date	4-4/#m1/introduction	4-16/#m1 #m2/main-text	17-17/#m1/subscription																																											
21045	21045	p.hamb;1;29	https://papyri.info/ddbdp/p.hamb;1;29#	P.Hamb.	1		29					gt_ri	gt_report	gt_officialProcR			Auszüge,Amtstagebuch,Präfekt,Gericht,Konvent		Judicial proceedings		https://iiif.sub.uni-hamburg.de/object/HANSh753/manifest		http://resolver.sub.uni-hamburg.de/goobi/HANSh753			fh	27.5	16.5	VR		1.5	0	1	0	1				1	6	#section1 #section2 #section3 #section4 #section5 #section6/											1-1/#m1/descr-contents	2-2/#m1/date	3-17/#m1/main-text	18-18/#m1/heading	19-19/#m1/date	20-26/#m1/main-text																																										
21511	21511	pap.choix;;7	https://papyri.info/ddbdp/pap.choix;;7#	P.Oslo	2		17					gt_ri	gt_report	gt_officialProcR			Auszug,Protokoll (Prozeß),Abholzung eines Weinbergs		Judicial proceedings,vineyard				https://ub-baser.uio.no/opes/record/135			fh	16	20.4	HR		2	3.8	0.5	0	1				1	3	#section1 #section2 #section3/											1-1/#m1/introduction	2-2/#m1/date	3-18/#m1/main-text																																													
21727	21727	p.oxy;8;1102	https://papyri.info/ddbdp/p.oxy;8;1102#	P.Oxy.	8		1102					gt_ri	gt_report	gt_officialProcR			Bericht über einen Streit (Recht,Eigentum)		Judicial proceedings,property				https://www.bl.uk/manuscripts/FullDisplay.aspx?ref=Papyrus_2058			fh	20.4	25.5	HR		0	5.2	5.8	0	1				1	4	#section1 #section2 #section3 #section4/											1-1/#m1/descr-contents	1-1/#m1/date	2-25/#m1/main-text	25-25/#m1/subscription																																												