TM	HGV	DDB	papyri-info	series	volume	fascicle	numbers	side	generic	page	number	format-type	format-subtype	format-variation	text-type	text-subtype	hgv-subjects	hgv-de	hgv-en	iframe	IIIF	canvasID	image	printed-image	image-rights	fibres	height	width	shape	writing-parallel	margin-top	margin-bottom	margin-left	margin-right	columns	blank-after	blank-height	seal	hand-nb	section-nb	m1	m2	m3	m4	m5	m6	m7	m8	m9	m10	m11	section1	section2	section3	section4	section5	section6	section7	section8	section9	section10	section11	section12	section13	section14	section15	section16	section17	section18	section19	section20	section21	section22	section23	section24	section25	section26	section27	section28	section29	section30	section31	section32	section33	section34	section35	section36	section37	section38	section39	section40	section41	section42	section43	section44	section45	section43	section44	section45
9098	9098	bgu;1;53		BGU	1		53					gt_ti	gt_decl	gt_decl_census	gtyp_decl	gtyp_decl_census	Deklaration,Zensus	Deklaration,Zensus	Declaration,Census				http://berlpap.smb.museum/01753/			fh	13.3	11.8	Sq	short	1	2.2	2.8	0	1			No	2	4	#section1 #section2 #section4/	#section3/										1-7/#m1/introduction	7-15/#m1/main-text	15-15/#m2/addition	16-17/#m1/date																																												
9132	9132	bgu;1;90dupl		BGU	1		90					gt_ti	gt_decl	gt_decl_census	gtyp_decl	gtyp_decl_census	Deklaration,Zensus	Deklaration,Zensus	Declaration,Census				http://berlpap.smb.museum/01897/			fh	21	9	VR	short	1	2.8	1.8	0	1	23		No	1	3	#section1 #section2 #section3/											1-5/#m1/introduction	6-23/#m1/main-text	24-28/#m1/date																																													
9135	9135	bgu;1;95		BGU	1		95					gt_ti	gt_decl	gt_decl_census	gtyp_decl	gtyp_decl_census	Deklaration,Zensus	Deklaration,Zensus	Declaration,Census				http://berlpap.smb.museum/01741/			fh	20.5	15	VR	short	1.8	2	3	0	1			No	3	4	#section1 #section2 #section3 #section4/	#section3/	#section3/									1-6/#m1/introduction	6-21/#m1/main-text	22-23/#m1 #m2/addition	24-24/#m1/date																																												
9136	9136	chr.wilck;;204		Chr.Wilck.			204					gt_ti	gt_decl	gt_decl_census	gtyp_decl	gtyp_decl_census	Deklaration,Zensus	Deklaration,Zensus	Declaration,Census				http://berlpap.smb.museum/01730/			fh	17.8	10.8	VR	short	1.2	0.5	1.5	0	1			No	3	3	#section1 #section2/	#section3/	#section3/									1-8/#m1/introduction	8-21/#m1/main-text	22-23/#m2 #m3/addition																																													
10195	10195	p.berl.leihg;1;15		P.Berl. Leihg	1		15					gt_ti	gt_decl	gt_decl_census	gtyp_decl	gtyp_decl_census	Deklaration,Zensus	Deklaration,Zensus	Declaration,Census				http://berlpap.smb.museum/03986/			fh	22.3	15.2	VR	short	1.8	6.2	3.2	0	1	25		No	2	4	#section1 #section2 #section3/	#section4/										1-6/#m1/introduction	6-22/#m1/main-text	22-24/#m1/date	24-25/#m2/addition																																												
11982	11982	p.mich;3;176		P.Mich.	3		176					gt_ti	gt_decl	gt_decl_census	gtyp_decl	gtyp_decl_census	Deklaration,Zensus,Eid,Namen,Signalement	Deklaration,Zensus,Eid,Name,Signalement	Declaration,Census		https://quod.lib.umich.edu/cgi/i/image/api/manifest/apis:1304:104.TIF		http://quod.lib.umich.edu/a/apis/x-1304		free	fh	22.5	9	VR	short	1.6	2.8	0.7	0	1			No	1	4	#section1 #section2 #section3 #section4/											1-4/#m1/introduction	4-23/#m1/main-text	23-24/#m1/subscription	25-26/#m1/date																																												
11983	11983	p.mich;3;177		P.Mich.	3		177					gt_ti	gt_decl	gt_decl_census	gtyp_decl	gtyp_decl_census	Deklaration,Zensus,Namen,Signalement	Deklaration,Zensus,Name,Signalement	Declaration,Census		https://quod.lib.umich.edu/cgi/i/image/api/manifest/apis:1309:105R.TIF		http://quod.lib.umich.edu/a/apis/x-1309		free	fh	22.5	8	VR	short	1.8	1	1.5	0	1	5		No	3	5	#section1 #section2/	#section3 #section4/	#section5/									1-10/#m1/introduction	10-26/#m1/main-text	28-30/#m2/addition	30-32/#m2/date	33-34/#m3/addition																																											
12174	12174	p.mich;6;370		P.Mich.	6		370					gt_ti	gt_decl	gt_decl_census	gtyp_decl	gtyp_decl_census	Deklaration,Zensus	Deklaration,Zensus	Declaration,Census				http://ipap.csad.ox.ac.uk/Michigan-bw/300dpi/P.Mich.VI.370.jpg			fh	21.7	9.5	VR	short	1	0.8	1.5	0	1	29		No	6	4	#section1 #section2/	#section3/	#section3/	#section3/	#section3/	#section4/						1-7/#m1/introduction	7-24/#m1/main-text	25-29/#m2 #m3 #m4 #m5/addition	31-32/#m6/date																																												
12554	12554	p.oslo;2;25		P.Oslo	2		25					gt_ti	gt_decl	gt_decl_census	gtyp_decl	gtyp_decl_census	Deklaration,Zensus	Deklaration,Zensus	Declaration,Census				https://ub-baser.uio.no/opes/record/139			fh	22.5	9.1	VR	short	1.5	1.2	2.1	0	1			No	5	4	#section1 #section2/	#section3/	#section3/	#section3/	#section4/							1-9/#m1/introduction	10-20/#m1/main-text	22-27/#m2 #m3 #m4/addition	29-32/#m5/date																																												
12875	12875	p.rein;1;46		P.Rein.	1		46					gt_ti	gt_decl	gt_decl_census	gtyp_decl	gtyp_decl_census	Deklaration,Zensus	Deklaration,Zensus	Declaration,Census				http://www.papyrologie.paris-sorbonne.fr/photos/2012048.jpg			fh	24.4	10.2	VR	short	1.8	3.5	1.8	0	1	26		No	2	4	#section1 #section2/	#section3 #section4/										1-9/#m1/introduction	9-21/#m1/main-text	22-23/#m2/subscription	24-26/#m2/date																																												
13481	13481	p.tebt;2;322		P.Tebt.	2		322					gt_ti	gt_decl	gt_decl_census	gtyp_decl	gtyp_decl_census	Deklaration,Zensus	Deklaration,Zensus	Declaration,Census		https://digicoll.lib.berkeley.edu/nanna/iiif/231544/manifest?manifest=/nanna/iiif/231544/manifest		https://digicoll.lib.berkeley.edu/record/231544			fh	22	13	VR	short	1.3	2.6	2	0	1			No	5	6	#section1/	#section2 #section4/	#section3/	#section5/	#section5/							1-1/#m1/addition	2-8/#m2/introduction	8-26/#m2/main-text	27-27/#m3/subscription	28-29/#m2/date	30-31/#m4 #m5/addition																																										
13997	13997	sb;1;5661		SB	1		5661					gt_ti	gt_decl	gt_decl_census	gtyp_decl	gtyp_decl_census	Deklaration,Zensus	Deklaration,Zensus	Declaration,Census				https://ub-baser.uio.no/opes/record/138			fh	28	11	VR	short	2	6	3	0	1	16, 22, 27		No	3	4	#section1 #section2 #section3/	#section4/	#section4/									1-9/#m1/introduction	9-22/#m1/main-text	23-23/#m1/date	24-25/#m2 #m3/addition																																												
14730	14730	sb;18;13288		SB	18		13288					gt_ti	gt_decl	gt_decl_census	gtyp_decl	gtyp_decl_census	Deklaration (Zensus),Stratege	Deklaration,Zensus,Stratege	Declaration,Census				http://ipap.csad.ox.ac.uk/SB-bw/300dpi/SB.XVIII.13288r.jpg			fh	21.8	7.2	VR	short	1	6.5	2	0	1	3, 23		No	1	4	#section1 #section2 #section3 #section4/											1-1/#m1/col-no	2-9/#m1/introduction	9-20/#m1/main-text	21-23/#m1/date																																												
14732	14732	p.sel.warga;;3		P.Sel. Warga			3					gt_ti	gt_decl	gt_decl_census	gtyp_decl	gtyp_decl_census	Deklaration (Zensus),Stratege	Deklaration,Zensus,Stratege	Declaration,Census				http://ipap.csad.ox.ac.uk/SB-bw/300dpi/SB.XVIII.13290.jpg			fh	23.5	7.5	VR	short	1.2	4.5	1.2	0	1	17, 23		No	1	3	#section1 #section2 #section3/											1-8/#m1/introduction	8-17/#m1/main-text	18-23/#m1/date																																													
15387	15387	p.oxy;50;3565		P.Oxy.	50		3565					gt_ti	gt_decl	gt_decl_census	gtyp_decl	gtyp_decl_census	Zensus,Deklaration	Deklaration,Zensus	Declaration,Census				https://doi.org/10.25446/oxford.21174094.v1			fh	29.6	5.5	VR	short	0.5	4.5	1.5	0	1	39, 40, 41		No	3	4	#section1 #section2 #section3/	#section4/	#section4/									1-4/#m1/introduction	5-29/#m1/main-text	29-36/#m1/date	36-39/#m2/subscription	40-43/#m3/addition																																											
17397	17397	psi;12;1227		PSI	12		1227					gt_ti	gt_decl	gt_decl_census	gtyp_decl	gtyp_decl_census	Anzeige,Zensus	Deklaration,Zensus	Declaration,Census				http://www.psi-online.it/documents/psi;12;1227			fv	25.7	22	Sq	short	2.3	1.4	1.7	2.6	1			No	1	4	#section1 #section2 #section3 #section4/											1-1/#m1/heading	1-7/#m1/introduction	7-19/#m1/main-text	19-20/#m1/date																																												
19335	19335	p.bad;4;75b		P.Bad	4		75		b			gt_ti	gt_decl	gt_decl_census	gtyp_decl	gtyp_decl_census	Deklaration (Zensus),Person,Familie,Besitz	Deklaration,Zensus	Declaration,Census		https://digi.ub.uni-heidelberg.de/diglit/iiif3/p_g_604/manifest		https://doi.org/10.11588/diglit.42718			fh	32.3	8.7	VR	short	1.93	6	1.5	0	1	42		No	2	4	#section1 #section2 #section3/	#section2 #section4/										1-5/#m1/introduction	5-34/#m1 #m2/main-text	35-38/#m1/date	39-42/#m2/addition																																												