TM	HGV	DDB	papyri-info	series	volume	fascicle	numbers	side	generic	page	number	format-type	format-subtype	format-variation	text-type	text-subtype	hgv-subjects	hgv-de	hgv-en	iframe	IIIF	canvasID	image	printed-image	image-rights	fibres	height	width	shape	writing-parallel	margin-top	margin-bottom	margin-left	margin-right	columns	blank-after	blank-height	seal	hand-nb	section-nb	m1	m2	m3	m4	m5	m6	m7	m8	m9	m10	m11	section1	section2	section3	section4	section5	section6	section7	section8	section9	section10	section11	section12	section13	section14	section15	section16	section17	section18	section19	section20	section21	section22	section23	section24	section25	section26	section27	section28	section29	section30	section31	section32	section33	section34	section35	section36	section37	section38	section39	section40	section41	section42	section43	section44	section45	section43	section44	section45
9062	9062	bgu;1;336	http://www.papyri.info/ddbdp/bgu;1;336	BGU	1		336					gt_os	gt_os_receipt	gt_sitologos			Quittung,Sitologen	Quittung,Sitologen 	Receipt,Sitologos				https://berlpap.smb.museum/01934/			fh	11	9.8	Sq		1.8	4.5	1.4	0	1			no	1	2	#section1 #section2											1-3/#m1/date	4-12/#m1/main-text																																														
9105	9105	bgu;1;61	http://www.papyri.info/ddbdp/bgu;1;61	BGU	1		61					gt_os	gt_os_receipt	gt_sitologos			Bericht,Sitologen	Quittung,Sitologen 	Receipt,Sitologos				https://berlpap.smb.museum/16717/			fh	23	22	Sq		1.5	7.5	3	0	2			no	1	3	#section1 #section2 #section3											1-4/#m1/date	4-13/#m1/main-text	14-15/#m1/addition																																													
9111	9111	bgu;1;67	http://www.papyri.info/ddbdp/bgu;1;67	BGU	1		67					gt_os	gt_os_receipt	gt_sitologos			Bericht,Sitologen	Quittung,Sitologen 	Receipt,Sitologos				https://berlpap.smb.museum/01762/			fh	23	15	VR		1.5	9	2	0	1			no	1	2	#section1 #section2											1-4/#m1/date	5-14/#m1/main-text																																														
9314	9314	bgu;3;716	http://www.papyri.info/ddbdp/bgu;3;716	BGU	3		716					gt_os	gt_os_receipt	gt_sitologos			Quittungen,Sitologen	Quittung,Sitologen 	Receipt,Sitologos				https://berlpap.smb.museum/02484/			fh	18	10	VR		1	3.5	0.5	0	1			no	1	2	#section1 #section2											1-4/#m1/date	4-15/#m1/main-text																																														
9329	9329	bgu;3;755	http://www.papyri.info/ddbdp/bgu;3;755	BGU	3		755					gt_os	gt_os_receipt	gt_sitologos			Quittung,Sitologen	Quittung,Sitologen 	Receipt,Sitologos				https://berlpap.smb.museum/02442/			fh	11	11	Sq		1.5	4	1.5	0	1			no	1	2	#section1 #section2											1-3/#m1/date	3-8/#m1/main-text																																														
9349	9349	bgu;3;787	http://www.papyri.info/ddbdp/bgu;3;787	BGU	3		747					gt_os	gt_os_receipt	gt_sitologos			Quittung,Getreide	Quittung,Sitologen,monartabos,catoecic 	Receipt,Sitologos,monartabos,catoecic land				https://berlpap.smb.museum/02551/			fh	25.4	10.5	VR		4	13.8	0	0	1			no	1	2	#section1 #section2											1-2/#m1/date	2-7/#m1/main-text																																														
9430	9430	bgu;3;988	http://www.papyri.info/ddbdp/bgu;3;988	BGU	3		988					gt_os	gt_os_receipt	gt_sitologos			Quittung,Sitologen	Quittung,Sitologen,monartabos,catoecic 	Receipt,Sitologos,monartabos,catoecic land				https://berlpap.smb.museum/02117/			fv	27.5	10.2	VR		2	0	1.3	0	1			no	2	4	#section1 #section2 #section3 #section4	#section2										1-4/#m1/date	4-17/#m1 #m2/main-text	18-20/#m1/date	21-25/#m1/main-text																																												
9513	9513	bgu;7;1608	http://www.papyri.info/ddbdp/bgu;7;1608	BGU	7		1608					gt_os	gt_os_receipt	gt_sitologos			Quittung,Sitologen	Quittung,Sitologen 	Receipt,Sitologos				http://www.papyrology.uw.edu.pl/papyri/pberlin11503.htm			fh	11.5	9.5	Sq		1	2	1	0	1			no	1	3	#section1 #section2 #section3											1-3/#m1/date	3-10/#m1/main-text	10-10/#m1/addition																																													
9562	9562	bgu;11;2025	http://www.papyri.info/ddbdp/bgu;11;2025	BGU	11		2025					gt_os	gt_os_receipt	gt_sitologos			Quittungen,Sitologen	Quittung,Sitologen 	Receipt,Sitologos				https://berlpap.smb.museum/17155/			fh	13.8	9	VR		2.5	0	2	0	1			no	2	4	#section1 #section2	#section3 #section4										1-4/#m1/date	4-10/#m1 #m2/main-text	11-13/#m2/date	13-15/#m2/main-text																																												
10210	10210	p.berl.leihg;1;25	http://www.papyri.info/ddbdp/p.berl.leihg;1;25	P.Berl. Leihg.	1		25					gt_os	gt_os_receipt	gt_sitologos			Quittung,Sitologen,Akklamation (Imperator)	Quittung,Sitologen 	Receipt,Sitologos				https://berlpap.smb.museum/03085/			fh	22.8	10	VR		0.7	10.3	1.8	0	1			no	1	2	#section1 #section2											1-5/#m1/date	5-14/#m1/main-text																																														
10441	10441	p.cair.preis.2;;28	http://www.papyri.info/ddbdp/p.cair.preis.2;;28	P.Cair. Preis.	2		28					gt_os	gt_os_receipt	gt_sitologos			Quittung,Sitologen	Quittung,Sitologen 	Receipt,Sitologos				http://ipap.csad.ox.ac.uk/4DLink4/4DACTION/IPAPwebquery?vPub=P.Cair.Preis.&vVol=&vNum=28			fh	23.6	9.4	VR		1.3	10.8	2.5	0	1			no	1	2	#section1 #section2											1-6/#m1/date	6-13/#m1/main-text																																														
10925	10925	p.fay;;82	http://www.papyri.info/ddbdp/p.fay;;82	P.Fay.			82					gt_os	gt_os_receipt	gt_sitologos			Quittung,Sitologen	Quittung,Sitologen 	Receipt,Sitologos				http://ipap.csad.ox.ac.uk/4DLink4/4DACTION/IPAPwebquery?vPub=P.Fay.&vVol=&vNum=82			fh	20.5	8.5	VR		1.4	0	0.7	0	1			no	1	1	#section1											1-28/#m1/main-text																																															
10927	10927	p.fay;;84	http://www.papyri.info/ddbdp/p.fay;;84	P.Fay.			84					gt_os	gt_os_receipt	gt_sitologos			Quittung,Sitologen	Quittung,Sitologen 	Receipt,Sitologos				http://ipap.csad.ox.ac.uk/4DLink4/4DACTION/IPAPwebquery?vPub=P.Fay.&vVol=&vNum=84			fh	12.2	10.8	Sq		1	2	1.5	1.5	1			no	1	2	#section1 #section2											1-5/#m1/date	5-11/#m1/main-text																																														
11256	11256	p.gen;2;110	http://www.papyri.info/ddbdp/p.gen;2;110	P.Gen.	2		110					gt_os	gt_os_receipt	gt_sitologos			Quittung,Sitologen,Weizen	Quittung,Sitologen 	Receipt,Sitologos				https://archives.bge-geneve.ch/ark:/17786/vta9c0a91db1cc4f1db			fh	8.1	15.3	HR		1	3	2	0	1			no	2	3	#section1 #section2	#section3										1-2/#m1/date	2-7/#m1/main-text	7-7/#m2/addition																																													
11259	11259	p.gen;2;114	http://www.papyri.info/ddbdp/p.gen;2;114	P.Gen.	2		114					gt_os	gt_os_receipt	gt_sitologos			Quittung,Sitologen,Weizen	Quittung,Sitologen 	Receipt,Sitologos				https://archives.bge-geneve.ch/ark:/17786/vta05a7aa1f8cdd996a			fh	22.8	10	VR		1	9.5	1.5	0	1			no	1	2	#section1 #section2											1-5/#m1/date	5-16/#m1/main-text																																														
11265	11265	p.gen;2;96	http://www.papyri.info/ddbdp/p.gen;2;96	P.Gen.	2		96					gt_os	gt_os_receipt	gt_sitologos			Quittung,Sitologen,Weizen	Quittung,Sitologen 	Receipt,Sitologos				https://archives.bge-geneve.ch/ark:/17786/vta955b3e68d8011475			fh	13	8.5	VR		1	0.6	1.5	0	1			no	3	3	#section1 #section2	#section3	#section3									1-4/#m1/date	4-9/#m1/main-text	10-11/#m2 #m3/addition																																													
11653	11653	p.lond;2;217	http://www.papyri.info/ddbdp/p.lond;2;217	P.Lond.	2		217					gt_os	gt_os_receipt	gt_sitologos			Quittung,Sitologen	Quittung,Sitologen 	Receipt,Sitologos				http://www.bl.uk/manuscripts/FullDisplay.aspx?ref=Papyrus_217			fh	19.7	8.4	VR		0.9	5.4	1.2	0	1			no	1	3	#section1 #section2 #section3											1-6/#m1/date	6-16/#m1/main-text	16-17/#m1/addition																																													
11674	11674a	p.lond;2;290	http://www.papyri.info/ddbdp/p.lond;2;290	P.Lond.	2		290					gt_os	gt_os_receipt	gt_sitologos			Quittung,Sitologen	Quittung,Sitologen 	Receipt,Sitologos				http://www.bl.uk/manuscripts/FullDisplay.aspx?ref=Papyrus_290			fh	22	10	VR		2.8	0.6	1.9	0	1			no	1	8	#section1 #section2 #section3 #section4 #section5 #section6 #section7 #section8											1-2/#m1/date	3-6/#m1/main-text	6-7/#m1/addition	8-9/#m1/date	10-13/#m1/main-text	14-14/#m1/addition	15-16/#m1/date	16-17/#m1/main-text																																								
11694	11694	chr.wilck;;357	http://www.papyri.info/ddbdp/chr.wilck;;357	Chr.Wilck.			357					gt_os	gt_os_receipt	gt_sitologos			Quittung,Sitologen	Quittung,Sitologen 	Receipt,Sitologos				http://www.bl.uk/manuscripts/FullDisplay.aspx?ref=Papyrus_315			fh	28.6	10.3	VR		1.9	10.7	2	0	1			no	1	2	#section1 #section2											1-18/#m1/main-text	19-21/#m1/date																																														
11725	11725	p.lond;2;346a	http://www.papyri.info/ddbdp/p.lond;2;346a	P.Lond.	2		346		a			gt_os	gt_os_receipt	gt_sitologos			Quittung,Sitologen	Quittung,Sitologen 	Receipt,Sitologos				http://www.bl.uk/manuscripts/FullDisplay.aspx?ref=Papyrus_346			fh	6.3	10.2	HR		1.2	0.7	1.8	0	1			no	1	2	#section1 #section2											1-2/#m1/date	3-6/#m1/main-text																																														
11726	11726	p.lond;2;346b	http://www.papyri.info/ddbdp/p.lond;2;346	P.Lond.	2		346		b			gt_os	gt_os_receipt	gt_sitologos			Quittung,Sitologen	Quittung,Sitologen 	Receipt,Sitologos				http://www.bl.uk/manuscripts/FullDisplay.aspx?ref=Papyrus_346			fh	6.4	7.2	Sq		0.6	0.5	1	0	1			no	1	2	#section1 #section2											1-3/#m1/date	3-8/#m1/main-text																																														
11727	11727	p.lond;2;346c	http://www.papyri.info/ddbdp/p.lond;2;346	P.Lond.	2		346		c			gt_os	gt_os_receipt	gt_sitologos			Quittung,Sitologen	Quittung,Sitologen 	Receipt,Sitologos				http://www.bl.uk/manuscripts/FullDisplay.aspx?ref=Papyrus_346			fv	5.2	10.7	HR		0.4	1.6	1.2	0	1			no	1	2	#section1 #section2											1-2/#m1/date	2-5/#m1/main-text																																														
11732	11732	p.lond;2;351	http://www.papyri.info/ddbdp/p.lond;2;351	P.Lond.	2		351					gt_os	gt_os_receipt	gt_sitologos			Quittungen,Sitologen	Quittung,Sitologen 	Receipt,Sitologos				http://www.bl.uk/manuscripts/FullDisplay.aspx?ref=Papyrus_351			fv	11.4	11.1	Sq		0.3	3.1	1.1	0	1			no	1	2	#section1 #section2											1-5/#m1/date	5-12/#m1/main-text																																														
11753	11753	p.lond;2;471	http://www.papyri.info/ddbdp/p.lond;2;471	P.Lond.	2		471					gt_os	gt_os_receipt	gt_sitologos			Quittung,Sitologen	Quittung,Sitologen 	Receipt,Sitologos				http://www.bl.uk/manuscripts/FullDisplay.aspx?ref=Papyrus_471			fh	11.5	7.9	VR		1.8	2.1	1.2	0	1			no	1	2	#section1 #section2											1-3/#m1/date	4-10/#m1/main-text																																														
11812	11812	p.lond;3;913	http://www.papyri.info/ddbdp/p.lond;3;913	P.Lond.	3		913					gt_os	gt_os_receipt	gt_sitologos			Quittung,Sitologen	Quittung,Sitologen 	Receipt,Sitologos				http://www.bl.uk/manuscripts/FullDisplay.aspx?ref=Papyrus_913			fv	17.5	14.2	VR		1.6	9.1	3.2	1	1			no	1	2	#section1 #section2											1-3/#m1/date	3-7/#m1/main-text																																														
12198	12198	p.mich;6;391	http://www.papyri.info/ddbdp/p.mich;6;391	P.Mich.	6		391					gt_os	gt_os_receipt	gt_sitologos			Quittungen,Steuern,Sitologen,Getreide	Quittung,Sitologen 	Receipt,Sitologos		https://quod.lib.umich.edu/cgi/i/image/api/manifest/apis:2263:4691.TIF		https://quod.lib.umich.edu/a/apis/x-2263		free	fh	17.6	7.4	VR		1.5	3.5	0.8	0.1	1			no	1	2	#section1 #section2											1-5/#m1/date	5-17/#m1/main-text																																														
12199	12199	p.mich;6;392	http://www.papyri.info/ddbdp/p.mich;6;392	P.Mich.	6		392					gt_os	gt_os_receipt	gt_sitologos			Quittung,Steuern,zwei Formulare,Getreide,Sitologen	Quittung,Sitologen 	Receipt,Sitologos				http://ipap.csad.ox.ac.uk/4DLink4/4DACTION/IPAPwebquery?vPub=P.Mich.&vVol=6&vNum=392			fh	20.5	13.5	VR		2.5	12.5	3	0	1			no	1	2	#section1 #section2											1-2/#m1/date	3-6/#m1/main-text																																														
12205	12205	p.mich;6;398	http://www.papyri.info/ddbdp/p.mich;6;398	P.Mich.	6		398					gt_os	gt_os_receipt	gt_sitologos			Quittung,Steuern,Getreide,Sitologen	Quittung,Sitologen 	Receipt,Sitologos		https://quod.lib.umich.edu/cgi/i/image/api/manifest/apis:1690:2923.TIF		https://quod.lib.umich.edu/a/apis/x-1690		free	fh	17	9.3	VR		1.1	3.2	1	0.6	1			no	1	2	#section1 #section2											1-6/#m1/date	6-15/#m1/main-text																																														
12333	12333	p.mich;15;701	http://www.papyri.info/ddbdp/p.mich;15;701	P.Mich.	15		701					gt_os	gt_os_receipt	gt_sitologos			Quittung,Sitologen	Quittung,Sitologen 	Receipt,Sitologos		https://quod.lib.umich.edu/cgi/i/image/api/manifest/apis:2514:5591R.TIF		https://quod.lib.umich.edu/a/apis/x-2514		free	fh	11.7	7	VR		0.8	2	0	0	1			no	1	3	#section1 #section2 #section3											1-2/#m1/date	3-12/#m1/main-text	12-13/#m1/subscription																																													
12556	12556	p.oslo;2;28	http://www.papyri.info/ddbdp/p.oslo;2;28	P.Oslo	2		28					gt_os	gt_os_receipt	gt_sitologos			Quittung,Sitologen,Steuern,Getreide	Quittung,Sitologen 	Receipt,Sitologos				https://ub-baser.uio.no/opes/record/59			fh	14.6	7.6	VR		1	7	0.8	0	1			no	1	2	#section1 #section2											1-3/#m1/date	4-13/#m1/main-text																																														
13524	13524	p.tebt;2;367	http://www.papyri.info/ddbdp/p.tebt;2;367	P.Tebt.	2		367					gt_os	gt_os_receipt	gt_sitologos			Quittungen,Sitologen	Quittung,Sitologen 	Receipt,Sitologos		https://digicoll.lib.berkeley.edu/nanna/iiif/232167/manifest?manifest=/nanna/iiif/232167/manifest		https://digicoll.lib.berkeley.edu/record/232167			fh	22.5	10	VR		1.2	5.5	2.3	0	1			no	2	3	#section1 #section2	#section3										1-5/#m1/date	5-22/#m1/main-text	22-23/#m2/addition																																													
13832	13832	psi;10;1113	http://www.papyri.info/ddbdp/psi;10;1113	PSI	10		1113					gt_os	gt_os_receipt	gt_sitologos			Quittung,Steuern,Getreide,Sitologen	Quittung,Sitologen 	Receipt,Sitologos				http://www.psi-online.it/documents/psi;10;1113			fh	11.8	11.3	Sq		1.4	2.5	1.7	0	1			no	1	2	#section1 #section2											1-3/#m1/date	3-13/#m1/main-text																																														
13876	13876	psi;14;1407	http://www.papyri.info/ddbdp/psi;14;1407	PSI	14		1407					gt_os	gt_os_receipt	gt_sitologos			Quittung,Sitologen	Quittung,Sitologen 	Receipt,Sitologos				http://www.psi-online.it/documents/psi;14;1407			fh	20.4	10.7	VR		1.2	15	1.2	0	1			no	1	2	#section1 #section2											1-3/#m1/date	3-11/#m1/main-text																																														
14446	14446	sb;22;15732	http://www.papyri.info/ddbdp/sb;22;15732	SB	22		15732					gt_os	gt_os_receipt	gt_sitologos			Quittung,Sitologe,Weizen	Quittung,Sitologen,monartabos,catoecic 	Receipt,Sitologos,monartabos,catoecic land				https://ub-baser.uio.no/opes/record/57			fh	13.3	15	VR		1.7	1.6	2.7	0.9	1			no	1	3	#section1 #section2 #section3											1-3/#m1/date	3-16/#m1/main-text	16-16/#m1/addition																																													
14548	14548	sb;14;12120	http://www.papyri.info/ddbdp/sb;14;12120	SB	14		12120					gt_os	gt_os_receipt	gt_sitologos			Quittung,Sitologen,Weizen	Quittung,Sitologen 	Receipt,Sitologos				https://www.altegeschichte.uni-bonn.de/die-abteilung/bonner-papyrus-und-ostrakonsammlung/Papyri/p.bonn-006/view			fh	11	7.5	VR		0.7	0.5	1	0	1			no	1	2	#section1 #section2											1-5/#m1/date	5-13/#m1/main-text																																														
14645	14645	sb;16;12683	http://www.papyri.info/ddbdp/sb;16;12683	SB	16		12683					gt_os	gt_os_receipt	gt_sitologos			Quittung,Sitologen,Zahlung,Steuer,Weizen,Land in anderem Verwaltungsbezirk	Quittung,Sitologen 	Receipt,Sitologos				http://data.onb.ac.at/rec/RZ00006009			fh	4.9	13	HR		1.2	0.6	1.1	0.2	1			no	2	3	#section1 #section2	#section3										1-2/#m1/date	2-5/#m1/main-text	6-6/#m2/addition																																													
15044	15044	stud.pal;22;118	http://www.papyri.info/ddbdp/stud.pal;22;118	SPP	22		118					gt_os	gt_os_receipt	gt_sitologos			Quittung,Sitologen	Quittung,Sitologen 	Receipt,Sitologos				http://data.onb.ac.at/rec/RZ00003336			fh	13.3	11.1	Sq		1.5	0	2.5	0	1			no	3	3	#section1 #section2	#section3	#section3									1-5/#m1/date	6-13/#m1/main-text	14-17/#m2 #m3/addition																																													
15048	15048	stud.pal;22;121	http://www.papyri.info/ddbdp/stud.pal;22;121	SPP	22		121					gt_os	gt_os_receipt	gt_sitologos			Quittung,Sitologen	Quittung,Sitologen 	Receipt,Sitologos				http://data.onb.ac.at/rec/RZ00007973			fh	7	11	HR		0.5	0.2	1.2	1.3	1			no	1	2	#section1 #section2											1-3/#m1/date	4-10/#m1/main-text																																														
15053	15053	stud.pal;22;127	http://www.papyri.info/ddbdp/stud.pal;22;127	SPP	22		127					gt_os	gt_os_receipt	gt_sitologos			Quittung,Sitologen	Quittung,Sitologen 	Receipt,Sitologos				http://data.onb.ac.at/rec/RZ00007979			fh	12	5.7	VR		0.8	0.7	0.5	0	1			no	3	3	#section1 #section2	#section3	#section3									1-4/#m1/date	5-12/#m1/main-text	13-18/#m2 #m3/addition																																													
15078	15078	stud.pal;22;158	http://www.papyri.info/ddbdp/stud.pal;22;158	SPP	22		158					gt_os	gt_os_receipt	gt_sitologos			Quittung,Sitologen	Quittung,Sitologen 	Receipt,Sitologos				http://data.onb.ac.at/rec/RZ00008005			fh	9.5	11.8	HR		1.3	1	1.8	0.2	1			no	1	3	#section1 #section2 #section3											1-3/#m1/date	3-8/#m1/main-text	9-10/#m1/addition																																													
15653	15653	p.oxy;49;3497	https://papyri.info/ddbdp/p.oxy;49;3497	P.Oxy.	49		3497					gt_os	gt_os_receipt	gt_sitologos			Darlehen (Weizen)	Quittung,Sitologen 	Receipt,Sitologos	https://widgets.figshare.com/articles/21168589/embed?show_title=1			https://doi.org/10.25446/oxford.21168589.v1			fh	17.5	7.5	VR		1.4	7.5	1	0	1			no	1	2	#section1 #section2/											1-12/#m1/main-text	12-12/#m1/addition																																														
15926	15926	p.oxy;44;3163	https://papyri.info/ddbdp/p.oxy;44;3163	P.Oxy.	44		3163					gt_os	gt_os_receipt	gt_sitologos			Quittung,Getreide,Sitologen,Vermerk des Episphragistes	Quittung,Sitologen 	Receipt,Sitologos	https://widgets.figshare.com/articles/21167407/embed?show_title=1			https://doi.org/10.25446/oxford.21167407.v1			fh	19	7.5	VR		2.1	1	0.5	0	1			no	5	3	#section1 #section2	#section3	#section3	#section3	#section3							1-3/#m1/date	4-11/#m1/main-text	11-22/#m2 #m3 #m4 #m5/addition																																													
15943	15943	p.oxy;44;3179	https://papyri.info/ddbdp/p.oxy;44;3179	P.Oxy.	44		3179					gt_os	gt_os_receipt	gt_sitologos			Quittung,Getreide,Dekaproten	Quittung,Sitologen 	Receipt,Sitologos	https://widgets.figshare.com/articles/21167455/embed?show_title=1			https://doi.org/10.25446/oxford.21167455.v1			fv	8.5	17	HR		0.4	2	2	0	1			no	1	2	#section1 #section2/											1-5/#m1/main-text	6-6/#m1/addition																																														
16905	16905	p.oxy;31;2591	https://papyri.info/ddbdp/p.oxy;31;2591	P.Oxy.	31		2591					gt_os	gt_os_receipt	gt_sitologos			Feststellung,Kredit,Weizen,Befehl,Auszahlung,Weizen,Artaben	Quittung,Sitologen 	Receipt,Sitologos	https://widgets.figshare.com/articles/21165304/embed?show_title=1			https://doi.org/10.25446/oxford.21165304.v1			fh	18.9	7.9	VR		2.4	3.6	1	0	1			no	3	2	#section1	#section2	#section2									1-11/#m1/main-text	12-18/#m2 #m3/addition																																														
20648	20648	p.oxy;3;517	https://papyri.info/ddbdp/p.oxy;3;517	P.Oxy.	3		517					gt_os	gt_os_receipt	gt_sitologos			Quittung,Überweisung,Getreide	Quittung,Sitologen 	Receipt,Sitologos				http://sceti.library.upenn.edu/pages/index.cfm?so_id=4234			fh	10.5	5.8	VR		0	0	0.6	0	1			no	1	2	#section1 #section2/											1-13/#m1/main-text	14-20/#m1/addition																																														
20649	20649	p.oxy;3;518	https://papyri.info/ddbdp/p.oxy;3;518	P.Oxy.	3		518					gt_os	gt_os_receipt	gt_sitologos			Quittung,Sitologen	Quittung,Sitologen 	Receipt,Sitologos				http://sceti.library.upenn.edu/pages/index.cfm?so_id=4235			fh	10.7	8.9	VR		0.8	5	1.1	0	1			no	2	2	#section1	#section2										1-6/#m1/main-text	6-6/#m2/addition																																														
20670	20670	zpe;160;183	https://papyri.info/ddbdp/zpe;160;183	P.Oxy.	3		615					gt_os	gt_os_receipt	gt_sitologos			Quittung,Sitologen	Quittung,Sitologen 	Receipt,Sitologos		https://figgy.princeton.edu/concern/scanned_resources/3cba0418-7e52-4db4-93b2-d660254b479b/manifest		https://dpul.princeton.edu/papyri/catalog/qb98mj987			fh	7.2	16	HR		1.5	1.7	1	0.6	1			no	1	2	#section1 #section2											1-4/#m1/main-text	5-5/#m1/addition																																														
20672	20672	zpe;160;186	https://papyri.info/ddbdp/zpe;160;186	P.Oxy.	3		617					gt_os	gt_os_receipt	gt_sitologos			Quittung,Getreide	Quittung,Sitologen 	Receipt,Sitologos				https://hdl.handle.net/10079/digcoll/2756826			fh	14.8	7.5	VR		1.5	7.8	1	0	1			no	1	2	#section1 #section2											1-6/#m1/main-text	6-7/#m1/addition																																														
20748	20748	p.oxy;1;89	https://papyri.info/ddbdp/p.oxy;1;89	P.Oxy.	1		89					gt_os	gt_os_receipt	gt_sitologos			Quittung,Getreide	Quittung,Sitologen 	Receipt,Sitologos				http://ipap.csad.ox.ac.uk/POxy-bw/300dpi/P.Oxy.I.89r.jpg			fh	20	12	VR		2.6	1.4	1.3	0	1			no	1	2	#section1 #section2											1-8/#m1/main-text	8-9/#m1/addition																																														
20749	20749	p.oxy;1;90	https://papyri.info/ddbdp/p.oxy;1;90	P.Oxy.	1		90					gt_os	gt_os_receipt	gt_sitologos			Quittung,Getreide	Quittung,Sitologen 	Receipt,Sitologos				http://www.bl.uk/manuscripts/FullDisplay.aspx?ref=Papyrus_761			fh	10.5	8.5	VR		0.8	4.8	1.4	0	1			no	1	2	#section1 #section2											1-5/#m1/main-text	5-5/#m1/addition																																														
21197	21197	p.koeln;2;90	https://papyri.info/ddbdp/p.koeln;2;90	P.Koeln	2		90					gt_os	gt_os_receipt	gt_sitologos			Quittung,eingezahltes Guthaben von Weizen	Quittung,Sitologen 	Receipt,Sitologos				https://papyri.uni-koeln.de/stueck/tm21197			fh	15.5	5	VR		1.1	3.4	1.4	0	1			no	3	2	#section1	#section2	#section2									1-12/#m1/main-text	13-18/#m2 #m3/addition																																														
22230	22230	p.oxy;38;2841	http://www.papyri.info/ddbdp/p.oxy;38;2841	P.Oxy.	38		2841					gt_os	gt_os_receipt	gt_sitologos			Quittung,Sitologen,Korn	Quittung,Sitologen 	Receipt,Sitologos	https://widgets.figshare.com/articles/21166183/embed?show_title=1			https://doi.org/10.25446/oxford.21166183.v1			fh	10	8.5	VR		1	2	1.8	0	1			no	3	3	#section1 #section2	#section3	#section3									1-3/#m1/date	3-9/#m1/main-text	9-13/#m2 #m3/addition																																													
23281	23281	bgu;16;2559	http://www.papyri.info/ddbdp/bgu;16;2559	BGU	16		2559					gt_ee	gt_ee_receipt	 			Quittungen,Sitologen,Auszug,Register (Steuern)	Quittung,Sitologen,monartabos,catoecic 	Receipt,Sitologos,monartabos,catoecic land				https://berlpap.smb.museum/05077/			fh	30.2	18.5	VR		4.3	5.1	2	3	1			no	2	6	#section1 #section2 #section3 #section4/	#section5 #section6										1-2/#m1/introduction	2-5/#m1/main-text	6-7/#m1/introduction	8-11/#m1/main-text	12-13/#m2/introduction	13-16/#m2/main-text																																										
78619	78619	p.oxy;67;4587	https://papyri.info/ddbdp/p.oxy;67;4587	P.Oxy.	67		4587					gt_os	gt_os_receipt	gt_sitologos			Quittung,Sitologos,Getreide,Abgabe	Quittung,Sitologen 	Receipt,Sitologos	https://widgets.figshare.com/articles/21179278/embed?show_title=1			https://doi.org/10.25446/oxford.21179278.v1			fh	13.3	12.6	Sq		1.5	5.8	0.9	0	1			no	2	2	#section1 #section2	#section2										1-8/#m1/main-text	8-11/#m1 #m2/addition																																														
78622	78622a	p.oxy;67;4589	https://papyri.info/ddbdp/p.oxy;67;4589	P.Oxy.	67		4589					gt_os	gt_os_receipt	gt_sitologos			Quittung,Überweisung von Getreidemengen	Quittung,Sitologen 	Receipt,Sitologos	https://widgets.figshare.com/articles/21179284/embed?show_title=1			https://doi.org/10.25446/oxford.21179284.v1			fh	22.5	20	Sq		1	0.3	2.5	0	2			no	7	12	#section1 #section7 #section8	#section2	#section9 #section10	#section11	#section11 #section12	#section2 #section5 #section6	#section3 #section4					1-16/#m1 #m2 #m6/main-text	17-17/#m6/addition	18-20/#m7/main-text	21-21/#m7/addition	22-23/#m6/main-text	23-23/#m6/addition	24-28/#m1/main-text	28-28/#m1/addition	29-34/#m3/main-text	34-34/#m3/addition	35-47/#m4 #m5/main-text	47-47/#m5/addition																																				
114268	114268	p.oxy;72;4887	https://papyri.info/ddbdp/p.oxy;72;4887	P.Oxy.	72		4887					gt_os	gt_os_receipt	gt_sitologos			Quittung,Sitologen,Einzahlung (Giro) von Weizen beim Speicher von Seryphis; Auftrag an den Sitologen (diastolikon),Giro - Überweisung von Weizen	Quittung,Sitologen 	Receipt,Sitologos	https://widgets.figshare.com/articles/21180304/embed?show_title=1			https://doi.org/10.25446/oxford.21180304.v1			fh	13.7	8.5	VR		1.2	7.3	0.7	0	1			no	1	3	#section1 #section2 #section3											1-6/#m1/main-text	6-6/#m1/addition	7-9/#m1/main-text																																													
114271	114271	p.oxy;72;4890	https://papyri.info/ddbdp/p.oxy;72;4890	P.Oxy.	72		4890					gt_os	gt_os_receipt	gt_sitologos			Quittung,Sitologen,Einzahlungen (Giro) von Weizen beim Speicher von Enteiïs	Quittung,Sitologen 	Receipt,Sitologos	https://widgets.figshare.com/articles/21180313/embed?show_title=1			https://doi.org/10.25446/oxford.21180313.v1			fh	12.8	13	Sq		1.5	1.5	0	3.6	1			no	2	2	#section1 #section2/	#section1 #section2/										1-11/#m1 #m2/main-text	11-14/#m1 #m2/addition																																														