TM	HGV	DDB	papyri-info	series	volume	fascicle	numbers	side	generic	page	number	format-type	format-subtype	format-variation	text-type	text-subtype	hgv-subjects	hgv-de	hgv-en	iframe	IIIF	canvasID	image	printed-image	image-rights	fibres	height	width	shape	writing-parallel	margin-top	margin-bottom	margin-left	margin-right	columns	blank-after	blank-height	seal	hand-nb	section-nb	m1	m2	m3	m4	m5	m6	m7	m8	m9	m10	m11	section1	section2	section3	section4	section5	section6	section7	section8	section9	section10	section11	section12	section13	section14	section15	section16	section17	section18	section19	section20	section21	section22	section23	section24	section25	section26	section27	section28	section29	section30	section31	section32	section33	section34	section35	section36	section37	section38	section39	section40	section41	section42	section43	section44	section45	section43	section44	section45
10435	10435	p.cair.preis.2;;21	http://papyri.info/ddbdp/p.cair.preis.2;;21	P.Cair. Preis.		(2. ed.)	21					gt_os	gt_os_receipt	gt_os_tax			Quittung,Steuer (Kopfsteuer),Geld		Poll-Tax,Laographia				http://ipap.csad.ox.ac.uk/4DLink4/4DACTION/IPAPwebquery?vPub=P.Fay.&vVol=&vNum=199	P.Cair. Preis., Plate 19		fh	9.7	8	VR		0.6	1.8	0	0	1			No	3	2	#section1 #section2	#section2	#section2									1-4/#m1/date	4-7/#m1 #m2 #m3/main-text																																														
10437	10437	p.cair.preis.2;;23	http://papyri.info/ddbdp/p.cair.preis.2;;23	P.Cair. Preis.		(2. ed.)	23					gt_os	gt_os_receipt	gt_os_tax			Quittung,Steuer (Kopfsteuer),Geld		Poll-Tax,Laographia				http://ipap.csad.ox.ac.uk/4DLink4/4DACTION/IPAPwebquery?vPub=P.Fay.&vVol=&vNum=279	P.Cair. Preis., Plate 21		fh	15.9	8.3	VR		2.2	5.4	0.9	0	1				1	2	#section1 #section2/											1-3/#m1/date	3-6/#m1/main-text																																														
10898	10898	p.fay;;49	http://papyri.info/ddbdp/p.fay;;49	P.Fay.			49					gt_os	gt_os_receipt	gt_os_tax			Quittung,Steuern,Geld		Poll-Tax,Laographia				http://ipap.csad.ox.ac.uk/4DLink4/4DACTION/IPAPwebquery?vPub=P.Fay.&vVol=&vNum=49			fh	10.2	8.7	VR		1.1	3.4	0.6	0	1				1	2	#section1 #section2/											1-3/#m1/date	3-6/#m1/main-text																																														
10899	10899	p.fay;;50	http://papyri.info/ddbdp/p.fay;;50	P.Fay.			50					gt_os	gt_os_receipt	gt_os_tax			Quittung,Steuern,Geld		Poll-Tax,Laographia				http://ipap.csad.ox.ac.uk/4DLink4/4DACTION/IPAPwebquery?vPub=P.Fay.&vVol=&vNum=50			fh	6.4	9.3	HR		0.3	0.1	1.7	0	1				1	2	#section1 #section2/											1-3/#m1/date	3-6/#m1/main-text																																														
10900	10900	p.fay;;51	http://papyri.info/ddbdp/p.fay;;51	P.Fay.			51					gt_os	gt_os_receipt	gt_os_tax			Quittung,Steuern,Geld		Poll-Tax,Laographia				http://ipap.csad.ox.ac.uk/4DLink4/4DACTION/IPAPwebquery?vPub=P.Fay.&vVol=&vNum=51			fh	9.6	17.3	HR		1.8	3	2.7	10	1				1	2	#section1 #section2/											1-3/#m1/date	3-6/#m1/main-text																																														
10901	10901	p.fay;;52	http://papyri.info/ddbdp/p.fay;;52	P.Fay.			52					gt_os	gt_os_receipt	gt_os_tax			Quittung,Steuern,Geld		Poll-Tax,Laographia				http://ipap.csad.ox.ac.uk/4DLink4/4DACTION/IPAPwebquery?vPub=P.Fay.&vVol=&vNum=52			fh	8	10	HR		1.1	1.5	1.8	0	1				1	2	#section1 #section2/											1-3/#m1/date	3-6/#m1/main-text																																														
11253	11253	p.gen;2;105	https://papyri.info/ddbdp/p.gen;2;105	P.Gen.	2		105					gt_os	gt_os_receipt	gt_os_tax			Quittung,Steuer,Geld		Poll-Tax,Laographia				https://archives.bge-geneve.ch/ark:/17786/vta291e352b117a8ada	pl. XXIII		fh	10	13.5	HR		2	4	1.5	6	1				1	2	#section1 #section2/											1-3/#m1/date	3-5/#m1/main-text																																														
11427	11427	p.hamb;3;205	https://papyri.info/ddbdp/p.hamb;3;205	P.Hamb.	3		205					gt_os	gt_os_receipt	gt_os_tax			Quittung,Steuer,Geld		Poll-Tax,Laographia		https://iiif.sub.uni-hamburg.de/object/HANSh696/manifest		http://resolver.sub.uni-hamburg.de/goobi/HANSh696	Tafel VIII		fh	11	11	Sq		2	3.8	2.9	1	1				1	2	#section1 #section2/											1-3/#m1/date	3-6/#m1/main-text																																														
11719	11719	p.lond;2;340	https://papyri.info/ddbdp/p.lond;2;340	P.Lond.	2		340					gt_os	gt_os_receipt	gt_os_tax			Quittung,Steuern (Kopf)		Poll-Tax,Laographia				http://www.bl.uk/manuscripts/FullDisplay.aspx?ref=Papyrus_340	P.Lond. II, Plate 72		fh	7.2	10.6	HR		1.2	1	1.2	0	1				1	2	#section1 #section2/											1-4/#m1/main-text	4-6/#m1/date																																														
12326	12326	p.mich;15;695	https://papyri.info/ddbdp/p.mich;15;695	P.Mich.	15		695					gt_os	gt_os_receipt	gt_os_tax			Quittung,Steuer (Kopf)		Poll-Tax,Laographia		https://quod.lib.umich.edu/cgi/i/image/api/manifest/apis:2016:3611R.TIF		http://quod.lib.umich.edu/a/apis/x-2016	Plate VII Harrauer, Paläographie, Tafelband, Abb. 110	free	fh	10.2	9.3	VR		1.5	2.6	1.4	0	1				1	2	#section1 #section2/											1-2/#m1/date	2-5/#m1/main-text																																														
12328	12328	p.mich;15;697	https://papyri.info/ddbdp/p.mich;15;697	P.Mich.	15		697					gt_os	gt_os_receipt	gt_os_tax			Quittung,λαογραφία		Poll-Tax,Laographia		https://quod.lib.umich.edu/cgi/i/image/api/manifest/apis:1851:3165R.TIF		http://quod.lib.umich.edu/a/apis/x-1851	Plate VIII Harrauer, Paläographie, Tafelband, Abb. 125	free	fh	7.3	10	HR		1.5	0.8	1.2	0.3	1				1	2	#section1 #section2/											1-3/#m1/date	3-6/#m1/main-text																																														
12329	12329	p.mich;15;698	https://papyri.info/ddbdp/p.mich;15;698	P.Mich.	15		698					gt_os	gt_os_receipt	gt_os_tax			Quittung,λαογραφία		Poll-Tax,Laographia		https://quod.lib.umich.edu/cgi/i/image/api/manifest/apis:2165:4223R.TIF		http://quod.lib.umich.edu/a/apis/x-2165	Plate VIII Harrauer, Paläographie, Tafelband, Abb. 132	free	fh	8.5	9	Sq		0.5	1	1	0	1				1	2	#section1 #section2/											1-3/#m1/date	3-6/#m1/main-text																																														
12637	12637	p.petaus;;125	https://papyri.info/ddbdp/p.petaus;;125	P.Petaus			125					gt_os	gt_os_receipt	gt_os_tax			Quittung,Steuer (Kopf),Betrag		Poll-Tax,Laographia		https://quod.lib.umich.edu/cgi/i/image/api/manifest/apis:2981:6876R.TIF		http://quod.lib.umich.edu/a/apis/x-2981			fh	9.8	8.7	VR		1.3	1	1.5	0.5	1				1	2	#section1 #section2/											1-5/#m1/date	5-8/#m1/main-text																																														
12835	12835	p.princ;2;43	http://papyri.info/ddbdp/p.princ;2;43	P.Princ.	2		43		 			gt_os	gt_os_receipt	gt_os_tax			Quittungen,Kopfsteuer		Poll-Tax,Laographia		https://figgy.princeton.edu/concern/scanned_resources/239b4c71-8ef9-4bc7-88c7-52be5c6e8679/manifest		https://dpul.princeton.edu/papyri/catalog/nz806320q			fh	9.5	34	HR		1.5	2.8	2	1	3				1	6	#section1 #section2 #section3 #section4 #section5 #section6/											1-3/#m1/date	3-5/#m1/main-text	6-8/#m1/date	8-10/#m1/main-text	11-13/#m1/date	13-15/#m1/main-text																																										
12837	12837	p.princ;2;45	https://papyri.info/ddbdp/p.princ;2;45	P.Princ.	2		45					gt_os	gt_os_receipt	gt_os_tax			Quittung,Steuern,Geld		Poll-Tax,Laographia		https://figgy.princeton.edu/concern/scanned_resources/3383f2f3-20d2-42fb-b757-69d4a83b8390/manifest		https://dpul.princeton.edu/papyri/catalog/dj52w821m			fh	7	9	HR		0	0.2	1.5	0	1				1	2	#section1 #section2/											1-3/#m1/date	4-7/#m1/main-text																																														
12997	12997	cde;95;300_3	https://papyri.info/ddbdp/cde;95;300_3	CdE	95	2020				S. 300	Nr. 3	gt_os	gt_os_receipt	gt_os_tax			Quittung,Steuer (Kopfsteuer),Geld		Poll-Tax,Laographia		https://luna.manchester.ac.uk/luna/servlet/iiif/m/ManchesterDev~93~3~55212~211067/manifest		https://luna.manchester.ac.uk/luna/servlet/s/ogqo26	S. 306		fh	10.8	11	Sq		1.8	1.5	1.4	0	1				1	2	#section1 #section2/											1-4/#m1/date	4-7/#m1/main-text																																														
12998	12998	cde;95;302_4	https://papyri.info/ddbdp/cde;95;302_4	CdE	95	2020	 	 		S. 302	Nr. 4	gt_os	gt_os_receipt	gt_os_tax			Quittung (Steuer)		Poll-Tax,Laographia		https://luna.manchester.ac.uk/luna/servlet/iiif/m/ManchesterDev~93~3~55214~211065/manifest		https://luna.manchester.ac.uk/luna/servlet/detail/ManchesterDev~93~3~55214~211065	S. 302		fh	7.1	10.4	HR		0.3	2	0.8	0.2	1				1	2	#section1 #section2/											1-4/#m1/date	5-7/#m1/main-text																																														
13000	13000	cde;95;302_5	https://papyri.info/ddbdp/cde;95;302_5	CdE	95	2020				S. 302	Nr. 5	gt_os	gt_os_receipt	gt_os_tax			Quittung,Steuer,Geld		Poll-Tax,Laographia		https://luna.manchester.ac.uk/luna/servlet/iiif/m/ManchesterDev~93~3~55220~211061/manifest		https://luna.manchester.ac.uk/luna/servlet/detail/ManchesterDev~93~3~55220~211061:Receipt	S. 306		fh	9.6	10.2	Sq		0.8	1	2.3	0.2	1				1	2	#section1 #section2/											1-3/#m1/date	3-6/#m1/main-text																																														
13001	13001	cde;95;303_6	https://papyri.info/ddbdp/cde;95;303_6	CdE	95	2020				S. 303	Nr. 6	gt_os	gt_os_receipt	gt_os_tax			Quittung,Steuer,Geld		Poll-Tax,Laographia		https://luna.manchester.ac.uk/luna/servlet/iiif/m/ManchesterDev~93~3~55222~211059/manifest		https://luna.manchester.ac.uk/luna/servlet/detail/ManchesterDev~93~3~55222~211059:Receipt	S. 307		fh	21.6	7.8	VR		1.2	12.9	0.7	0	1				1	2	#section1 #section2/											1-6/#m1/date	6-10/#m1/main-text																																														
13594	13594	basp;50;40	https://papyri.info/ddbdp/basp;50;40	BASP	50	2013				S. 40		gt_ee	gt_ee_receipt				Quittungen,Steuern,Geld		Poll-Tax,Laographia		https://digicoll.lib.berkeley.edu/nanna/iiif/232253/manifest		https://digicoll.lib.berkeley.edu/record/232253			fv	13.1	11.4	VR		3	5.2	1.5	0.5	1				1	4	#section1 #section2 #section3 #section4											1-1/#m1/introduction	1-3/#m1/main-text	4-4/#m1/date	5-6/#m1/main-text																																												
13848	13848a 13848b 13848c	psi;10;1138	https://papyri.info/ddbdp/psi;10;1138	PSI	10		1138					gt_os	gt_os_receipt	gt_os_tax			Quittung,Kopfsteuer		Poll-Tax,Laographia				http://www.psi-online.it/documents/psi;10;1138	ZPE 44, 1981, Taf. XV a Pap.Flor. XXX, Tav. CX		fh	9	35.9	HR		1.3	1	4.8	0	3				4	8	#section1 #section2/	#section3 #section4 #section5/	#section6/	#section7 #section8/								1-2/#m1/date	3-6/#m1/main-text	7-8/#m2/date	8-11/#m2/main-text	11-11/#m2/addition	12-13/#m3/main-text	14-15/#m4/date	16-19/#m4/main-text																																								
14061	14061	sb;6;8981	https://papyri.info/ddbdp/sb;6;8981	SB	6		8981					gt_os	gt_os_receipt	gt_os_tax			Quittung,Steuern,Geld		Poll-Tax,Laographia				http://berlpap.smb.museum/02125/			fh	22.5	12.2	VR		1.8	8	0	0.6	1				1	2	#section1 #section2/											1-4/#m1/date	5-10/#m1/main-text																																														
14284	14284	sb;8;9768	https://papyri.info/ddbdp/sb;8;9768	SB	8		9768					gt_os	gt_os_receipt	gt_os_tax			Quittung,Steuern,Geld		Poll-Tax,Laographia				http://ipap.csad.ox.ac.uk/4DLink4/4DACTION/IPAPwebquery?vPub=SB&vVol=8&vNum=9768	ZPE 3, 1968, Tafel IV b nach S. 256 Youtie, Scriptiunculae II, Plate IV, 2		fh	10.9	12	Sq		1	3.4	2.6	0	1				2	2	#section1 #section2/	#section2										1-2/#m1/date	2-7/#m1 #m2/main-text																																														
14371	14371	sb;12;10952	https://papyri.info/ddbdp/sb;12;10952	SB	12		10952					gt_os	gt_os_receipt	gt_os_tax			Quittung,Steuern,Geld		Poll-Tax,Laographia		https://digicoll.lib.berkeley.edu/nanna/iiif/232294/manifest?manifest=/nanna/iiif/232294/manifest		https://digicoll.lib.berkeley.edu/record/232294			fv	7.3	6.5	Sq		0.7	4.5	0.7	0	1				1	1	#section1/											1-4/#m1/main-text																																															
14374	14374	sb;12;10954	https://papyri.info/ddbdp/sb;12;10954	SB	12		10954					gt_os	gt_os_receipt	gt_os_tax			Quittung,Steuern,Geld		Poll-Tax,Laographia		https://digicoll.lib.berkeley.edu/nanna/iiif/232282/manifest?manifest=/nanna/iiif/232282/manifest		https://digicoll.lib.berkeley.edu/record/232282			fh	10	10	Sq		1	2.6	0.6	0	1				1	2	#section1 #section2/											1-3/#m1/date	3-7/#m1/main-text																																														
14546	14546	sb;14;12112	https://papyri.info/ddbdp/sb;14;12112	SB	14		12112					gt_os	gt_os_receipt	gt_os_tax			Quittung,Steuer,Geld		Poll-Tax,Laographia		https://quod.lib.umich.edu/cgi/i/image/api/manifest/apis:1532:181R.TIF		http://quod.lib.umich.edu/a/apis/x-1532			fh	20.8	12	VR		0.5	8.8	1.3	0	1				1	4	#section1 #section2 #section3 #section4											1-3/#m1/date	3-8/#m1/main-text	9-9/#m1/date	9-13/#m1/main-text																																												
14573	14573	sb;16;12296	http://papyri.info/ddbdp/sb;16;12296	SB	16		12296					gt_os	gt_os_receipt	gt_os_tax			Quittung,Zahlung,Kopfsteuer,Steuer,Laographia,Namen		Poll-Tax,Laographia				http://berlpap.smb.museum/02076/	APF 28, 1982, Abb. 4		fh	9.8	13.8	HR		3	0.3	2.3	2	1				1	2	#section1 #section2/											1-2/#m1/date	2-7/#m1/main-text																																														
14574	14574	sb;16;12297	http://papyri.info/ddbdp/sb;16;12297	SB	16		12297					gt_os	gt_os_receipt	gt_os_tax			Quittung,Abrechnung,Zahlung,Steuer,Kopfsteuer,Laographia,Namen,Zuschlagsgebühr		Poll-Tax,Laographia				http://berlpap.smb.museum/02072/			fh	9.7	10.2	Sq		0	1	1.4	0	1				1	2	#section1 #section2/											1-2/#m1/date	2-5/#m1/main-text																																														
14638	14638	sb;16;12645	https://papyri.info/ddbdp/sb;16;12645	SB	16		12645					gt_os	gt_os_receipt	gt_os_tax			Quittung,Steuer,Kopfsteuer,Zahlung,Namen,Beamter		Poll-Tax,Laographia		https://quod.lib.umich.edu/cgi/i/image/api/manifest/apis:1907:3244R.TIF		http://quod.lib.umich.edu/a/apis/x-1907	ZPE 38, 1980, Tafel XII b		fh	16.5	10	VR		1	3	0.5	0	1				1	2	#section1 #section2/											1-3/#m1/date	3-7/#m1/main-text																																														
14667	14667	sb;16;12793	https://papyri.info/ddbdp/sb;16;12793	SB	16		12793					gt_os	gt_os_receipt	gt_os_tax			Quittung,Zahlung,Steuer,Kopfsteuer,Namen		Poll-Tax,Laographia				http://berlpap.smb.museum/02188/	APF 30, 1984, Abb. 5		fh	10.5	11.9	Sq		2	1.1	2.3	0.5	1				1	2	#section1 #section2/											1-2/#m1/date	2-7/#m1/main-text																																														
14764	14764	sb;18;13868	https://papyri.info/ddbdp/sb;18;13868	SB	18		13868					gt_os	gt_os_receipt	gt_os_tax			Quittung (Abgaben)		Poll-Tax,Laographia				https://www.bl.uk/manuscripts/FullDisplay.aspx?ref=Papyrus_1099	ZPE 58, 1985, Tafel IV a		fh	12.4	7.4	VR		1.8	4.5	1.7	0	1				1	2	#section1 #section2/											1-3/#m1/date	3-7/#m1/main-text																																														
14779	14779	sb;18;13911	https://papyri.info/ddbdp/sb;18;13911	SB	18		13911					gt_os	gt_os_receipt	gt_os_tax			Quittung (Abgaben)		Poll-Tax,Laographia		https://quod.lib.umich.edu/cgi/i/image/api/manifest/apis:1912:3255R.TIF		http://quod.lib.umich.edu/a/apis/x-1912	ZPE 61, 1985, Tafel II a		fh	9.6	10.1	Sq		1	2	1	0	1				1	2	#section1 #section2/											1-3/#m1/date	3-6/#m1/main-text																																														
14817	14817	sb;20;14138	https://papyri.info/ddbdp/sb;20;14138	SB	20		14138					gt_os	gt_os_receipt	gt_os_tax			Quittung,Steuern,Geld		Poll-Tax,Laographia		https://digicoll.lib.berkeley.edu/nanna/iiif/231416/manifest?manifest=/nanna/iiif/231416/manifest		https://digicoll.lib.berkeley.edu/record/231416	Aegyptus 71, 1991, Plate 3 (S. 36)		fh	8.8	9	Sq		1.5	2.1	1	0.5	1				1	2	#section1 #section2/											1-3/#m1/date	3-6/#m1/main-text																																														
14826	14826	sb;20;14146	https://papyri.info/ddbdp/sb;20;14146	SB	20		14146					gt_os	gt_os_receipt	gt_os_tax			Quittung,Steuern,Geld		Poll-Tax,Laographia				http://ipap.csad.ox.ac.uk/4DLink4/4DACTION/IPAPwebquery?vPub=P.Fay.&vVol=&vNum=281			fh	9.3	10.8	HR		1.5	0	2.3	0.8	1				1	2	#section1 #section2/											1-4/#m1/date	4-7/#m1/main-text																																														
14831	14831	sb;20;14151	https://papyri.info/ddbdp/sb;20;14151	SB	20		14151					gt_os	gt_os_receipt	gt_os_tax			Quittung,Steuern,Geld		Poll-Tax,Laographia		https://digicoll.lib.berkeley.edu/nanna/iiif/231411/manifest?manifest=/nanna/iiif/231411/manifest		https://digicoll.lib.berkeley.edu/record/231411	Aegyptus 71, 1991, Plate 8 (S. 41)		fh	6.4	9.4	HR		0.8	0.4	1	0.2	1				1	2	#section1 #section2/											1-3/#m1/date	3-6/#m1/main-text																																														
15050	15050	stud.pal;22;123	https://papyri.info/ddbdp/stud.pal;22;123	SPP	22		123					gt_os	gt_os_receipt	gt_os_tax			Quittung,Kopfsteuer		Poll-Tax,Laographia				http://data.onb.ac.at/rec/RZ00007975	Harrauer, Paläographie, Tafelband, Abb. 127		fh	9.7	8	VR		1.7	3.1	1.1	0.5	1				1	2	#section1 #section2/											1-3/#m1/date	3-7/#m1/main-text																																														
15051	15051	stud.pal;22;124	https://papyri.info/ddbdp/stud.pal;22;124	SPP	22		124					gt_os	gt_os_receipt	gt_os_tax			Quittung,Kopfsteuer		Poll-Tax,Laographia				http://data.onb.ac.at/rec/RZ00007976			fh	8.5	11.7	HR		0.5	0	2	0	1				1	2	#section1 #section2/											1-2/#m1/date	2-5/#m1/main-text																																														
15936	15936	p.oxy;44;3172	https://papyri.info/ddbdp/p.oxy;44;3172	P.Oxy.	44		3172					gt_os	gt_os_receipt	gt_os_tax			Quittung,Steuer (Kopf-)		Poll-Tax,Laographia				http://163.1.169.40/cgi-bin/library?a=q&r=1&hs=1&e=p-000-00---0POxy--00-0-0--0prompt-10---4------0-1l--1-en-50---20-about---00031-001-1-0utfZz-8-00&h=ded&t=1&q=3172	Plate VII		fh	5.5	9.5	HR		1.3	1.7	1.5	0	1				1	2	#section1 #section2/											1-2/#m1/date	2-5/#m1/main-text																																														
17630	17630	p.col;8;220	https://papyri.info/ddbdp/p.col;8;220	P.Col.	8		220					gt_os	gt_os_receipt	gt_os_tax			Quittung,Kopfsteuer		Poll-Tax,Laographia		https://sites.dlib.nyu.edu/viewer/api/presentation/books/isaw_asp000028/manifest.json	https://sites.dlib.nyu.edu/viewer/api/presentation/books/isaw_asp000028/canvas/274	https://papyri.info/ddbdp/p.col;8;220/images	Plate 30 Harrauer, Paläographie, Tafelband, Abb. 107		fh	10.1	7.9	VR		2	3	0.5	0	1				1	2	#section1 #section2/											1-3/#m1/date	3-7/#m1/main-text																																														
19955	19955	p.lond;2;170	https://papyri.info/ddbdp/p.lond;2;170	P.Lond.	2		170					gt_os	gt_os_receipt	gt_os_tax			Quittungen; Steuern; Geld		Poll-Tax,Laographia				https://www.bl.uk/manuscripts/FullDisplay.aspx?ref=Papyrus_170	P.Lond. II, Plate 71		fh	12	11.7	Sq		1.4	0.8	1.6	0.7	1				1	4	#section1 #section2 #section3 #section4											1-3/#m1/date	3-6/#m1/main-text	7-7/#m1/date	8-10/#m1/main-text																																												
19988	19988	p.lond;2;347	https://papyri.info/ddbdp/p.lond;2;347	P.Lond.	2		347					gt_os	gt_os_receipt	gt_os_tax			Quittung,Steuern,Priester		Poll-Tax,Laographia				https://www.bl.uk/manuscripts/FullDisplay.aspx?ref=Papyrus_347	P.Lond. II, Plate 78 Pal. Soc. Mss., 2nd Ser., Vol. I, II. 185		fh	12.5	27.2	HR		1.7	2.2	4.2	0	2				1	2	#section1 #section2/											1-4/#m1/date	4-16/#m1/main-text																																														
22710	22710	p.lond;3;912a	https://papyri.info/ddbdp/p.lond;3;912a	P.Lond.	3		912		(a)			gt_os	gt_os_receipt	gt_os_tax			Quittung,Steuern,Geld		Poll-Tax,Laographia				https://www.bl.uk/manuscripts/FullDisplay.aspx?ref=Papyrus_912	P.Lond. III, Plate 38		fh	8.2	11.7	HR		1.2	2	1.6	2.6	1				1	2	#section1 #section2/											1-3/#m1/date	3-6/#m1/main-text																																														
22711	22711	p.lond;3;912B	https://papyri.info/ddbdp/p.lond;3;912B	P.Lond.	3		912		(b)			gt_os	gt_os_receipt	gt_os_tax			Quittung,Steuern,Geld		Poll-Tax,Laographia				https://www.bl.uk/manuscripts/FullDisplay.aspx?ref=Papyrus_912	P.Lond. III, Plate 38		fh	10	9.8	Sq		2	2.8	2.4	0	1				1	2	#section1 #section2/											1-3/#m1/date	3-6/#m1/main-text																																														
22842	22842	p.lond;3;1216	https://papyri.info/ddbdp/p.lond;3;1216	P.Lond.	3		1216					gt_os	gt_os_receipt	gt_os_tax			Quittung,Steuer (Kopf),Geld		Poll-Tax,Laographia				https://www.bl.uk/manuscripts/FullDisplay.aspx?ref=Papyrus_1216			fh	7.8	18.7	HR		1.1	2.1	2.1	0.5	1				1	2	#section1 #section2/											1-2/#m1/date	2-4/#m1/main-text																																														
22852	22852	p.lond;3;1234	https://papyri.info/ddbdp/p.lond;3;1234	P.Lond.	3		1234					gt_os	gt_os_receipt	gt_os_tax			Quittung,Steuern,Geld		Poll-Tax,Laographia				https://www.bl.uk/manuscripts/FullDisplay.aspx?ref=Papyrus_1234			fh	11.2	11.4	Sq		1.3	3.6	1.5	0	1				1	2	#section1 #section2/											1-2/#m1/date	2-6/#m1/main-text																																														
316215	316215a 316215b	bgu;20;2853coli	http://papyri.info/ddbdp/bgu;20;2853coli	BGU	20		2853					gt_os	gt_os_receipt	gt_os_tax			Quittung,Steuer,Kopfsteuer (laographia),Geld		Poll-Tax,Laographia				http://berlpap.smb.museum/05895/	Tafel XVII		fh	10.4	20.4	HR		1.5	2.8	3.3	0	1				1	4	#section1 #section2 #section3 #section4											1-2/#m1/date	2-5/#m1/main-text	6-7/#m1/date	7-10/#m1/main-text																																												
316216	316216	bgu;20;2854	http://papyri.info/ddbdp/bgu;20;2854	BGU	20		2854					gt_os	gt_os_receipt	gt_os_tax			Quittung,Steuer,Kopfsteuer (laographia),Geld		Poll-Tax,Laographia				http://berlpap.smb.museum/06690/	Tafel XVIII a)		fm	7	9.5	HR		0.2	0.3	2	0	1				1	2	#section1 #section2/											1-3/#m1/date	3-6/#m1/main-text																																														
316217	316217	bgu;20;2855	http://papyri.info/ddbdp/bgu;20;2855	BGU	20		2855					gt_os	gt_os_receipt	gt_os_tax			Quittung,Steuer,Kopfsteuer (laographia),Geld		Poll-Tax,Laographia				http://berlpap.smb.museum/06109/	Tafel XVIII b)		fh	7.5	10.4	HR		0	0.5	0	0	1				1	2	#section1 #section2/											1-3/#m1/date	3-6/#m1/main-text																																														