<svg width="515" height="78" viewBox="0 0 515 78" fill="none" xmlns="http://www.w3.org/2000/svg">
<rect width="515" height="78" rx="39" fill="#AACE05"/>
<path d="M50.7441 21.44C53.8481 21.44 56.5041 20.832 58.7121 19.616L59.2401 20.48C57.1601 21.696 54.8721 22.352 52.3761 22.448C50.3601 24.368 48.6481 27.568 47.2401 32.048C45.8641 36.528 45.1761 41.296 45.1761 46.352C45.1761 49.456 45.7361 51.648 46.8561 52.928C48.0081 54.208 49.3521 54.848 50.8881 54.848C51.9121 54.848 52.9041 54.608 53.8641 54.128C54.8241 53.68 55.5601 53.232 56.0721 52.784C56.6161 52.336 57.3201 51.68 58.1841 50.816C57.6721 49.28 57.4161 46.896 57.4161 43.664C57.4161 40.4 57.9761 36.896 59.0961 33.152C60.2161 29.376 61.7041 26.288 63.5601 23.888C65.4161 21.488 67.3361 20.288 69.3201 20.288C70.2801 20.288 71.0001 20.544 71.4801 21.056C71.9921 21.568 72.2481 22.496 72.2481 23.84C72.2481 26.56 71.3681 30.176 69.6081 34.688C67.8801 39.2 65.6401 43.312 62.8881 47.024C63.1761 49.488 63.9601 51.312 65.2401 52.496C66.5201 53.68 68.1521 54.272 70.1361 54.272C73.7841 54.272 77.0641 50.784 79.9761 43.808C82.2161 38.432 83.3361 32.928 83.3361 27.296C83.3361 21.664 82.2481 17.76 80.0721 15.584L80.7921 14.864C83.1921 17.264 84.3921 21.456 84.3921 27.44C84.3921 33.008 83.2561 38.608 80.9841 44.24C77.4001 52.88 72.5201 57.2 66.3441 57.2C63.1761 57.2 60.8561 55.936 59.3841 53.408C59.0001 52.768 58.7281 52.288 58.5681 51.968C55.1761 55.456 51.4321 57.2 47.3361 57.2C44.6801 57.2 42.6961 56.304 41.3841 54.512C40.1041 52.752 39.4641 50.608 39.4641 48.08C39.4641 45.552 39.7841 43.04 40.4241 40.544C41.0961 38.016 41.8641 35.856 42.7281 34.064C43.5921 32.272 44.6321 30.512 45.8481 28.784C47.5121 26.32 49.2241 24.208 50.9841 22.448C49.9281 22.448 48.5521 22.336 46.8561 22.112C43.3041 21.92 41.4001 21.824 41.1441 21.824C36.6641 21.824 33.1441 22.96 30.5841 25.232C28.0241 27.472 26.7441 30.576 26.7441 34.544C26.7441 36.4 27.1761 38.144 28.0401 39.776C28.4881 40.64 29.4641 41.632 30.9681 42.752C31.2881 43.008 31.8001 43.28 32.5041 43.568C33.2081 43.856 33.5761 44 33.6081 44L34.4241 44.24L34.2801 45.248C33.6721 45.248 32.7921 44.928 31.6401 44.288C30.4881 43.648 29.4961 42.976 28.6641 42.272C27.8641 41.536 27.1601 40.496 26.5521 39.152C25.9761 37.776 25.6881 36.24 25.6881 34.544C25.6881 30.32 27.0801 26.976 29.8641 24.512C32.6481 22.016 36.4081 20.768 41.1441 20.768C43.0641 20.768 44.8241 20.88 46.4241 21.104C48.0241 21.328 49.4641 21.44 50.7441 21.44ZM62.7441 44.624V45.344C63.0641 44.896 63.4801 44.256 63.9921 43.424C66.0721 40.192 67.7841 36.72 69.1281 33.008C70.4721 29.296 71.1441 26.24 71.1441 23.84C71.1441 22.176 70.5361 21.344 69.3201 21.344C68.8401 21.344 68.3121 21.472 67.7361 21.728C66.6801 22.72 65.6561 24.688 64.6641 27.632C63.3841 31.408 62.7441 37.072 62.7441 44.624ZM105.37 49.472C106.138 49.472 106.938 49.024 107.77 48.128L108.49 48.704C108.266 49.152 107.77 49.552 107.002 49.904C106.234 50.256 105.386 50.432 104.458 50.432C101.546 50.432 100.09 49.12 100.09 46.496C100.09 45.376 100.378 43.376 100.954 40.496C101.53 37.616 101.818 35.728 101.818 34.832C101.818 33.456 101.162 32.768 99.8496 32.768C98.7616 32.768 97.7056 33.504 96.6816 34.976C95.6896 36.448 94.8736 38.448 94.2336 40.976L92.6496 50H86.8896L92.2176 19.856C91.2576 19.952 90.4576 20.4 89.8176 21.2L89.0976 20.624C90.0576 19.472 91.2576 18.896 92.6976 18.896C94.1696 18.896 95.3056 19.264 96.1056 20C96.9056 20.736 97.3056 21.776 97.3056 23.12C97.3056 23.376 97.2736 23.792 97.2096 24.368L95.1936 35.744C96.5056 32.8 98.5376 31.328 101.29 31.328C103.178 31.328 104.65 31.872 105.706 32.96C106.762 34.016 107.29 35.488 107.29 37.376C107.29 38.368 106.986 40.288 106.378 43.136C105.77 45.952 105.434 48.064 105.37 49.472ZM127.704 50.432C124.888 50.432 123.352 49.2 123.096 46.736C121.688 49.2 119.912 50.432 117.768 50.432C115.624 50.432 113.912 49.792 112.632 48.512C111.384 47.2 110.76 45.376 110.76 43.04C110.76 39.392 111.656 36.528 113.448 34.448C115.24 32.368 117.56 31.328 120.408 31.328C122.744 31.328 124.296 32.432 125.064 34.64C125.224 33.68 125.4 32.72 125.592 31.76C127.96 31.76 129.72 31.664 130.872 31.472L131.496 31.328L128.184 49.472C129.144 49.376 129.944 48.928 130.584 48.128L131.304 48.704C130.344 49.856 129.144 50.432 127.704 50.432ZM116.184 45.488C116.184 46.928 116.36 47.936 116.712 48.512C117.096 49.056 117.672 49.328 118.44 49.328C119.208 49.328 119.992 48.912 120.792 48.08C121.848 46.992 122.696 45.616 123.336 43.952C123.432 43.536 123.608 42.544 123.864 40.976C124.152 39.376 124.392 38.064 124.584 37.04C124.488 35.824 124.152 34.768 123.576 33.872C123 32.976 122.28 32.528 121.416 32.528C119.848 32.528 118.584 33.936 117.624 36.752C116.664 39.536 116.184 42.448 116.184 45.488ZM136.986 31.76L138.282 24.656C140.65 24.656 142.41 24.56 143.562 24.368L144.186 24.224C143.738 26.464 143.242 28.976 142.698 31.76H148.65L148.554 32.624H142.554C140.954 40.88 140.154 45.856 140.154 47.552C140.154 48.576 140.698 49.088 141.786 49.088C142.874 49.088 143.866 48.4 144.762 47.024C145.658 45.648 146.298 44.16 146.682 42.56L147.546 42.848C146.362 47.904 143.914 50.432 140.202 50.432C138.666 50.432 137.386 50.016 136.362 49.184C135.338 48.32 134.826 47.136 134.826 45.632C134.826 44.096 135.482 39.76 136.794 32.624H134.442L134.538 31.76H136.986ZM176.642 50.432C173.826 50.432 172.29 49.2 172.034 46.736C170.626 49.2 168.85 50.432 166.706 50.432C164.562 50.432 162.85 49.792 161.57 48.512C160.322 47.2 159.698 45.376 159.698 43.04C159.698 39.392 160.594 36.528 162.386 34.448C164.178 32.368 166.498 31.328 169.346 31.328C171.682 31.328 173.234 32.432 174.002 34.64C174.162 33.68 174.338 32.72 174.53 31.76C176.898 31.76 178.658 31.664 179.81 31.472L180.434 31.328L177.122 49.472C178.082 49.376 178.882 48.928 179.522 48.128L180.242 48.704C179.282 49.856 178.082 50.432 176.642 50.432ZM165.122 45.488C165.122 46.928 165.298 47.936 165.65 48.512C166.034 49.056 166.61 49.328 167.378 49.328C168.146 49.328 168.93 48.912 169.73 48.08C170.786 46.992 171.634 45.616 172.274 43.952C172.37 43.536 172.546 42.544 172.802 40.976C173.09 39.376 173.33 38.064 173.522 37.04C173.426 35.824 173.09 34.768 172.514 33.872C171.938 32.976 171.218 32.528 170.354 32.528C168.786 32.528 167.522 33.936 166.562 36.752C165.602 39.536 165.122 42.448 165.122 45.488ZM191.684 50.432C189.668 50.432 188.196 49.76 187.268 48.416L183.236 51.296H182.324L187.7 19.856C186.74 19.952 185.94 20.4 185.3 21.2L184.58 20.624C185.54 19.472 186.74 18.896 188.18 18.896C189.652 18.896 190.788 19.264 191.588 20C192.388 20.736 192.788 21.776 192.788 23.12C192.788 23.376 192.756 23.792 192.692 24.368C192.18 27.216 191.556 30.64 190.82 34.64C192.164 32.464 193.908 31.376 196.052 31.376C198.196 31.376 199.844 32 200.996 33.248C202.148 34.464 202.724 36.144 202.724 38.288C202.724 42.064 201.7 45.04 199.652 47.216C197.604 49.36 194.948 50.432 191.684 50.432ZM191.348 49.136C193.108 49.136 194.532 47.92 195.62 45.488C196.74 43.024 197.3 39.968 197.3 36.32C197.3 34.848 197.14 33.84 196.82 33.296C196.532 32.752 195.988 32.48 195.188 32.48C194.388 32.48 193.556 32.96 192.692 33.92C191.86 34.88 191.252 35.792 190.868 36.656C190.484 37.488 190.292 37.968 190.292 38.096H190.196C189.396 42.288 188.804 45.456 188.42 47.6C188.964 48.624 189.94 49.136 191.348 49.136ZM212.609 50.432C210.145 50.432 208.273 49.824 206.993 48.608C205.713 47.36 205.073 45.808 205.073 43.952C205.073 42.064 205.233 40.464 205.553 39.152C205.905 37.808 206.465 36.528 207.233 35.312C208.001 34.064 209.153 33.088 210.689 32.384C212.257 31.68 214.193 31.328 216.497 31.328C218.833 31.328 220.641 31.952 221.921 33.2C223.233 34.416 223.889 36.096 223.889 38.24C223.889 41.888 222.913 44.832 220.961 47.072C219.041 49.312 216.257 50.432 212.609 50.432ZM210.497 45.488C210.497 48.048 211.233 49.328 212.705 49.328C214.209 49.328 215.537 48.048 216.689 45.488C217.873 42.896 218.465 39.824 218.465 36.272C218.465 33.584 217.729 32.24 216.257 32.24C214.817 32.24 213.489 33.472 212.273 35.936C211.089 38.368 210.497 41.552 210.497 45.488ZM229.236 32.288C228.468 32.288 227.668 32.736 226.836 33.632L226.116 33.056C226.34 32.608 226.836 32.208 227.604 31.856C228.372 31.504 229.22 31.328 230.148 31.328C233.06 31.328 234.516 32.64 234.516 35.264C234.516 36.384 234.228 38.384 233.652 41.264C233.076 44.144 232.788 46.032 232.788 46.928C232.788 48.304 233.444 48.992 234.756 48.992C235.684 48.992 236.58 48.448 237.444 47.36C238.34 46.272 239.108 44.768 239.748 42.848L241.764 31.76C244.132 31.76 245.86 31.664 246.948 31.472L247.572 31.328L244.356 49.472C245.316 49.376 246.116 48.928 246.756 48.128L247.476 48.704C246.516 49.856 245.316 50.432 243.876 50.432C242.436 50.432 241.316 50.08 240.516 49.376C239.716 48.672 239.3 47.68 239.268 46.4C237.924 49.088 235.94 50.432 233.316 50.432C231.428 50.432 229.956 49.904 228.9 48.848C227.844 47.76 227.316 46.272 227.316 44.384C227.316 43.392 227.62 41.488 228.228 38.672C228.836 35.824 229.172 33.696 229.236 32.288ZM253.189 31.76L254.485 24.656C256.853 24.656 258.613 24.56 259.765 24.368L260.389 24.224C259.941 26.464 259.445 28.976 258.901 31.76H264.853L264.757 32.624H258.757C257.157 40.88 256.357 45.856 256.357 47.552C256.357 48.576 256.901 49.088 257.989 49.088C259.077 49.088 260.069 48.4 260.965 47.024C261.861 45.648 262.501 44.16 262.885 42.56L263.749 42.848C262.565 47.904 260.117 50.432 256.405 50.432C254.869 50.432 253.589 50.016 252.565 49.184C251.541 48.32 251.029 47.136 251.029 45.632C251.029 44.096 251.685 39.76 252.997 32.624H250.645L250.741 31.76H253.189ZM278.877 32.288C278.109 32.288 277.309 32.736 276.477 33.632L275.757 33.056C275.981 32.608 276.477 32.208 277.245 31.856C278.013 31.504 278.861 31.328 279.789 31.328C282.701 31.328 284.157 32.64 284.157 35.264C284.157 36.384 283.853 38.224 283.245 40.784C282.637 43.312 282.333 45.024 282.333 45.92C282.333 47.456 282.973 48.224 284.253 48.224C285.309 48.224 286.333 47.504 287.325 46.064C288.349 44.624 289.181 42.688 289.821 40.256L291.405 31.76C293.773 31.76 295.501 31.664 296.589 31.472L297.213 31.328L294.189 48.32C293.613 51.616 292.269 54.192 290.157 56.048C288.077 57.904 285.373 58.832 282.045 58.832C280.029 58.832 278.461 58.48 277.341 57.776C276.253 57.104 275.709 56.208 275.709 55.088C275.709 54 276.045 53.12 276.717 52.448C277.389 51.808 278.333 51.488 279.549 51.488C280.797 51.488 281.949 51.68 283.005 52.064C284.061 52.48 284.829 52.72 285.309 52.784L285.213 53.648C284.669 53.584 283.885 53.36 282.861 52.976C281.837 52.592 280.813 52.4 279.789 52.4C278.797 52.4 278.029 52.624 277.485 53.072C276.973 53.52 276.717 54.16 276.717 54.992C276.717 55.856 277.181 56.544 278.109 57.056C279.037 57.6 280.189 57.872 281.565 57.872C284.893 57.872 286.941 55.872 287.709 51.872L288.909 45.248C287.565 48.192 285.533 49.664 282.813 49.664C280.957 49.664 279.517 49.136 278.493 48.08C277.501 47.024 277.005 45.536 277.005 43.616C277.005 42.624 277.293 40.848 277.869 38.288C278.477 35.696 278.813 33.696 278.877 32.288ZM306.64 50.432C304.176 50.432 302.304 49.824 301.024 48.608C299.744 47.36 299.104 45.808 299.104 43.952C299.104 42.064 299.264 40.464 299.584 39.152C299.936 37.808 300.496 36.528 301.264 35.312C302.032 34.064 303.184 33.088 304.72 32.384C306.288 31.68 308.224 31.328 310.528 31.328C312.864 31.328 314.672 31.952 315.952 33.2C317.264 34.416 317.92 36.096 317.92 38.24C317.92 41.888 316.944 44.832 314.992 47.072C313.072 49.312 310.288 50.432 306.64 50.432ZM304.528 45.488C304.528 48.048 305.264 49.328 306.736 49.328C308.24 49.328 309.568 48.048 310.72 45.488C311.904 42.896 312.496 39.824 312.496 36.272C312.496 33.584 311.76 32.24 310.288 32.24C308.848 32.24 307.52 33.472 306.304 35.936C305.12 38.368 304.528 41.552 304.528 45.488ZM323.267 32.288C322.499 32.288 321.699 32.736 320.867 33.632L320.147 33.056C320.371 32.608 320.867 32.208 321.635 31.856C322.403 31.504 323.251 31.328 324.179 31.328C327.091 31.328 328.547 32.64 328.547 35.264C328.547 36.384 328.259 38.384 327.683 41.264C327.107 44.144 326.819 46.032 326.819 46.928C326.819 48.304 327.475 48.992 328.787 48.992C329.715 48.992 330.611 48.448 331.475 47.36C332.371 46.272 333.139 44.768 333.779 42.848L335.795 31.76C338.163 31.76 339.891 31.664 340.979 31.472L341.603 31.328L338.387 49.472C339.347 49.376 340.147 48.928 340.787 48.128L341.507 48.704C340.547 49.856 339.347 50.432 337.907 50.432C336.467 50.432 335.347 50.08 334.547 49.376C333.747 48.672 333.331 47.68 333.299 46.4C331.955 49.088 329.971 50.432 327.347 50.432C325.459 50.432 323.987 49.904 322.931 48.848C321.875 47.76 321.347 46.272 321.347 44.384C321.347 43.392 321.651 41.488 322.259 38.672C322.867 35.824 323.203 33.696 323.267 32.288ZM344.533 33.056C345.493 31.904 346.693 31.328 348.133 31.328C349.605 31.328 350.741 31.696 351.541 32.432C352.341 33.168 352.741 34.208 352.741 35.552V35.84C354.181 32.832 356.053 31.328 358.357 31.328C360.821 31.328 362.053 32.608 362.053 35.168C362.053 36.224 361.701 37.344 360.997 38.528C360.293 39.712 359.589 40.848 358.885 41.936C358.181 42.992 357.829 43.936 357.829 44.768H356.677C356.677 43.584 357.365 41.984 358.741 39.968C360.117 37.952 360.805 36.4 360.805 35.312C360.805 34.192 360.581 33.44 360.133 33.056C359.717 32.64 359.077 32.432 358.213 32.432C357.381 32.432 356.549 32.8 355.717 33.536C354.917 34.272 354.245 35.2 353.701 36.32C352.837 37.984 352.261 39.344 351.973 40.4V40.448L350.245 50H344.485L347.653 32.288C346.693 32.384 345.893 32.832 345.253 33.632L344.533 33.056ZM389.916 50.432C387.1 50.432 385.564 49.232 385.308 46.832C383.9 49.232 382.108 50.432 379.932 50.432C377.756 50.432 376.092 49.824 374.94 48.608C373.788 47.36 373.212 45.664 373.212 43.52C373.212 39.744 374.108 36.768 375.9 34.592C377.692 32.416 380.012 31.328 382.86 31.328C384.492 31.328 385.756 31.824 386.652 32.816C387.036 33.328 387.276 33.712 387.372 33.968L389.964 19.856C389.004 19.952 388.204 20.4 387.564 21.2L386.844 20.624C387.804 19.472 389.004 18.896 390.444 18.896C391.916 18.896 393.052 19.264 393.852 20C394.652 20.736 395.052 21.776 395.052 23.12C395.052 23.376 395.02 23.792 394.956 24.368C393.388 33.168 391.868 41.536 390.396 49.472C391.356 49.376 392.156 48.928 392.796 48.128L393.516 48.704C392.556 49.856 391.356 50.432 389.916 50.432ZM378.636 45.488C378.636 46.96 378.78 47.968 379.068 48.512C379.388 49.056 379.868 49.328 380.508 49.328C381.18 49.328 381.82 49.104 382.428 48.656C383.036 48.208 383.548 47.632 383.964 46.928C384.732 45.744 385.276 44.736 385.596 43.904L386.988 36.32C386.924 35.296 386.588 34.368 385.98 33.536C385.372 32.672 384.332 32.24 382.86 32.24C381.836 32.24 380.876 33.744 379.98 36.752C379.084 39.76 378.636 42.672 378.636 45.488ZM413.126 50.432C410.31 50.432 408.774 49.2 408.518 46.736C407.11 49.2 405.334 50.432 403.19 50.432C401.046 50.432 399.334 49.792 398.054 48.512C396.806 47.2 396.182 45.376 396.182 43.04C396.182 39.392 397.078 36.528 398.87 34.448C400.662 32.368 402.982 31.328 405.83 31.328C408.166 31.328 409.718 32.432 410.486 34.64C410.646 33.68 410.822 32.72 411.014 31.76C413.382 31.76 415.142 31.664 416.294 31.472L416.918 31.328L413.606 49.472C414.566 49.376 415.366 48.928 416.006 48.128L416.726 48.704C415.766 49.856 414.566 50.432 413.126 50.432ZM401.606 45.488C401.606 46.928 401.782 47.936 402.134 48.512C402.518 49.056 403.094 49.328 403.862 49.328C404.63 49.328 405.414 48.912 406.214 48.08C407.27 46.992 408.118 45.616 408.758 43.952C408.854 43.536 409.03 42.544 409.286 40.976C409.574 39.376 409.814 38.064 410.006 37.04C409.91 35.824 409.574 34.768 408.998 33.872C408.422 32.976 407.702 32.528 406.838 32.528C405.27 32.528 404.006 33.936 403.046 36.752C402.086 39.536 401.606 42.448 401.606 45.488ZM422.408 31.76L423.704 24.656C426.072 24.656 427.832 24.56 428.984 24.368L429.608 24.224C429.16 26.464 428.664 28.976 428.12 31.76H434.072L433.976 32.624H427.976C426.376 40.88 425.576 45.856 425.576 47.552C425.576 48.576 426.12 49.088 427.208 49.088C428.296 49.088 429.288 48.4 430.184 47.024C431.08 45.648 431.72 44.16 432.104 42.56L432.968 42.848C431.784 47.904 429.336 50.432 425.624 50.432C424.088 50.432 422.808 50.016 421.784 49.184C420.76 48.32 420.248 47.136 420.248 45.632C420.248 44.096 420.904 39.76 422.216 32.624H419.864L419.96 31.76H422.408ZM451.845 50.432C449.029 50.432 447.493 49.2 447.237 46.736C445.829 49.2 444.053 50.432 441.909 50.432C439.765 50.432 438.053 49.792 436.773 48.512C435.525 47.2 434.901 45.376 434.901 43.04C434.901 39.392 435.797 36.528 437.589 34.448C439.381 32.368 441.701 31.328 444.549 31.328C446.885 31.328 448.437 32.432 449.205 34.64C449.365 33.68 449.541 32.72 449.733 31.76C452.101 31.76 453.861 31.664 455.013 31.472L455.637 31.328L452.325 49.472C453.285 49.376 454.085 48.928 454.725 48.128L455.445 48.704C454.485 49.856 453.285 50.432 451.845 50.432ZM440.325 45.488C440.325 46.928 440.501 47.936 440.853 48.512C441.237 49.056 441.813 49.328 442.581 49.328C443.349 49.328 444.133 48.912 444.933 48.08C445.989 46.992 446.837 45.616 447.477 43.952C447.573 43.536 447.749 42.544 448.005 40.976C448.293 39.376 448.533 38.064 448.725 37.04C448.629 35.824 448.293 34.768 447.717 33.872C447.141 32.976 446.421 32.528 445.557 32.528C443.989 32.528 442.725 33.936 441.765 36.752C440.805 39.536 440.325 42.448 440.325 45.488ZM488.002 28.304C488.002 26.448 487.442 24.976 486.322 23.888C485.234 22.8 483.49 22.256 481.09 22.256C478.69 22.256 476.61 23.088 474.85 24.752C473.122 26.416 472.018 28.448 471.538 30.848H470.146C470.69 28.032 472.002 25.68 474.082 23.792C476.162 21.872 478.546 20.912 481.234 20.912C483.954 20.912 485.986 21.568 487.33 22.88C488.706 24.16 489.394 25.84 489.394 27.92C489.394 28.688 489.298 29.456 489.106 30.224C488.69 31.888 487.986 33.344 486.994 34.592C486.034 35.808 484.578 37.264 482.626 38.96C480.674 40.656 479.186 42.496 478.162 44.48L477.01 43.904C478.002 41.792 479.842 39.648 482.53 37.472C485.218 35.264 486.978 32.816 487.81 30.128C487.938 29.584 488.002 28.976 488.002 28.304ZM474.85 49.712C474.402 49.232 474.178 48.656 474.178 47.984C474.178 47.312 474.402 46.736 474.85 46.256C475.33 45.776 475.906 45.536 476.578 45.536C477.25 45.536 477.826 45.776 478.306 46.256C478.786 46.736 479.026 47.312 479.026 47.984C479.026 48.656 478.786 49.232 478.306 49.712C477.826 50.16 477.25 50.384 476.578 50.384C475.906 50.384 475.33 50.16 474.85 49.712Z" fill="white"/>
</svg>
