<svg width="450" height="78" viewBox="0 0 450 78" fill="none" xmlns="http://www.w3.org/2000/svg">
<rect width="450" height="78" rx="39" fill="#AACE05"/>
<path d="M48.144 21.44C51.248 21.44 53.904 20.832 56.112 19.616L56.64 20.48C54.56 21.696 52.272 22.352 49.776 22.448C47.76 24.368 46.048 27.568 44.64 32.048C43.264 36.528 42.576 41.296 42.576 46.352C42.576 49.456 43.136 51.648 44.256 52.928C45.408 54.208 46.752 54.848 48.288 54.848C49.312 54.848 50.304 54.608 51.264 54.128C52.224 53.68 52.96 53.232 53.472 52.784C54.016 52.336 54.72 51.68 55.584 50.816C55.072 49.28 54.816 46.896 54.816 43.664C54.816 40.4 55.376 36.896 56.496 33.152C57.616 29.376 59.104 26.288 60.96 23.888C62.816 21.488 64.736 20.288 66.72 20.288C67.68 20.288 68.4 20.544 68.88 21.056C69.392 21.568 69.648 22.496 69.648 23.84C69.648 26.56 68.768 30.176 67.008 34.688C65.28 39.2 63.04 43.312 60.288 47.024C60.576 49.488 61.36 51.312 62.64 52.496C63.92 53.68 65.552 54.272 67.536 54.272C71.184 54.272 74.464 50.784 77.376 43.808C79.616 38.432 80.736 32.928 80.736 27.296C80.736 21.664 79.648 17.76 77.472 15.584L78.192 14.864C80.592 17.264 81.792 21.456 81.792 27.44C81.792 33.008 80.656 38.608 78.384 44.24C74.8 52.88 69.92 57.2 63.744 57.2C60.576 57.2 58.256 55.936 56.784 53.408C56.4 52.768 56.128 52.288 55.968 51.968C52.576 55.456 48.832 57.2 44.736 57.2C42.08 57.2 40.096 56.304 38.784 54.512C37.504 52.752 36.864 50.608 36.864 48.08C36.864 45.552 37.184 43.04 37.824 40.544C38.496 38.016 39.264 35.856 40.128 34.064C40.992 32.272 42.032 30.512 43.248 28.784C44.912 26.32 46.624 24.208 48.384 22.448C47.328 22.448 45.952 22.336 44.256 22.112C40.704 21.92 38.8 21.824 38.544 21.824C34.064 21.824 30.544 22.96 27.984 25.232C25.424 27.472 24.144 30.576 24.144 34.544C24.144 36.4 24.576 38.144 25.44 39.776C25.888 40.64 26.864 41.632 28.368 42.752C28.688 43.008 29.2 43.28 29.904 43.568C30.608 43.856 30.976 44 31.008 44L31.824 44.24L31.68 45.248C31.072 45.248 30.192 44.928 29.04 44.288C27.888 43.648 26.896 42.976 26.064 42.272C25.264 41.536 24.56 40.496 23.952 39.152C23.376 37.776 23.088 36.24 23.088 34.544C23.088 30.32 24.48 26.976 27.264 24.512C30.048 22.016 33.808 20.768 38.544 20.768C40.464 20.768 42.224 20.88 43.824 21.104C45.424 21.328 46.864 21.44 48.144 21.44ZM60.144 44.624V45.344C60.464 44.896 60.88 44.256 61.392 43.424C63.472 40.192 65.184 36.72 66.528 33.008C67.872 29.296 68.544 26.24 68.544 23.84C68.544 22.176 67.936 21.344 66.72 21.344C66.24 21.344 65.712 21.472 65.136 21.728C64.08 22.72 63.056 24.688 62.064 27.632C60.784 31.408 60.144 37.072 60.144 44.624ZM102.77 49.472C103.538 49.472 104.338 49.024 105.17 48.128L105.89 48.704C105.666 49.152 105.17 49.552 104.402 49.904C103.634 50.256 102.786 50.432 101.858 50.432C98.9455 50.432 97.4895 49.12 97.4895 46.496C97.4895 45.376 97.7775 43.376 98.3535 40.496C98.9295 37.616 99.2175 35.728 99.2175 34.832C99.2175 33.456 98.5615 32.768 97.2495 32.768C96.1615 32.768 95.1055 33.504 94.0815 34.976C93.0895 36.448 92.2735 38.448 91.6335 40.976L90.0495 50H84.2895L89.6175 19.856C88.6575 19.952 87.8575 20.4 87.2175 21.2L86.4975 20.624C87.4575 19.472 88.6575 18.896 90.0975 18.896C91.5695 18.896 92.7055 19.264 93.5055 20C94.3055 20.736 94.7055 21.776 94.7055 23.12C94.7055 23.376 94.6735 23.792 94.6095 24.368L92.5935 35.744C93.9055 32.8 95.9375 31.328 98.6895 31.328C100.578 31.328 102.05 31.872 103.106 32.96C104.162 34.016 104.69 35.488 104.69 37.376C104.69 38.368 104.386 40.288 103.778 43.136C103.17 45.952 102.834 48.064 102.77 49.472ZM125.104 50.432C122.288 50.432 120.752 49.2 120.496 46.736C119.088 49.2 117.312 50.432 115.168 50.432C113.024 50.432 111.312 49.792 110.032 48.512C108.784 47.2 108.16 45.376 108.16 43.04C108.16 39.392 109.056 36.528 110.848 34.448C112.64 32.368 114.96 31.328 117.808 31.328C120.144 31.328 121.696 32.432 122.464 34.64C122.624 33.68 122.8 32.72 122.992 31.76C125.36 31.76 127.12 31.664 128.272 31.472L128.896 31.328L125.584 49.472C126.544 49.376 127.344 48.928 127.984 48.128L128.704 48.704C127.744 49.856 126.544 50.432 125.104 50.432ZM113.584 45.488C113.584 46.928 113.76 47.936 114.112 48.512C114.496 49.056 115.072 49.328 115.84 49.328C116.608 49.328 117.392 48.912 118.192 48.08C119.248 46.992 120.096 45.616 120.736 43.952C120.832 43.536 121.008 42.544 121.264 40.976C121.552 39.376 121.792 38.064 121.984 37.04C121.888 35.824 121.552 34.768 120.976 33.872C120.4 32.976 119.68 32.528 118.816 32.528C117.248 32.528 115.984 33.936 115.024 36.752C114.064 39.536 113.584 42.448 113.584 45.488ZM134.386 31.76L135.682 24.656C138.05 24.656 139.81 24.56 140.962 24.368L141.586 24.224C141.138 26.464 140.642 28.976 140.098 31.76H146.05L145.954 32.624H139.954C138.354 40.88 137.554 45.856 137.554 47.552C137.554 48.576 138.098 49.088 139.186 49.088C140.274 49.088 141.266 48.4 142.162 47.024C143.058 45.648 143.698 44.16 144.082 42.56L144.946 42.848C143.762 47.904 141.314 50.432 137.602 50.432C136.066 50.432 134.786 50.016 133.762 49.184C132.738 48.32 132.226 47.136 132.226 45.632C132.226 44.096 132.882 39.76 134.194 32.624H131.842L131.938 31.76H134.386ZM164.346 43.472C164.346 48.272 165.898 51.44 169.002 52.976C169.77 53.072 170.778 53.12 172.026 53.12C173.274 53.12 174.586 52.928 175.962 52.544C177.37 52.192 178.506 51.728 179.37 51.152C180.586 50.384 181.498 49.648 182.106 48.944C182.298 48.24 182.554 47.12 182.874 45.584C183.226 44.016 183.498 42.832 183.69 42.032L184.698 42.272C184.442 43.264 184.122 44.592 183.738 46.256C183.386 47.92 183.114 49.12 182.922 49.856C182.762 50.56 182.506 51.472 182.154 52.592C181.834 53.744 181.514 54.576 181.194 55.088C180.874 55.632 180.442 56.224 179.898 56.864C179.034 57.92 177.658 58.72 175.77 59.264L175.578 58.256C177.21 57.904 178.474 57.104 179.37 55.856C180.266 54.64 181.034 52.912 181.674 50.672C179.082 53.008 175.706 54.176 171.546 54.176C167.418 54.176 164.234 52.992 161.994 50.624C159.786 48.288 158.682 44.976 158.682 40.688C158.682 34.896 160.554 30.128 164.298 26.384C168.042 22.64 172.954 20.768 179.034 20.768C181.85 20.768 183.882 21.28 185.13 22.304C186.378 23.296 187.002 24.864 187.002 27.008C187.002 28.448 186.298 30.224 184.89 32.336C183.61 34.384 182.97 35.984 182.97 37.136H181.914C181.914 36.496 182.042 35.808 182.298 35.072C182.554 34.336 182.778 33.808 182.97 33.488C183.162 33.168 183.514 32.592 184.026 31.76C185.274 29.872 185.898 28.32 185.898 27.104C185.898 24.544 184.842 22.928 182.73 22.256C181.738 21.936 180.698 21.776 179.61 21.776C178.522 21.776 177.37 21.84 176.154 21.968C175.034 22.32 173.962 22.784 172.938 23.36C171.946 23.904 170.906 24.752 169.818 25.904C168.73 27.024 167.802 28.336 167.034 29.84C166.266 31.344 165.626 33.28 165.114 35.648C164.602 37.984 164.346 40.592 164.346 43.472ZM197.288 48.272C196.872 48.816 196.296 49.312 195.56 49.76C194.856 50.208 193.928 50.432 192.776 50.432C191.624 50.432 190.648 50.064 189.848 49.328C189.048 48.592 188.648 47.552 188.648 46.208C188.648 45.952 188.68 45.536 188.744 44.96L191.864 27.68C192.44 24.512 193.224 22.256 194.216 20.912C195.24 19.568 196.584 18.896 198.248 18.896C199.4 18.896 200.344 19.328 201.08 20.192C201.848 21.056 202.232 22.368 202.232 24.128C202.232 25.888 201.544 28.4 200.168 31.664C198.824 34.928 198.152 37.312 198.152 38.816H197.288C197.288 37.12 197.96 34.704 199.304 31.568C200.648 28.4 201.32 25.872 201.32 23.984C201.32 22.832 201.048 21.84 200.504 21.008C199.992 20.176 199.352 19.76 198.584 19.76C198.552 20.592 197.992 24.336 196.904 30.992C195.848 37.616 194.792 43.776 193.736 49.472C194.632 49.472 195.464 49.008 196.232 48.08C197 47.152 197.544 46.224 197.864 45.296L198.392 43.856L199.256 44.24C199.16 44.688 198.904 45.344 198.488 46.208C198.104 47.04 197.704 47.728 197.288 48.272ZM218.807 50.432C215.991 50.432 214.455 49.2 214.199 46.736C212.791 49.2 211.015 50.432 208.871 50.432C206.727 50.432 205.015 49.792 203.735 48.512C202.487 47.2 201.863 45.376 201.863 43.04C201.863 39.392 202.759 36.528 204.551 34.448C206.343 32.368 208.663 31.328 211.511 31.328C213.847 31.328 215.399 32.432 216.167 34.64C216.327 33.68 216.503 32.72 216.695 31.76C219.063 31.76 220.823 31.664 221.975 31.472L222.599 31.328L219.287 49.472C220.247 49.376 221.047 48.928 221.687 48.128L222.407 48.704C221.447 49.856 220.247 50.432 218.807 50.432ZM207.287 45.488C207.287 46.928 207.463 47.936 207.815 48.512C208.199 49.056 208.775 49.328 209.543 49.328C210.311 49.328 211.095 48.912 211.895 48.08C212.951 46.992 213.799 45.616 214.439 43.952C214.535 43.536 214.711 42.544 214.967 40.976C215.255 39.376 215.495 38.064 215.687 37.04C215.591 35.824 215.255 34.768 214.679 33.872C214.103 32.976 213.383 32.528 212.519 32.528C210.951 32.528 209.687 33.936 208.727 36.752C207.767 39.536 207.287 42.448 207.287 45.488ZM229.193 32.24C228.393 32.24 227.721 32.512 227.177 33.056C226.633 33.6 226.361 34.24 226.361 34.976C226.361 35.712 226.569 36.464 226.985 37.232L226.121 37.568C225.609 36.928 225.353 36.08 225.353 35.024C225.353 33.968 225.705 33.088 226.409 32.384C227.145 31.68 228.025 31.328 229.049 31.328C230.073 31.328 231.433 31.488 233.129 31.808C234.857 32.096 236.777 32.24 238.889 32.24C241.033 32.208 242.617 32.064 243.641 31.808L230.921 48.752C232.617 49.264 234.473 49.536 236.489 49.568C237.769 49.568 238.873 49.216 239.801 48.512C240.761 47.776 241.385 47.056 241.673 46.352L242.105 45.296L242.921 45.584C242.633 46.736 241.977 47.84 240.953 48.896C239.929 49.92 238.393 50.432 236.345 50.432C234.329 50.432 232.489 50.208 230.825 49.76C229.161 49.312 227.945 49.088 227.177 49.088C226.409 49.088 225.721 49.392 225.113 50H224.249L236.825 33.008C235.161 32.944 233.673 32.8 232.361 32.576C231.049 32.352 229.993 32.24 229.193 32.24ZM264.321 48.704C263.361 49.856 262.161 50.432 260.721 50.432C259.281 50.432 258.145 50.064 257.313 49.328C256.513 48.592 256.113 47.632 256.113 46.448C256.113 46.032 256.369 44.288 256.881 41.216L258.465 32.624H256.449L256.545 31.76H258.609C260.977 31.76 262.721 31.664 263.841 31.472L264.513 31.328L261.201 49.472C262.161 49.376 262.961 48.928 263.601 48.128L264.321 48.704ZM260.097 26.72C259.425 26.048 259.089 25.232 259.089 24.272C259.089 23.312 259.425 22.496 260.097 21.824C260.769 21.12 261.585 20.768 262.545 20.768C263.505 20.768 264.321 21.12 264.993 21.824C265.697 22.496 266.049 23.312 266.049 24.272C266.049 25.232 265.697 26.048 264.993 26.72C264.321 27.392 263.505 27.728 262.545 27.728C261.585 27.728 260.769 27.392 260.097 26.72ZM271.578 49.184C274.746 49.184 276.33 46.848 276.33 42.176C276.33 41.024 276.154 39.664 275.802 38.096C275.482 36.528 275.29 35.552 275.226 35.168C273.274 37.184 271.082 38.4 268.65 38.816V37.664C270.954 37.152 273.114 35.84 275.13 33.728V33.536C275.13 32.768 275.242 32.016 275.466 31.28C275.69 30.544 275.914 30 276.138 29.648L276.474 29.12H277.626C277.626 30.528 277.85 31.824 278.298 33.008C278.746 34.16 279.242 35.104 279.786 35.84C280.33 36.544 280.826 37.488 281.274 38.672C281.722 39.824 281.946 41.104 281.946 42.512C281.946 44.784 281.082 46.672 279.354 48.176C277.658 49.68 275.61 50.432 273.21 50.432C270.81 50.432 268.986 49.888 267.738 48.8C266.522 47.712 265.914 46.464 265.914 45.056C265.914 43.616 266.266 42.592 266.97 41.984C267.674 41.344 268.506 41.024 269.466 41.024C270.426 41.024 271.21 41.344 271.818 41.984C272.458 42.592 272.778 43.392 272.778 44.384C272.778 45.344 272.474 46.16 271.866 46.832C271.258 47.504 270.474 47.84 269.514 47.84C269.098 47.84 268.666 47.776 268.218 47.648C268.922 48.672 270.042 49.184 271.578 49.184ZM311.901 50.432C309.085 50.432 307.549 49.2 307.293 46.736C305.885 49.2 304.109 50.432 301.965 50.432C299.821 50.432 298.109 49.792 296.829 48.512C295.581 47.2 294.957 45.376 294.957 43.04C294.957 39.392 295.853 36.528 297.645 34.448C299.437 32.368 301.757 31.328 304.605 31.328C306.941 31.328 308.493 32.432 309.261 34.64C309.421 33.68 309.597 32.72 309.789 31.76C312.157 31.76 313.917 31.664 315.069 31.472L315.693 31.328L312.381 49.472C313.341 49.376 314.141 48.928 314.781 48.128L315.501 48.704C314.541 49.856 313.341 50.432 311.901 50.432ZM300.381 45.488C300.381 46.928 300.557 47.936 300.909 48.512C301.293 49.056 301.869 49.328 302.637 49.328C303.405 49.328 304.189 48.912 304.989 48.08C306.045 46.992 306.893 45.616 307.533 43.952C307.629 43.536 307.805 42.544 308.061 40.976C308.349 39.376 308.589 38.064 308.781 37.04C308.685 35.824 308.349 34.768 307.773 33.872C307.197 32.976 306.477 32.528 305.613 32.528C304.045 32.528 302.781 33.936 301.821 36.752C300.861 39.536 300.381 42.448 300.381 45.488ZM326.943 50.432C324.927 50.432 323.455 49.76 322.527 48.416L318.495 51.296H317.583L322.959 19.856C321.999 19.952 321.199 20.4 320.559 21.2L319.839 20.624C320.799 19.472 321.999 18.896 323.439 18.896C324.911 18.896 326.047 19.264 326.847 20C327.647 20.736 328.047 21.776 328.047 23.12C328.047 23.376 328.015 23.792 327.951 24.368C327.439 27.216 326.815 30.64 326.079 34.64C327.423 32.464 329.167 31.376 331.311 31.376C333.455 31.376 335.103 32 336.255 33.248C337.407 34.464 337.983 36.144 337.983 38.288C337.983 42.064 336.959 45.04 334.911 47.216C332.863 49.36 330.207 50.432 326.943 50.432ZM326.607 49.136C328.367 49.136 329.791 47.92 330.879 45.488C331.999 43.024 332.559 39.968 332.559 36.32C332.559 34.848 332.399 33.84 332.079 33.296C331.791 32.752 331.247 32.48 330.447 32.48C329.647 32.48 328.815 32.96 327.951 33.92C327.119 34.88 326.511 35.792 326.127 36.656C325.743 37.488 325.551 37.968 325.551 38.096H325.455C324.655 42.288 324.063 45.456 323.679 47.6C324.223 48.624 325.199 49.136 326.607 49.136ZM347.868 50.432C345.404 50.432 343.532 49.824 342.252 48.608C340.972 47.36 340.332 45.808 340.332 43.952C340.332 42.064 340.492 40.464 340.812 39.152C341.164 37.808 341.724 36.528 342.492 35.312C343.26 34.064 344.412 33.088 345.948 32.384C347.516 31.68 349.452 31.328 351.756 31.328C354.092 31.328 355.9 31.952 357.18 33.2C358.492 34.416 359.148 36.096 359.148 38.24C359.148 41.888 358.172 44.832 356.22 47.072C354.3 49.312 351.516 50.432 347.868 50.432ZM345.756 45.488C345.756 48.048 346.492 49.328 347.964 49.328C349.468 49.328 350.796 48.048 351.948 45.488C353.132 42.896 353.724 39.824 353.724 36.272C353.724 33.584 352.988 32.24 351.516 32.24C350.076 32.24 348.748 33.472 347.532 35.936C346.348 38.368 345.756 41.552 345.756 45.488ZM364.496 32.288C363.728 32.288 362.928 32.736 362.096 33.632L361.376 33.056C361.6 32.608 362.096 32.208 362.864 31.856C363.632 31.504 364.48 31.328 365.408 31.328C368.32 31.328 369.776 32.64 369.776 35.264C369.776 36.384 369.488 38.384 368.912 41.264C368.336 44.144 368.048 46.032 368.048 46.928C368.048 48.304 368.704 48.992 370.016 48.992C370.944 48.992 371.84 48.448 372.704 47.36C373.6 46.272 374.368 44.768 375.008 42.848L377.024 31.76C379.392 31.76 381.12 31.664 382.208 31.472L382.832 31.328L379.616 49.472C380.576 49.376 381.376 48.928 382.016 48.128L382.736 48.704C381.776 49.856 380.576 50.432 379.136 50.432C377.696 50.432 376.576 50.08 375.776 49.376C374.976 48.672 374.56 47.68 374.528 46.4C373.184 49.088 371.2 50.432 368.576 50.432C366.688 50.432 365.216 49.904 364.16 48.848C363.104 47.76 362.576 46.272 362.576 44.384C362.576 43.392 362.88 41.488 363.488 38.672C364.096 35.824 364.432 33.696 364.496 32.288ZM388.449 31.76L389.745 24.656C392.113 24.656 393.873 24.56 395.025 24.368L395.649 24.224C395.201 26.464 394.705 28.976 394.161 31.76H400.113L400.017 32.624H394.017C392.417 40.88 391.617 45.856 391.617 47.552C391.617 48.576 392.161 49.088 393.249 49.088C394.337 49.088 395.329 48.4 396.225 47.024C397.121 45.648 397.761 44.16 398.145 42.56L399.009 42.848C397.825 47.904 395.377 50.432 391.665 50.432C390.129 50.432 388.849 50.016 387.825 49.184C386.801 48.32 386.289 47.136 386.289 45.632C386.289 44.096 386.945 39.76 388.257 32.624H385.905L386.001 31.76H388.449ZM430.792 28.304C430.792 26.448 430.232 24.976 429.112 23.888C428.024 22.8 426.28 22.256 423.88 22.256C421.48 22.256 419.4 23.088 417.64 24.752C415.912 26.416 414.808 28.448 414.328 30.848H412.936C413.48 28.032 414.792 25.68 416.872 23.792C418.952 21.872 421.336 20.912 424.024 20.912C426.744 20.912 428.776 21.568 430.12 22.88C431.496 24.16 432.184 25.84 432.184 27.92C432.184 28.688 432.088 29.456 431.896 30.224C431.48 31.888 430.776 33.344 429.784 34.592C428.824 35.808 427.368 37.264 425.416 38.96C423.464 40.656 421.976 42.496 420.952 44.48L419.8 43.904C420.792 41.792 422.632 39.648 425.32 37.472C428.008 35.264 429.768 32.816 430.6 30.128C430.728 29.584 430.792 28.976 430.792 28.304ZM417.64 49.712C417.192 49.232 416.968 48.656 416.968 47.984C416.968 47.312 417.192 46.736 417.64 46.256C418.12 45.776 418.696 45.536 419.368 45.536C420.04 45.536 420.616 45.776 421.096 46.256C421.576 46.736 421.816 47.312 421.816 47.984C421.816 48.656 421.576 49.232 421.096 49.712C420.616 50.16 420.04 50.384 419.368 50.384C418.696 50.384 418.12 50.16 417.64 49.712Z" fill="white"/>
</svg>
