<svg width="466" height="378" viewBox="0 0 466 378" fill="none" xmlns="http://www.w3.org/2000/svg">
<path d="M230.714 304.588C201.188 304.588 172.576 293.851 149.753 274.206C126.929 254.561 111.307 227.225 105.547 196.854C99.7865 166.483 104.245 134.957 118.164 107.647C132.082 80.3379 154.598 58.9347 181.876 47.0846C209.154 35.2345 239.506 33.6707 267.76 42.6597C296.014 51.6486 320.422 70.6342 336.826 96.3814C353.229 122.129 360.613 153.044 357.719 183.861C354.825 214.678 341.832 243.489 320.955 265.385C309.132 277.853 295.068 287.737 279.578 294.467C264.088 301.196 247.48 304.636 230.714 304.588ZM230.714 37.7675C160.802 37.7675 103.925 97.4194 103.925 170.742C103.925 244.064 160.802 303.716 230.714 303.716C300.625 303.716 357.502 244.064 357.502 170.742C357.502 97.4194 300.625 37.7675 230.714 37.7675Z" fill="#3F3D56"/>
<path d="M241.463 289.808C239.1 298.97 231.005 304.645 231.005 304.645C231.005 304.645 226.742 295.464 229.105 286.302C231.469 277.14 239.563 271.465 239.563 271.465C239.563 271.465 243.827 280.646 241.463 289.808Z" fill="#AACE05"/>
<path d="M219.964 289.808C222.327 298.97 230.422 304.645 230.422 304.645C230.422 304.645 234.685 295.464 232.322 286.302C229.959 277.14 221.864 271.465 221.864 271.465C221.864 271.465 217.601 280.646 219.964 289.808Z" fill="#AACE05"/>
<path d="M223.437 287.839C229.922 294.46 230.714 304.637 230.714 304.637C230.714 304.637 220.992 304.081 214.507 297.46C208.022 290.839 207.23 280.661 207.23 280.661C207.23 280.661 216.952 281.218 223.437 287.839Z" fill="#3F3D56"/>
<path d="M237.99 287.839C231.505 294.46 230.713 304.637 230.713 304.637C230.713 304.637 240.435 304.081 246.92 297.46C253.405 290.839 254.197 280.661 254.197 280.661C254.197 280.661 244.475 281.218 237.99 287.839Z" fill="#3F3D56"/>
<path d="M219.964 52.18C222.327 43.0177 230.422 37.3433 230.422 37.3433C230.422 37.3433 234.685 46.5239 232.322 55.6862C229.959 64.8485 221.864 70.523 221.864 70.523C221.864 70.523 217.601 61.3424 219.964 52.18Z" fill="#AACE05"/>
<path d="M241.463 52.18C239.1 43.0177 231.005 37.3433 231.005 37.3433C231.005 37.3433 226.742 46.5239 229.105 55.6862C231.469 64.8485 239.563 70.523 239.563 70.523C239.563 70.523 243.827 61.3424 241.463 52.18Z" fill="#AACE05"/>
<path d="M237.99 54.1492C231.505 47.5285 230.713 37.3508 230.713 37.3508C230.713 37.3508 240.435 37.9076 246.92 44.5283C253.405 51.1491 254.197 61.3267 254.197 61.3267C254.197 61.3267 244.475 60.77 237.99 54.1492Z" fill="#3F3D56"/>
<path d="M223.437 54.1492C229.922 47.5285 230.714 37.3508 230.714 37.3508C230.714 37.3508 220.992 37.9076 214.507 44.5283C208.022 51.1491 207.23 61.3267 207.23 61.3267C207.23 61.3267 216.952 60.77 223.437 54.1492Z" fill="#3F3D56"/>
<path d="M171.303 5.52686H6.08057V181.736H171.303V5.52686Z" fill="#AACE05"/>
<path d="M165.06 9.99927H17.8765H9.53418V19.3737V174.988H17.8765V19.3737H165.06V9.99927Z" fill="#3F3D56"/>
<path opacity="0.3" d="M165.06 9.99927H17.8765H9.53418V19.3737V174.988H17.8765V19.3737H165.06V9.99927Z" fill="black"/>
<path opacity="0.1" d="M141.225 19.3738H134.67H17.8765V41.8721H134.67V174.988H165.06V19.3738H141.225Z" fill="black"/>
<path d="M0 0V184.987H174.594V0H0ZM165.06 174.988H9.53415V9.9993H165.06V174.988Z" fill="#3F3D56"/>
<path d="M122.527 191.807C122.527 191.807 130.422 207.85 134.863 211.472C139.304 215.095 127.709 219.493 127.709 219.493L114.139 197.241L122.527 191.807Z" fill="#A0616A"/>
<path d="M74.665 152.735C74.665 152.735 111.426 162.827 114.633 169.554C117.84 176.282 127.709 192.583 127.709 192.583L113.153 204.744L98.8431 182.233L59.3687 163.603L74.665 152.735Z" fill="#2F2E41"/>
<path d="M126.475 213.024C126.475 213.024 123.021 209.919 122.034 211.989C121.048 214.059 118.087 224.668 118.087 224.668C118.087 224.668 122.281 228.808 130.916 226.221C130.916 226.221 133.137 224.41 136.591 226.221C140.045 228.032 152.874 224.41 152.38 218.458C151.887 212.507 138.811 213.024 138.811 213.024C138.811 213.024 133.304 206.553 132.603 209.013C131.903 211.472 132.89 211.731 132.89 211.731C132.89 211.731 128.449 216.647 126.475 213.024Z" fill="#2F2E41"/>
<path d="M84.287 207.591L81.8198 229.326H93.9089C93.9089 229.326 92.922 212.507 93.1687 210.437C93.4155 208.367 84.287 207.591 84.287 207.591Z" fill="#A0616A"/>
<path d="M91.1948 159.722C91.1948 159.722 97.8561 170.072 93.9087 170.848C89.9612 171.624 86.7539 159.722 86.7539 159.722H91.1948Z" fill="#A0616A"/>
<path d="M40.8646 158.687C40.8646 158.687 35.9303 173.953 55.4208 178.093C74.9114 182.233 80.8325 185.597 80.8325 185.597L83.2997 211.989L100.323 213.024C100.323 213.024 108.465 172.918 97.8559 167.743C87.2471 162.568 64.796 156.617 64.796 156.617L40.8646 158.687Z" fill="#2F2E41"/>
<path d="M83.3002 225.962C83.3002 225.962 86.7542 224.151 87.2476 224.151C87.2476 224.151 89.4162 218.905 93.3896 219.458L102.051 232.69C102.051 232.69 115.126 242.522 105.998 245.11C96.8695 247.697 89.7148 245.627 89.7148 245.627L86.0141 242.781C86.0141 242.781 86.5075 239.935 83.3002 240.452C83.3002 240.452 76.6389 237.606 76.8856 235.536C77.1323 233.466 82.3727 224.456 82.3727 224.456L83.3002 225.962Z" fill="#2F2E41"/>
<path d="M85.3969 108.359C90.8472 108.359 95.2655 103.725 95.2655 98.0092C95.2655 92.2931 90.8472 87.6592 85.3969 87.6592C79.9466 87.6592 75.5283 92.2931 75.5283 98.0092C75.5283 103.725 79.9466 108.359 85.3969 108.359Z" fill="#A0616A"/>
<path d="M77.379 94.7749C77.379 94.7749 68.4972 101.502 66.7702 101.761C65.0432 102.02 74.9118 114.699 74.9118 114.699C74.9118 114.699 79.5994 106.677 82.56 105.642C85.5206 104.607 77.379 94.7749 77.379 94.7749Z" fill="#A0616A"/>
<path d="M70.7177 103.314C70.7177 103.314 67.0169 98.1387 64.7965 98.1387C62.576 98.1387 42.5921 100.467 40.8651 117.804C39.1381 135.14 40.1249 165.414 40.1249 165.414C40.1249 165.414 38.6446 157.91 55.1746 161.015C55.1746 161.015 74.9118 156.617 78.3658 156.617C81.8198 156.617 83.3001 119.615 83.3001 119.615L77.6827 110.481C77.6827 110.481 75.1585 115.475 70.7177 103.314Z" fill="#D0CDE1"/>
<path d="M79.5991 117.545L83.2998 119.615L87.7407 148.078L93.9086 162.827C93.9086 162.827 87.2473 160.422 86.7539 163.306L76.8853 148.337L79.5991 117.545Z" fill="#D0CDE1"/>
<path d="M83.1784 89.5211L88.5472 90.2245C88.4447 91.3703 88.4732 92.7898 89.4412 93.3318C89.8963 93.5866 90.4738 93.5736 90.8771 93.9109C91.8472 94.7221 90.8983 96.4665 91.446 97.6341L93.0162 98.0699C93.2048 98.44 93.4614 98.7674 93.7711 99.0332C94.0809 99.2989 94.4377 99.4978 94.821 99.6184C95.2043 99.739 95.6066 99.7789 96.0047 99.7358C96.4028 99.6926 96.7888 99.5674 97.1405 99.3672C98.1956 98.7027 98.7333 97.4332 99.208 96.2423C99.7752 94.8195 100.354 93.2909 100.07 91.7779C99.7651 90.1522 98.4988 88.8013 98.4414 87.1456C98.4156 86.4049 98.5648 85.4815 97.9694 85.0821C97.6955 84.9471 97.4006 84.865 97.0989 84.8398C95.7273 84.5394 94.9636 83.0506 93.9407 82.0462C91.7972 79.9415 88.5054 79.9968 85.5742 80.1803C84.7352 80.1835 83.9027 80.3357 83.1121 80.6305C82.2184 81.1005 81.4283 81.7613 80.7924 82.5705C79.2204 84.3288 77.69 86.1705 76.653 88.3216C75.6161 90.4727 75.1052 92.9859 75.6688 95.3227C75.6133 95.0978 77.479 93.6265 77.7111 93.3907C78.4403 92.6502 78.5067 92.2965 78.9013 91.4444C79.8211 89.4581 81.1001 89.2488 83.1784 89.5211Z" fill="#2F2E41"/>
<path opacity="0.1" d="M67.3867 122.849L68.1271 140.962L79.1012 154.46L69.114 139.41L67.3867 122.849Z" fill="black"/>
<path opacity="0.1" d="M47.6494 127.766L56.2843 148.725L67.3864 158.299L55.544 149.76L47.6494 127.766Z" fill="black"/>
<path d="M94.5542 144.754L99.7717 148.518C100.032 148.733 100.213 149.035 100.286 149.373C100.358 149.712 100.318 150.066 100.17 150.377L99.4725 151.887L99.6341 152.004L98.8412 153.72L98.6796 153.603L92.9325 166.042C92.8728 166.206 92.7788 166.353 92.6575 166.473C92.5362 166.593 92.3906 166.683 92.2316 166.737C92.0726 166.79 91.9042 166.805 91.7389 166.781C91.5736 166.756 91.4157 166.694 91.2767 166.597L86.3735 163.059C86.0747 162.812 85.866 162.465 85.7826 162.076C85.6991 161.686 85.7459 161.279 85.9151 160.922L93.1713 145.217C93.2212 145.08 93.2996 144.957 93.401 144.857C93.5023 144.756 93.6238 144.681 93.7566 144.637C93.8894 144.592 94.0301 144.58 94.1681 144.6C94.3062 144.62 94.4381 144.673 94.5542 144.754Z" fill="#3F3D56"/>
<path d="M86.4556 160.784L92.0713 164.836L99.3971 148.98L93.781 144.929L86.4556 160.784Z" fill="white"/>
<path d="M84.0176 157.294C84.0176 157.294 93.8039 164.406 90.3934 166.631C86.983 168.856 79.8789 158.983 79.8789 158.983L84.0176 157.294Z" fill="#A0616A"/>
<path d="M54.9277 104.607C54.9277 104.607 42.0985 108.489 45.7992 120.391C46.6919 123.262 47.7713 126.344 48.8953 129.369C52.4308 138.881 56.408 147.819 56.408 147.819L67.5593 158.394L82.5598 162.827L84.2868 161.274C84.2868 161.274 84.7803 156.358 82.5598 155.84C80.3394 155.323 76.8854 153.253 76.8854 153.253L68.0036 139.539C68.0036 139.539 67.7569 105.384 54.9277 104.607Z" fill="#D0CDE1"/>
<path d="M298.776 308.417H460.064V136.404L298.776 136.404V308.417Z" fill="#AACE05"/>
<path d="M304.87 140.77H448.549H456.693V149.921V301.83H448.549V149.921H304.87V140.77Z" fill="#3F3D56"/>
<path opacity="0.3" d="M304.87 140.77H448.549H456.693V149.921V301.83H448.549V149.921H304.87V140.77Z" fill="black"/>
<path opacity="0.1" d="M328.138 149.921H334.537H448.549V171.884H334.537V301.83H304.87V149.921H328.138Z" fill="black"/>
<path d="M295.563 131.009V311.591H466V131.009H295.563ZM304.87 140.77H456.693V301.83H304.87V140.77Z" fill="#3F3D56"/>
<path d="M395.154 216.146C391.484 209.642 384.223 209.339 384.223 209.339C384.223 209.339 377.148 208.39 372.609 218.295C368.378 227.528 362.539 236.443 371.669 238.604L373.318 233.221L374.339 239.005C375.639 239.103 376.943 239.126 378.245 239.075C388.022 238.744 397.333 239.172 397.033 235.492C396.635 230.601 398.686 222.404 395.154 216.146Z" fill="#2F2E41"/>
<path d="M368.701 268.638L367.928 283.215L390.577 285.644L391.35 270.528L383.628 265.399L368.701 268.638Z" fill="#A0616A"/>
<path d="M429.57 300.625C428.891 293.739 401.926 290.614 395.446 289.961L393.023 288.478L392.25 279.841C392.25 279.841 368.315 277.681 366.513 277.411C364.711 277.141 363.167 280.65 363.167 281.46C363.167 282.045 362.83 286.225 361.478 288.702C358.558 291.163 349.655 298.906 349.655 301.84C349.655 305.349 356.733 349.483 356.733 349.483L357.505 358.661L364.711 360.01L364.197 331.398C364.197 331.398 366.77 314.932 363.167 310.343V308.453C363.167 308.453 373.735 305.566 377.46 302.421C378.539 302.178 381.572 301.579 383.248 302.1C383.477 302.242 383.742 302.388 384.037 302.536C384.074 302.571 384.11 302.61 384.143 302.65L384.172 302.603C388.991 304.969 401.351 307.952 406.406 307.104C410.305 306.48 414.291 307.24 417.731 309.263C414.899 313.042 416.958 323.84 416.958 323.84L417.216 347.054L420.819 351.643H425.709V338.956C425.709 338.956 430.342 308.453 429.57 300.625Z" fill="#2F2E41"/>
<path d="M381.955 233.952C386.646 233.952 390.449 229.964 390.449 225.045C390.449 220.125 386.646 216.137 381.955 216.137C377.265 216.137 373.462 220.125 373.462 225.045C373.462 229.964 377.265 233.952 381.955 233.952Z" fill="#A0616A"/>
<path d="M376.808 230.713C376.808 230.713 378.095 236.652 376.293 237.191C374.868 237.687 373.489 238.319 372.175 239.081L370.116 246.099V253.117L395.082 256.087L395.854 253.657V250.148L393.023 244.749L391.736 243.4C391.736 243.4 386.073 236.921 387.36 230.713H376.808Z" fill="#A0616A"/>
<path d="M399.071 252.173C399.071 252.173 399.843 261.62 399.071 265.939C398.298 270.258 398.556 276.736 398.556 276.736L392.894 275.657V261.08L394.18 253.252L399.071 252.173Z" fill="#A0616A"/>
<path d="M385.111 214.878C388.011 214.878 390.362 212.413 390.362 209.372C390.362 206.331 388.011 203.865 385.111 203.865C382.212 203.865 379.861 206.331 379.861 209.372C379.861 212.413 382.212 214.878 385.111 214.878Z" fill="#2F2E41"/>
<path d="M379.309 207.923C379.309 206.563 379.789 205.251 380.656 204.24C381.524 203.229 382.717 202.591 384.006 202.447C383.823 202.427 383.638 202.417 383.454 202.416C382.061 202.416 380.726 202.997 379.741 204.029C378.757 205.062 378.204 206.462 378.204 207.923C378.204 209.383 378.757 210.784 379.741 211.816C380.726 212.849 382.061 213.429 383.454 213.429C383.638 213.429 383.823 213.418 384.006 213.398C382.717 213.255 381.524 212.616 380.656 211.605C379.789 210.594 379.309 209.283 379.309 207.923Z" fill="#2F2E41"/>
<path d="M393.532 215.519L386.358 211.578L376.452 213.19L374.402 222.684L379.504 222.478L380.93 218.991V222.421L383.284 222.326L384.65 216.773L385.504 222.684L393.873 222.505L393.532 215.519Z" fill="#2F2E41"/>
<path d="M364.311 349.596C364.311 349.596 367.963 351.398 369.037 352.074C370.112 352.75 374.408 351.398 373.549 355.454C372.69 359.51 369.037 363.34 369.037 363.34C369.037 363.34 367.319 365.368 367.319 366.72C367.319 368.072 363.022 378.436 357.866 377.986C352.71 377.535 353.569 372.127 353.569 372.127L354.644 366.269C354.644 366.269 356.792 356.355 357.222 356.581C357.651 356.806 358.725 358.383 358.725 358.383C358.725 358.383 364.096 356.13 364.311 349.596Z" fill="#D0CDE1"/>
<path d="M417.874 342.848C417.874 342.848 414.221 344.65 413.147 345.326C412.073 346.002 407.776 344.65 408.636 348.706C409.495 352.762 413.147 356.592 413.147 356.592C413.147 356.592 414.866 358.62 414.866 359.972C414.866 361.324 419.163 371.688 424.319 371.237C429.475 370.787 428.615 365.379 428.615 365.379L427.541 359.521C427.541 359.521 425.393 349.607 424.963 349.833C424.534 350.058 423.459 351.635 423.459 351.635C423.459 351.635 418.088 349.382 417.874 342.848Z" fill="#D0CDE1"/>
<path d="M389.557 278.624V276.482H389.103V275.53C389.103 275.311 389.062 275.095 388.982 274.892C388.902 274.69 388.785 274.507 388.638 274.352C388.49 274.197 388.315 274.074 388.123 273.991C387.93 273.907 387.723 273.864 387.515 273.864H382.068C381.646 273.864 381.242 274.039 380.944 274.352C380.646 274.664 380.479 275.088 380.479 275.53V291.478C380.479 291.92 380.646 292.344 380.944 292.656C381.242 292.968 381.646 293.144 382.068 293.144H387.515C387.936 293.144 388.34 292.968 388.638 292.656C388.936 292.344 389.103 291.92 389.103 291.478V281.481H389.557V279.338H389.103V278.624H389.557Z" fill="#D0CDE1"/>
<path d="M385.018 279.577C385.519 279.577 385.926 279.15 385.926 278.624C385.926 278.099 385.519 277.672 385.018 277.672C384.516 277.672 384.11 278.099 384.11 278.624C384.11 279.15 384.516 279.577 385.018 279.577Z" fill="#3F3D56"/>
<path d="M362.266 247.584L357.633 267.559C357.633 267.559 355.831 271.878 359.949 274.577C364.067 277.276 373.333 280.785 373.333 280.785C373.333 280.785 381.569 292.662 382.598 287.804C383.628 282.945 376.421 276.736 376.421 276.736L363.81 268.369L368.7 254.332L362.266 247.584Z" fill="#A0616A"/>
<path d="M395.725 272.687C395.725 272.687 399.586 272.148 399.328 276.736C399.071 281.325 393.923 281.865 393.923 281.865C393.923 281.865 391.607 292.122 388.261 290.233C384.915 288.343 390.063 278.086 390.063 278.086L394.438 274.577L395.725 272.687Z" fill="#A0616A"/>
<path d="M370.888 245.829L375.006 236.922L366.77 239.891C366.77 239.891 362.137 242.32 361.88 247.989C361.623 253.657 367.8 256.627 367.8 256.627C367.8 256.627 368.829 264.724 368.314 265.804C367.8 266.884 368.314 271.203 368.314 271.203C368.314 271.203 378.223 268.369 383.113 271.878C388.004 275.387 391.993 273.362 391.993 273.362C391.993 273.362 391.735 266.614 393.795 265.534C395.854 264.455 397.655 259.326 395.854 256.087C395.854 256.087 399.972 256.626 399.714 252.578C399.457 248.529 397.398 245.019 394.052 243.4C390.706 241.78 390.336 241.521 390.336 241.521L395.081 250.688V253.117C395.081 253.117 386.681 247.494 378.37 247.025C375.658 246.895 372.996 247.814 370.888 249.608L370.888 249.608V245.829Z" fill="#2F2E41"/>
</svg>
