<svg width="477" height="78" viewBox="0 0 477 78" fill="none" xmlns="http://www.w3.org/2000/svg">
<rect width="477" height="78" rx="39" fill="#AACE05"/>
<path d="M49.2241 21.44C52.3281 21.44 54.9841 20.832 57.1921 19.616L57.7201 20.48C55.6401 21.696 53.3521 22.352 50.8561 22.448C48.8401 24.368 47.1281 27.568 45.7201 32.048C44.3441 36.528 43.6561 41.296 43.6561 46.352C43.6561 49.456 44.2161 51.648 45.3361 52.928C46.4881 54.208 47.8321 54.848 49.3681 54.848C50.3921 54.848 51.3841 54.608 52.3441 54.128C53.3041 53.68 54.0401 53.232 54.5521 52.784C55.0961 52.336 55.8001 51.68 56.6641 50.816C56.1521 49.28 55.8961 46.896 55.8961 43.664C55.8961 40.4 56.4561 36.896 57.5761 33.152C58.6961 29.376 60.1841 26.288 62.0401 23.888C63.8961 21.488 65.8161 20.288 67.8001 20.288C68.7601 20.288 69.4801 20.544 69.9601 21.056C70.4721 21.568 70.7281 22.496 70.7281 23.84C70.7281 26.56 69.8481 30.176 68.0881 34.688C66.3601 39.2 64.1201 43.312 61.3681 47.024C61.6561 49.488 62.4401 51.312 63.7201 52.496C65.0001 53.68 66.6321 54.272 68.6161 54.272C72.2641 54.272 75.5441 50.784 78.4561 43.808C80.6961 38.432 81.8161 32.928 81.8161 27.296C81.8161 21.664 80.7281 17.76 78.5521 15.584L79.2721 14.864C81.6721 17.264 82.8721 21.456 82.8721 27.44C82.8721 33.008 81.7361 38.608 79.4641 44.24C75.8801 52.88 71.0001 57.2 64.8241 57.2C61.6561 57.2 59.3361 55.936 57.8641 53.408C57.4801 52.768 57.2081 52.288 57.0481 51.968C53.6561 55.456 49.9121 57.2 45.8161 57.2C43.1601 57.2 41.1761 56.304 39.8641 54.512C38.5841 52.752 37.9441 50.608 37.9441 48.08C37.9441 45.552 38.2641 43.04 38.9041 40.544C39.5761 38.016 40.3441 35.856 41.2081 34.064C42.0721 32.272 43.1121 30.512 44.3281 28.784C45.9921 26.32 47.7041 24.208 49.4641 22.448C48.4081 22.448 47.0321 22.336 45.3361 22.112C41.7841 21.92 39.8801 21.824 39.6241 21.824C35.1441 21.824 31.6241 22.96 29.0641 25.232C26.5041 27.472 25.2241 30.576 25.2241 34.544C25.2241 36.4 25.6561 38.144 26.5201 39.776C26.9681 40.64 27.9441 41.632 29.4481 42.752C29.7681 43.008 30.2801 43.28 30.9841 43.568C31.6881 43.856 32.0561 44 32.0881 44L32.9041 44.24L32.7601 45.248C32.1521 45.248 31.2721 44.928 30.1201 44.288C28.9681 43.648 27.9761 42.976 27.1441 42.272C26.3441 41.536 25.6401 40.496 25.0321 39.152C24.4561 37.776 24.1681 36.24 24.1681 34.544C24.1681 30.32 25.5601 26.976 28.3441 24.512C31.1281 22.016 34.8881 20.768 39.6241 20.768C41.5441 20.768 43.3041 20.88 44.9041 21.104C46.5041 21.328 47.9441 21.44 49.2241 21.44ZM61.2241 44.624V45.344C61.5441 44.896 61.9601 44.256 62.4721 43.424C64.5521 40.192 66.2641 36.72 67.6081 33.008C68.9521 29.296 69.6241 26.24 69.6241 23.84C69.6241 22.176 69.0161 21.344 67.8001 21.344C67.3201 21.344 66.7921 21.472 66.2161 21.728C65.1601 22.72 64.1361 24.688 63.1441 27.632C61.8641 31.408 61.2241 37.072 61.2241 44.624ZM103.85 49.472C104.618 49.472 105.418 49.024 106.25 48.128L106.97 48.704C106.746 49.152 106.25 49.552 105.482 49.904C104.714 50.256 103.866 50.432 102.938 50.432C100.026 50.432 98.5696 49.12 98.5696 46.496C98.5696 45.376 98.8576 43.376 99.4336 40.496C100.01 37.616 100.298 35.728 100.298 34.832C100.298 33.456 99.6416 32.768 98.3296 32.768C97.2416 32.768 96.1856 33.504 95.1616 34.976C94.1696 36.448 93.3536 38.448 92.7136 40.976L91.1296 50H85.3696L90.6976 19.856C89.7376 19.952 88.9376 20.4 88.2976 21.2L87.5776 20.624C88.5376 19.472 89.7376 18.896 91.1776 18.896C92.6496 18.896 93.7856 19.264 94.5856 20C95.3856 20.736 95.7856 21.776 95.7856 23.12C95.7856 23.376 95.7536 23.792 95.6896 24.368L93.6736 35.744C94.9856 32.8 97.0176 31.328 99.7696 31.328C101.658 31.328 103.13 31.872 104.186 32.96C105.242 34.016 105.77 35.488 105.77 37.376C105.77 38.368 105.466 40.288 104.858 43.136C104.25 45.952 103.914 48.064 103.85 49.472ZM126.184 50.432C123.368 50.432 121.832 49.2 121.576 46.736C120.168 49.2 118.392 50.432 116.248 50.432C114.104 50.432 112.392 49.792 111.112 48.512C109.864 47.2 109.24 45.376 109.24 43.04C109.24 39.392 110.136 36.528 111.928 34.448C113.72 32.368 116.04 31.328 118.888 31.328C121.224 31.328 122.776 32.432 123.544 34.64C123.704 33.68 123.88 32.72 124.072 31.76C126.44 31.76 128.2 31.664 129.352 31.472L129.976 31.328L126.664 49.472C127.624 49.376 128.424 48.928 129.064 48.128L129.784 48.704C128.824 49.856 127.624 50.432 126.184 50.432ZM114.664 45.488C114.664 46.928 114.84 47.936 115.192 48.512C115.576 49.056 116.152 49.328 116.92 49.328C117.688 49.328 118.472 48.912 119.272 48.08C120.328 46.992 121.176 45.616 121.816 43.952C121.912 43.536 122.088 42.544 122.344 40.976C122.632 39.376 122.872 38.064 123.064 37.04C122.968 35.824 122.632 34.768 122.056 33.872C121.48 32.976 120.76 32.528 119.896 32.528C118.328 32.528 117.064 33.936 116.104 36.752C115.144 39.536 114.664 42.448 114.664 45.488ZM135.466 31.76L136.762 24.656C139.13 24.656 140.89 24.56 142.042 24.368L142.666 24.224C142.218 26.464 141.722 28.976 141.178 31.76H147.13L147.034 32.624H141.034C139.434 40.88 138.634 45.856 138.634 47.552C138.634 48.576 139.178 49.088 140.266 49.088C141.354 49.088 142.346 48.4 143.242 47.024C144.138 45.648 144.778 44.16 145.162 42.56L146.026 42.848C144.842 47.904 142.394 50.432 138.682 50.432C137.146 50.432 135.866 50.016 134.842 49.184C133.818 48.32 133.306 47.136 133.306 45.632C133.306 44.096 133.962 39.76 135.274 32.624H132.922L133.018 31.76H135.466ZM165.714 50.432C163.25 50.432 161.378 49.824 160.098 48.608C158.818 47.36 158.178 45.808 158.178 43.952C158.178 42.064 158.338 40.464 158.658 39.152C159.01 37.808 159.57 36.528 160.338 35.312C161.106 34.064 162.258 33.088 163.794 32.384C165.362 31.68 167.298 31.328 169.602 31.328C171.938 31.328 173.746 31.952 175.026 33.2C176.338 34.416 176.994 36.096 176.994 38.24C176.994 41.888 176.018 44.832 174.066 47.072C172.146 49.312 169.362 50.432 165.714 50.432ZM163.602 45.488C163.602 48.048 164.338 49.328 165.81 49.328C167.314 49.328 168.642 48.048 169.794 45.488C170.978 42.896 171.57 39.824 171.57 36.272C171.57 33.584 170.834 32.24 169.362 32.24C167.922 32.24 166.594 33.472 165.378 35.936C164.194 38.368 163.602 41.552 163.602 45.488ZM182.341 31.76L183.637 24.656C186.005 24.656 187.765 24.56 188.917 24.368L189.541 24.224C189.093 26.464 188.597 28.976 188.053 31.76H194.005L193.909 32.624H187.909C186.309 40.88 185.509 45.856 185.509 47.552C185.509 48.576 186.053 49.088 187.141 49.088C188.229 49.088 189.221 48.4 190.117 47.024C191.013 45.648 191.653 44.16 192.037 42.56L192.901 42.848C191.717 47.904 189.269 50.432 185.557 50.432C184.021 50.432 182.741 50.016 181.717 49.184C180.693 48.32 180.181 47.136 180.181 45.632C180.181 44.096 180.837 39.76 182.149 32.624H179.797L179.893 31.76H182.341ZM212.834 49.472C213.602 49.472 214.402 49.024 215.234 48.128L215.954 48.704C215.73 49.152 215.234 49.552 214.466 49.904C213.698 50.256 212.85 50.432 211.922 50.432C209.01 50.432 207.554 49.12 207.554 46.496C207.554 45.376 207.842 43.376 208.418 40.496C208.994 37.616 209.282 35.728 209.282 34.832C209.282 33.456 208.626 32.768 207.314 32.768C206.226 32.768 205.17 33.504 204.146 34.976C203.154 36.448 202.338 38.448 201.698 40.976L200.114 50H194.354L199.682 19.856C198.722 19.952 197.922 20.4 197.282 21.2L196.562 20.624C197.522 19.472 198.722 18.896 200.162 18.896C201.634 18.896 202.77 19.264 203.57 20C204.37 20.736 204.77 21.776 204.77 23.12C204.77 23.376 204.738 23.792 204.674 24.368L202.658 35.744C203.97 32.8 206.002 31.328 208.754 31.328C210.642 31.328 212.114 31.872 213.17 32.96C214.226 34.016 214.754 35.488 214.754 37.376C214.754 38.368 214.45 40.288 213.842 43.136C213.234 45.952 212.898 48.064 212.834 49.472ZM228.593 31.328C232.657 31.328 234.689 32.944 234.689 36.176C234.689 38.192 233.729 39.728 231.809 40.784C229.921 41.808 227.217 42.336 223.697 42.368C223.633 43.52 223.601 44.432 223.601 45.104C223.601 46.544 223.921 47.616 224.561 48.32C225.233 48.992 226.065 49.328 227.057 49.328C228.049 49.328 228.945 49.136 229.745 48.752C230.577 48.368 231.233 47.92 231.713 47.408C232.193 46.864 232.609 46.304 232.961 45.728C233.601 44.672 233.921 44 233.921 43.712L234.785 44.096C234.689 44.608 234.401 45.296 233.921 46.16C233.441 46.992 232.913 47.68 232.337 48.224C231.761 48.768 230.913 49.28 229.793 49.76C228.673 50.208 227.425 50.432 226.049 50.432C223.457 50.432 221.489 49.824 220.145 48.608C218.833 47.36 218.177 45.664 218.177 43.52C218.177 39.712 219.121 36.736 221.009 34.592C222.897 32.416 225.425 31.328 228.593 31.328ZM233.489 36.176C233.489 35.12 233.169 34.256 232.529 33.584C231.921 32.88 230.993 32.528 229.745 32.528C228.529 32.528 227.329 33.264 226.145 34.736C224.993 36.208 224.225 38.384 223.841 41.264C230.273 41.232 233.489 39.536 233.489 36.176ZM237.591 33.056C238.551 31.904 239.751 31.328 241.191 31.328C242.663 31.328 243.799 31.696 244.599 32.432C245.399 33.168 245.799 34.208 245.799 35.552V35.84C247.239 32.832 249.111 31.328 251.415 31.328C253.879 31.328 255.111 32.608 255.111 35.168C255.111 36.224 254.759 37.344 254.055 38.528C253.351 39.712 252.647 40.848 251.943 41.936C251.239 42.992 250.887 43.936 250.887 44.768H249.735C249.735 43.584 250.423 41.984 251.799 39.968C253.175 37.952 253.863 36.4 253.863 35.312C253.863 34.192 253.639 33.44 253.191 33.056C252.775 32.64 252.135 32.432 251.271 32.432C250.439 32.432 249.607 32.8 248.775 33.536C247.975 34.272 247.303 35.2 246.759 36.32C245.895 37.984 245.319 39.344 245.031 40.4V40.448L243.303 50H237.543L240.711 32.288C239.751 32.384 238.951 32.832 238.311 33.632L237.591 33.056ZM275.918 50.384C274.446 50.384 273.278 50.048 272.414 49.376L270.974 57.104H265.262L269.774 31.952C268.814 32.048 268.014 32.496 267.374 33.296L266.654 32.72C267.614 31.568 268.798 30.992 270.206 30.992C271.646 30.992 272.766 31.344 273.566 32.048C274.366 32.72 274.798 33.68 274.862 34.928C276.27 32.528 278.062 31.328 280.238 31.328C282.414 31.328 284.078 31.952 285.23 33.2C286.382 34.416 286.958 36.096 286.958 38.24C286.958 42.016 285.934 44.992 283.886 47.168C281.838 49.312 279.182 50.384 275.918 50.384ZM272.75 47.456C273.294 48.672 274.318 49.28 275.822 49.28C277.358 49.28 278.686 48 279.806 45.44C280.958 42.88 281.534 39.824 281.534 36.272C281.534 34.8 281.374 33.792 281.054 33.248C280.766 32.704 280.222 32.432 279.422 32.432C278.622 32.432 277.79 32.912 276.926 33.872C276.094 34.832 275.486 35.744 275.102 36.608C274.718 37.44 274.526 37.92 274.526 38.048H274.478L272.75 47.456ZM299.655 31.328C303.719 31.328 305.751 32.944 305.751 36.176C305.751 38.192 304.791 39.728 302.871 40.784C300.983 41.808 298.279 42.336 294.759 42.368C294.695 43.52 294.663 44.432 294.663 45.104C294.663 46.544 294.983 47.616 295.623 48.32C296.295 48.992 297.127 49.328 298.119 49.328C299.111 49.328 300.007 49.136 300.807 48.752C301.639 48.368 302.295 47.92 302.775 47.408C303.255 46.864 303.671 46.304 304.023 45.728C304.663 44.672 304.983 44 304.983 43.712L305.847 44.096C305.751 44.608 305.463 45.296 304.983 46.16C304.503 46.992 303.975 47.68 303.399 48.224C302.823 48.768 301.975 49.28 300.855 49.76C299.735 50.208 298.487 50.432 297.111 50.432C294.519 50.432 292.551 49.824 291.207 48.608C289.895 47.36 289.239 45.664 289.239 43.52C289.239 39.712 290.183 36.736 292.071 34.592C293.959 32.416 296.487 31.328 299.655 31.328ZM304.551 36.176C304.551 35.12 304.231 34.256 303.591 33.584C302.983 32.88 302.055 32.528 300.807 32.528C299.591 32.528 298.391 33.264 297.207 34.736C296.055 36.208 295.287 38.384 294.903 41.264C301.335 41.232 304.551 39.536 304.551 36.176ZM315.901 50.432C313.437 50.432 311.565 49.824 310.285 48.608C309.005 47.36 308.365 45.808 308.365 43.952C308.365 42.064 308.525 40.464 308.845 39.152C309.197 37.808 309.757 36.528 310.525 35.312C311.293 34.064 312.445 33.088 313.981 32.384C315.549 31.68 317.485 31.328 319.789 31.328C322.125 31.328 323.933 31.952 325.213 33.2C326.525 34.416 327.181 36.096 327.181 38.24C327.181 41.888 326.205 44.832 324.253 47.072C322.333 49.312 319.549 50.432 315.901 50.432ZM313.789 45.488C313.789 48.048 314.525 49.328 315.997 49.328C317.501 49.328 318.829 48.048 319.981 45.488C321.165 42.896 321.757 39.824 321.757 36.272C321.757 33.584 321.021 32.24 319.549 32.24C318.109 32.24 316.781 33.472 315.565 35.936C314.381 38.368 313.789 41.552 313.789 45.488ZM339.153 50.384C337.681 50.384 336.513 50.048 335.649 49.376L334.209 57.104H328.497L333.009 31.952C332.049 32.048 331.249 32.496 330.609 33.296L329.889 32.72C330.849 31.568 332.033 30.992 333.441 30.992C334.881 30.992 336.001 31.344 336.801 32.048C337.601 32.72 338.033 33.68 338.097 34.928C339.505 32.528 341.297 31.328 343.473 31.328C345.649 31.328 347.313 31.952 348.465 33.2C349.617 34.416 350.193 36.096 350.193 38.24C350.193 42.016 349.169 44.992 347.121 47.168C345.073 49.312 342.417 50.384 339.153 50.384ZM335.985 47.456C336.529 48.672 337.553 49.28 339.057 49.28C340.593 49.28 341.921 48 343.041 45.44C344.193 42.88 344.769 39.824 344.769 36.272C344.769 34.8 344.609 33.792 344.289 33.248C344.001 32.704 343.457 32.432 342.657 32.432C341.857 32.432 341.025 32.912 340.161 33.872C339.329 34.832 338.721 35.744 338.337 36.608C337.953 37.44 337.761 37.92 337.761 38.048H337.713L335.985 47.456ZM361.305 48.272C360.889 48.816 360.313 49.312 359.577 49.76C358.873 50.208 357.945 50.432 356.793 50.432C355.641 50.432 354.665 50.064 353.865 49.328C353.065 48.592 352.665 47.552 352.665 46.208C352.665 45.952 352.697 45.536 352.761 44.96L355.881 27.68C356.457 24.512 357.241 22.256 358.233 20.912C359.257 19.568 360.601 18.896 362.265 18.896C363.417 18.896 364.361 19.328 365.097 20.192C365.865 21.056 366.249 22.368 366.249 24.128C366.249 25.888 365.561 28.4 364.185 31.664C362.841 34.928 362.169 37.312 362.169 38.816H361.305C361.305 37.12 361.977 34.704 363.321 31.568C364.665 28.4 365.337 25.872 365.337 23.984C365.337 22.832 365.065 21.84 364.521 21.008C364.009 20.176 363.369 19.76 362.601 19.76C362.569 20.592 362.009 24.336 360.921 30.992C359.865 37.616 358.809 43.776 357.753 49.472C358.649 49.472 359.481 49.008 360.249 48.08C361.017 47.152 361.561 46.224 361.881 45.296L362.409 43.856L363.273 44.24C363.177 44.688 362.921 45.344 362.505 46.208C362.121 47.04 361.721 47.728 361.305 48.272ZM376.249 31.328C380.313 31.328 382.345 32.944 382.345 36.176C382.345 38.192 381.385 39.728 379.465 40.784C377.577 41.808 374.873 42.336 371.353 42.368C371.289 43.52 371.257 44.432 371.257 45.104C371.257 46.544 371.577 47.616 372.217 48.32C372.889 48.992 373.721 49.328 374.713 49.328C375.705 49.328 376.601 49.136 377.401 48.752C378.233 48.368 378.889 47.92 379.369 47.408C379.849 46.864 380.265 46.304 380.617 45.728C381.257 44.672 381.577 44 381.577 43.712L382.441 44.096C382.345 44.608 382.057 45.296 381.577 46.16C381.097 46.992 380.569 47.68 379.993 48.224C379.417 48.768 378.569 49.28 377.449 49.76C376.329 50.208 375.081 50.432 373.705 50.432C371.113 50.432 369.145 49.824 367.801 48.608C366.489 47.36 365.833 45.664 365.833 43.52C365.833 39.712 366.777 36.736 368.665 34.592C370.553 32.416 373.081 31.328 376.249 31.328ZM381.145 36.176C381.145 35.12 380.825 34.256 380.185 33.584C379.577 32.88 378.649 32.528 377.401 32.528C376.185 32.528 374.985 33.264 373.801 34.736C372.649 36.208 371.881 38.384 371.497 41.264C377.929 41.232 381.145 39.536 381.145 36.176ZM412.122 50.432C409.306 50.432 407.77 49.2 407.514 46.736C406.106 49.2 404.33 50.432 402.186 50.432C400.042 50.432 398.33 49.792 397.05 48.512C395.802 47.2 395.178 45.376 395.178 43.04C395.178 39.392 396.074 36.528 397.866 34.448C399.658 32.368 401.978 31.328 404.826 31.328C407.162 31.328 408.714 32.432 409.482 34.64C409.642 33.68 409.818 32.72 410.01 31.76C412.378 31.76 414.138 31.664 415.29 31.472L415.914 31.328L412.602 49.472C413.562 49.376 414.362 48.928 415.002 48.128L415.722 48.704C414.762 49.856 413.562 50.432 412.122 50.432ZM400.602 45.488C400.602 46.928 400.778 47.936 401.13 48.512C401.514 49.056 402.09 49.328 402.858 49.328C403.626 49.328 404.41 48.912 405.21 48.08C406.266 46.992 407.114 45.616 407.754 43.952C407.85 43.536 408.026 42.544 408.282 40.976C408.57 39.376 408.81 38.064 409.002 37.04C408.906 35.824 408.57 34.768 407.994 33.872C407.418 32.976 406.698 32.528 405.834 32.528C404.266 32.528 403.002 33.936 402.042 36.752C401.082 39.536 400.602 42.448 400.602 45.488ZM422.94 49.184C426.108 49.184 427.692 46.848 427.692 42.176C427.692 41.024 427.516 39.664 427.164 38.096C426.844 36.528 426.652 35.552 426.588 35.168C424.636 37.184 422.444 38.4 420.012 38.816V37.664C422.316 37.152 424.476 35.84 426.492 33.728V33.536C426.492 32.768 426.604 32.016 426.828 31.28C427.052 30.544 427.276 30 427.5 29.648L427.836 29.12H428.988C428.988 30.528 429.212 31.824 429.66 33.008C430.108 34.16 430.604 35.104 431.148 35.84C431.692 36.544 432.188 37.488 432.636 38.672C433.084 39.824 433.308 41.104 433.308 42.512C433.308 44.784 432.444 46.672 430.716 48.176C429.02 49.68 426.972 50.432 424.572 50.432C422.172 50.432 420.348 49.888 419.1 48.8C417.884 47.712 417.276 46.464 417.276 45.056C417.276 43.616 417.628 42.592 418.332 41.984C419.036 41.344 419.868 41.024 420.828 41.024C421.788 41.024 422.572 41.344 423.18 41.984C423.82 42.592 424.14 43.392 424.14 44.384C424.14 45.344 423.836 46.16 423.228 46.832C422.62 47.504 421.836 47.84 420.876 47.84C420.46 47.84 420.028 47.776 419.58 47.648C420.284 48.672 421.404 49.184 422.94 49.184ZM443.012 40.736L441.284 50H435.572L440.996 19.856C440.036 19.952 439.236 20.4 438.596 21.2L437.876 20.624C438.836 19.472 440.036 18.896 441.476 18.896C442.948 18.896 444.084 19.264 444.884 20C445.684 20.736 446.084 21.776 446.084 23.12C446.084 23.376 446.052 23.792 445.988 24.368C445.252 28.432 444.452 32.816 443.588 37.52C444.388 35.568 445.54 34.048 447.044 32.96C448.548 31.872 450.148 31.328 451.844 31.328C453.54 31.328 454.724 31.664 455.396 32.336C456.1 33.008 456.452 33.856 456.452 34.88C456.452 35.872 456.148 36.688 455.54 37.328C454.932 37.968 454.132 38.288 453.14 38.288C452.18 38.288 451.428 38.016 450.884 37.472C450.372 36.896 450.116 36.064 450.116 34.976C450.116 33.856 450.5 33.008 451.268 32.432C448.196 32.784 445.748 35.056 443.924 39.248C444.372 39.184 444.756 39.152 445.076 39.152C446.772 39.152 448.1 39.488 449.06 40.16C450.052 40.832 450.692 41.664 450.98 42.656C451.268 43.616 451.476 44.592 451.604 45.584C451.732 46.544 451.94 47.36 452.228 48.032C452.516 48.704 453.028 49.04 453.764 49.04C454.5 49.04 455.076 48.736 455.492 48.128L456.212 48.704C455.988 49.152 455.492 49.552 454.724 49.904C453.956 50.256 452.964 50.432 451.748 50.432C450.564 50.432 449.508 50.128 448.58 49.52C447.684 48.912 447.06 48.16 446.708 47.264C446.356 46.336 446.068 45.424 445.844 44.528C445.236 42.224 444.292 40.96 443.012 40.736Z" fill="white"/>
</svg>
