PWD C:\Users\juraj\Desktop\Juraj\Unige\Cours\Master\Intelligence Artificielle\group-b-projet-ia\Rapport\rapport_partie_nn
INPUT C:\Users\juraj\AppData\Local\MiKTeX\miktex\data\le\pdftex\pdflatex.fmt
INPUT 5.tex
OUTPUT 5.log
INPUT C:\Program Files\MiKTeX\fonts\tfm\public\cm\cmbx10.tfm
OUTPUT 5.pdf
INPUT C:\Users\juraj\AppData\Local\MiKTeX\pdftex\config\pdftex.map
