# Fdb version 3
["pdflatex"] 1642949454 "commands.tex" "commands.pdf" "commands" 1642949454
  "C:/Program Files/MiKTeX/fonts/tfm/public/cm/cmbx10.tfm" 1136765053 1328 c834bbb027764024c09d3d2bf908b5f0 ""
  "C:/Users/juraj/AppData/Local/MiKTeX/miktex/data/le/pdftex/pdflatex.fmt" 1618909369 9397587 7e522b7a474a3b3021dcb2fced63f5a2 ""
  "commands.aux" 1642867468 9 a94a2480d3289e625eea47cd1b285758 ""
  "commands.tex" 1642949453 2387 66aece04f4b48d6211b912d5ac6a6ccb ""
  (generated)
  "commands.pdf"
  "commands.log"
