\relax 
\providecommand\babel@aux[2]{}
\@nameuse{bbl@beforestart}
\babel@aux{english}{}
\@input{week1.aux}
\@input{week2.aux}
\@input{week3.aux}
\@input{week4.aux}
\@input{week5.aux}
\@input{week6.aux}
\@input{week7.aux}
\@input{week8.aux}
\@input{week9.aux}
\@input{week10.aux}
\@input{week11.aux}
\@input{week12.aux}
\@input{week13.aux}
\@input{week14.aux}
\gdef \@abspage@last{15}
