{
  "baseHref": "/",
  "theme": "hedera",
  "appTitle":"hedera Portal",
  "production": true,
  "isDemoMode": false,
  "admin": "http://%DEMO_DOMAIN_NAME%/admin",
  "clientId": "hedera-portal",
  "dummyClientSecret": "hedera-portal-p",
  "showDebugInformation": false,
  "redirectUrl": "http://%DEMO_DOMAIN_NAME%",
  "maintenanceMode": false,
  "ribbonEnabled": true,
  "ribbonText": "Demo",
  "requireHttps": false,
  "ssrUrlModuleRewrite": {
    "http://%DEMO_DOMAIN_NAME%/admin": "http://hedera-administration:22222/admin",
    "http://%DEMO_DOMAIN_NAME%/ingest": "http://hedera-ingestion:22223/ingest",
    "http://%DEMO_DOMAIN_NAME%/ontologies": "http://hedera-accession:22224/ontologies"
  }
}
