[{
  "_id": {
    "$oid": "6139c1d9403b8d1e851ad5b2"
  },
  "name": "conf1",
  "localip": "192.168.1.79",
 "localport" : "10001",
  "neighbours": [
     "192.168.1.79:10002",
  ],
  "_class": "com.sapereapi.model.Config"
}]