^C:\USERS\ROMAN\DOCUMENTS\PRINTEMPS 2024\PROJET NTIC\DEMOCRATIC\DEMOCRATIC\BUILD\WINDOWS\X64\CMAKEFILES\2FB134A8D302877376B6BA23539AC46B\GENERATE.STAMP.RULE
setlocal
"C:\Program Files\Microsoft Visual Studio\2022\Community\Common7\IDE\CommonExtensions\Microsoft\CMake\CMake\bin\cmake.exe" "-SC:/Users/Roman/Documents/PRINTEMPS 2024/PROJET NTIC/Democratic/democratic/windows" "-BC:/Users/Roman/Documents/PRINTEMPS 2024/PROJET NTIC/Democratic/democratic/build/windows/x64" --check-stamp-list CMakeFiles/generate.stamp.list --vs-solution-file "C:/Users/Roman/Documents/PRINTEMPS 2024/PROJET NTIC/Democratic/democratic/build/windows/x64/democratic.sln"
if %errorlevel% neq 0 goto :cmEnd
:cmEnd
endlocal & call :cmErrorLevel %errorlevel% & goto :cmDone
:cmErrorLevel
exit /b %1
:cmDone
if %errorlevel% neq 0 goto :VCEnd
