^C:\USERS\ROMAN\DOCUMENTS\PRINTEMPS 2024\PROJET NTIC\DEMOCRATIC\DEMOCRATIC\BUILD\WINDOWS\X64\FLUTTER\FLUTTER_WRAPPER_PLUGIN.DIR\DEBUG\CORE_IMPLEMENTATIONS.OBJ|C:\USERS\ROMAN\DOCUMENTS\PRINTEMPS 2024\PROJET NTIC\DEMOCRATIC\DEMOCRATIC\BUILD\WINDOWS\X64\FLUTTER\FLUTTER_WRAPPER_PLUGIN.DIR\DEBUG\PLUGIN_REGISTRAR.OBJ|C:\USERS\ROMAN\DOCUMENTS\PRINTEMPS 2024\PROJET NTIC\DEMOCRATIC\DEMOCRATIC\BUILD\WINDOWS\X64\FLUTTER\FLUTTER_WRAPPER_PLUGIN.DIR\DEBUG\STANDARD_CODEC.OBJ
C:\USERS\ROMAN\DOCUMENTS\PRINTEMPS 2024\PROJET NTIC\DEMOCRATIC\DEMOCRATIC\BUILD\WINDOWS\X64\FLUTTER\FLUTTER_WRAPPER_PLUGIN.DIR\DEBUG\CORE_IMPLEMENTATIONS.OBJ
C:\WINDOWS\SYSTEM32\TZRES.DLL
C:\USERS\ROMAN\DOCUMENTS\PRINTEMPS 2024\PROJET NTIC\DEMOCRATIC\DEMOCRATIC\BUILD\WINDOWS\X64\FLUTTER\FLUTTER_WRAPPER_PLUGIN.DIR\DEBUG\STANDARD_CODEC.OBJ
C:\USERS\ROMAN\DOCUMENTS\PRINTEMPS 2024\PROJET NTIC\DEMOCRATIC\DEMOCRATIC\BUILD\WINDOWS\X64\FLUTTER\FLUTTER_WRAPPER_PLUGIN.DIR\DEBUG\PLUGIN_REGISTRAR.OBJ
C:\WINDOWS\GLOBALIZATION\SORTING\SORTDEFAULT.NLS
