C:\Users\Roman\Documents\PRINTEMPS 2024\PROJET NTIC\Democratic\democratic\windows\runner\flutter_window.cpp;C:\Users\Roman\Documents\PRINTEMPS 2024\PROJET NTIC\Democratic\democratic\build\windows\x64\runner\democratic.dir\Debug\flutter_window.obj
C:\Users\Roman\Documents\PRINTEMPS 2024\PROJET NTIC\Democratic\democratic\windows\runner\main.cpp;C:\Users\Roman\Documents\PRINTEMPS 2024\PROJET NTIC\Democratic\democratic\build\windows\x64\runner\democratic.dir\Debug\main.obj
C:\Users\Roman\Documents\PRINTEMPS 2024\PROJET NTIC\Democratic\democratic\windows\runner\utils.cpp;C:\Users\Roman\Documents\PRINTEMPS 2024\PROJET NTIC\Democratic\democratic\build\windows\x64\runner\democratic.dir\Debug\utils.obj
C:\Users\Roman\Documents\PRINTEMPS 2024\PROJET NTIC\Democratic\democratic\windows\runner\win32_window.cpp;C:\Users\Roman\Documents\PRINTEMPS 2024\PROJET NTIC\Democratic\democratic\build\windows\x64\runner\democratic.dir\Debug\win32_window.obj
C:\Users\Roman\Documents\PRINTEMPS 2024\PROJET NTIC\Democratic\democratic\windows\flutter\generated_plugin_registrant.cc;C:\Users\Roman\Documents\PRINTEMPS 2024\PROJET NTIC\Democratic\democratic\build\windows\x64\runner\democratic.dir\Debug\generated_plugin_registrant.obj
