^C:\USERS\ROMAN\DOCUMENTS\PRINTEMPS 2024\PROJET NTIC\DEMOCRATIC\DEMOCRATIC\WINDOWS\FLUTTER\GENERATED_PLUGIN_REGISTRANT.CC|C:\USERS\ROMAN\DOCUMENTS\PRINTEMPS 2024\PROJET NTIC\DEMOCRATIC\DEMOCRATIC\WINDOWS\RUNNER\FLUTTER_WINDOW.CPP|C:\USERS\ROMAN\DOCUMENTS\PRINTEMPS 2024\PROJET NTIC\DEMOCRATIC\DEMOCRATIC\WINDOWS\RUNNER\MAIN.CPP|C:\USERS\ROMAN\DOCUMENTS\PRINTEMPS 2024\PROJET NTIC\DEMOCRATIC\DEMOCRATIC\WINDOWS\RUNNER\UTILS.CPP|C:\USERS\ROMAN\DOCUMENTS\PRINTEMPS 2024\PROJET NTIC\DEMOCRATIC\DEMOCRATIC\WINDOWS\RUNNER\WIN32_WINDOW.CPP
C:\USERS\ROMAN\DOCUMENTS\PRINTEMPS 2024\PROJET NTIC\DEMOCRATIC\DEMOCRATIC\BUILD\WINDOWS\X64\RUNNER\DEMOCRATIC.DIR\DEBUG\VC143.PDB
C:\USERS\ROMAN\DOCUMENTS\PRINTEMPS 2024\PROJET NTIC\DEMOCRATIC\DEMOCRATIC\BUILD\WINDOWS\X64\RUNNER\DEMOCRATIC.DIR\DEBUG\GENERATED_PLUGIN_REGISTRANT.OBJ
C:\USERS\ROMAN\DOCUMENTS\PRINTEMPS 2024\PROJET NTIC\DEMOCRATIC\DEMOCRATIC\BUILD\WINDOWS\X64\RUNNER\DEMOCRATIC.DIR\DEBUG\WIN32_WINDOW.OBJ
C:\USERS\ROMAN\DOCUMENTS\PRINTEMPS 2024\PROJET NTIC\DEMOCRATIC\DEMOCRATIC\BUILD\WINDOWS\X64\RUNNER\DEMOCRATIC.DIR\DEBUG\UTILS.OBJ
C:\USERS\ROMAN\DOCUMENTS\PRINTEMPS 2024\PROJET NTIC\DEMOCRATIC\DEMOCRATIC\BUILD\WINDOWS\X64\RUNNER\DEMOCRATIC.DIR\DEBUG\MAIN.OBJ
C:\USERS\ROMAN\DOCUMENTS\PRINTEMPS 2024\PROJET NTIC\DEMOCRATIC\DEMOCRATIC\BUILD\WINDOWS\X64\RUNNER\DEMOCRATIC.DIR\DEBUG\FLUTTER_WINDOW.OBJ
^C:\USERS\ROMAN\DOCUMENTS\PRINTEMPS 2024\PROJET NTIC\DEMOCRATIC\DEMOCRATIC\WINDOWS\RUNNER\FLUTTER_WINDOW.CPP
C:\USERS\ROMAN\DOCUMENTS\PRINTEMPS 2024\PROJET NTIC\DEMOCRATIC\DEMOCRATIC\BUILD\WINDOWS\X64\RUNNER\DEMOCRATIC.DIR\DEBUG\VC143.PDB
^C:\USERS\ROMAN\DOCUMENTS\PRINTEMPS 2024\PROJET NTIC\DEMOCRATIC\DEMOCRATIC\WINDOWS\RUNNER\MAIN.CPP
C:\USERS\ROMAN\DOCUMENTS\PRINTEMPS 2024\PROJET NTIC\DEMOCRATIC\DEMOCRATIC\BUILD\WINDOWS\X64\RUNNER\DEMOCRATIC.DIR\DEBUG\VC143.PDB
^C:\USERS\ROMAN\DOCUMENTS\PRINTEMPS 2024\PROJET NTIC\DEMOCRATIC\DEMOCRATIC\WINDOWS\RUNNER\UTILS.CPP
C:\USERS\ROMAN\DOCUMENTS\PRINTEMPS 2024\PROJET NTIC\DEMOCRATIC\DEMOCRATIC\BUILD\WINDOWS\X64\RUNNER\DEMOCRATIC.DIR\DEBUG\VC143.PDB
^C:\USERS\ROMAN\DOCUMENTS\PRINTEMPS 2024\PROJET NTIC\DEMOCRATIC\DEMOCRATIC\WINDOWS\RUNNER\WIN32_WINDOW.CPP
C:\USERS\ROMAN\DOCUMENTS\PRINTEMPS 2024\PROJET NTIC\DEMOCRATIC\DEMOCRATIC\BUILD\WINDOWS\X64\RUNNER\DEMOCRATIC.DIR\DEBUG\VC143.PDB
^C:\USERS\ROMAN\DOCUMENTS\PRINTEMPS 2024\PROJET NTIC\DEMOCRATIC\DEMOCRATIC\WINDOWS\FLUTTER\GENERATED_PLUGIN_REGISTRANT.CC
C:\USERS\ROMAN\DOCUMENTS\PRINTEMPS 2024\PROJET NTIC\DEMOCRATIC\DEMOCRATIC\BUILD\WINDOWS\X64\RUNNER\DEMOCRATIC.DIR\DEBUG\VC143.PDB
