%YAML 1.1
%TAG !u! tag:unity3d.com,2011:
--- !u!1045 &1
EditorBuildSettings:
  m_ObjectHideFlags: 0
  serializedVersion: 2
  m_Scenes:
  - enabled: 1
    path: Assets/_Main/Scenes/Main Menu.unity
    guid: 4b0f6bbb6d7d642f3852d4cf1cbac2f7
  - enabled: 1
    path: Assets/_Main/Scenes/VisualNovel.unity
    guid: 85b6135164e1047cd825391a3f78cab8
  m_configObjects: {}
