{
  "player_build_data": [
    {
      "type": "playerBuildTimingData",
      "msg": {
        "build_event_id": "8122a98221a284349a07f0b3d1fb1b27",
        "build_player": 39170,
        "preprocess_player": 306,
        "produce_player_script_assemblies": 16358,
        "build_scripts_dlls": 538,
        "writing_asset_files": 3881,
        "postprocess_built_player": 11040,
        "node_summary_table": [
          {
            "name": "Csc",
            "duration": 1055
          },
          {
            "name": "Csc",
            "duration": 223
          },
          {
            "name": "Csc",
            "duration": 691
          },
          {
            "name": "Csc",
            "duration": 736
          },
          {
            "name": "Csc",
            "duration": 1130
          },
          {
            "name": "Csc",
            "duration": 1103
          },
          {
            "name": "Csc",
            "duration": 442
          },
          {
            "name": "Csc",
            "duration": 685
          },
          {
            "name": "Csc",
            "duration": 2259
          },
          {
            "name": "Csc",
            "duration": 249
          },
          {
            "name": "Csc",
            "duration": 465
          },
          {
            "name": "Csc",
            "duration": 440
          },
          {
            "name": "Csc",
            "duration": 1591
          },
          {
            "name": "Csc",
            "duration": 193
          },
          {
            "name": "Csc",
            "duration": 999
          },
          {
            "name": "Csc",
            "duration": 3366
          },
          {
            "name": "Csc",
            "duration": 875
          },
          {
            "name": "Csc",
            "duration": 330
          },
          {
            "name": "Csc",
            "duration": 1451
          },
          {
            "name": "Csc",
            "duration": 553
          },
          {
            "name": "Csc",
            "duration": 307
          },
          {
            "name": "Csc",
            "duration": 337
          },
          {
            "name": "Csc",
            "duration": 1247
          },
          {
            "name": "Csc",
            "duration": 1223
          },
          {
            "name": "Csc",
            "duration": 136
          },
          {
            "name": "Csc",
            "duration": 105
          },
          {
            "name": "Csc",
            "duration": 234
          },
          {
            "name": "Csc",
            "duration": 4046
          }
        ]
      },
      "version": 1
    }
  ]
}