%YAML 1.1
%TAG !u! tag:unity3d.com,2011:
--- !u!114 &11400000
MonoBehaviour:
  m_ObjectHideFlags: 0
  m_CorrespondingSourceObject: {fileID: 0}
  m_PrefabInstance: {fileID: 0}
  m_PrefabAsset: {fileID: 0}
  m_GameObject: {fileID: 0}
  m_Enabled: 1
  m_EditorHideFlags: 0
  m_Script: {fileID: 11500000, guid: 58229d41c24a7fb4aafd097ab43bcc2a, type: 3}
  m_Name: triste.exp3
  m_EditorClassIdentifier: 
  Type: Live2D Expression
  FadeInTime: 1
  FadeOutTime: 1
  Parameters:
  - Id: ParamEyeLOpen
    Value: 0
    Blend: 1
  - Id: ParamEyeLSmile
    Value: 0
    Blend: 1
  - Id: ParamEyeLForm
    Value: -2
    Blend: 1
  - Id: ParamEyeROpen
    Value: 0
    Blend: 1
  - Id: ParamEyeRSmile
    Value: 0
    Blend: 1
  - Id: ParamEyeRForm
    Value: -2
    Blend: 1
  - Id: ParamBrowLY
    Value: 0
    Blend: 1
  - Id: ParamBrowRY
    Value: 0
    Blend: 1
  - Id: ParamBrowLX
    Value: 0
    Blend: 1
  - Id: ParamBrowRX
    Value: 0
    Blend: 1
  - Id: ParamBrowLAngle
    Value: 0
    Blend: 1
  - Id: ParamBrowRAngle
    Value: 0
    Blend: 1
  - Id: ParamBrowLForm
    Value: -1
    Blend: 1
  - Id: ParamBrowLForm2
    Value: 0
    Blend: 1
  - Id: ParamBrowRForm
    Value: -1
    Blend: 1
  - Id: ParamBrowRForm2
    Value: 0
    Blend: 1
  - Id: ParamMouthForm
    Value: -1
    Blend: 1
  - Id: ParamMouthOpenY
    Value: 0
    Blend: 1
  - Id: ParamMouthForm2
    Value: 0
    Blend: 1
  - Id: ParamTeethOn
    Value: 0
    Blend: 1
  - Id: ParamCheek
    Value: 0
    Blend: 1
  - Id: ParamGlassUD
    Value: 0
    Blend: 1
  - Id: ParamGrassWhite
    Value: 0
    Blend: 1
  - Id: ParamGrassHighlight
    Value: 0
    Blend: 1
  - Id: ParamGrassHighlightMove
    Value: 0
    Blend: 1
  - Id: ParamEyeBallForm
    Value: 0
    Blend: 1
