%YAML 1.1
%TAG !u! tag:unity3d.com,2011:
--- !u!114 &11400000
MonoBehaviour:
  m_ObjectHideFlags: 0
  m_CorrespondingSourceObject: {fileID: 0}
  m_PrefabInstance: {fileID: 0}
  m_PrefabAsset: {fileID: 0}
  m_GameObject: {fileID: 0}
  m_Enabled: 1
  m_EditorHideFlags: 0
  m_Script: {fileID: 11500000, guid: 6ca502eaae8964d94bc8ce8ac1395142, type: 3}
  m_Name: Dialogue System Configuration
  m_EditorClassIdentifier: 
  characterConfigurationAsset: {fileID: 11400000, guid: 52ff56bb3f9ad42da9031bfe61c45b85,
    type: 2}
  defaultTextColor: {r: 1, g: 1, b: 1, a: 1}
  defaultFont: {fileID: 11400000, guid: 8f586378b4e144a9851e7b34d9b748ee, type: 2}
  defaultDialogueFontSize: 40
  defaultNameFontSize: 45
