%YAML 1.1
%TAG !u! tag:unity3d.com,2011:
--- !u!114 &11400000
MonoBehaviour:
  m_ObjectHideFlags: 0
  m_CorrespondingSourceObject: {fileID: 0}
  m_PrefabInstance: {fileID: 0}
  m_PrefabAsset: {fileID: 0}
  m_GameObject: {fileID: 0}
  m_Enabled: 1
  m_EditorHideFlags: 0
  m_Script: {fileID: 11500000, guid: 403ae2dd693bb1d4b924f6b8d206b053, type: 3}
  m_Name: Mao.fadeMotionList
  m_EditorClassIdentifier: 
  MotionInstanceIds: 0e3a00001c3a00009c3a0000ba3a0000d8390000683a0000703a0000123a0000
  CubismFadeMotionObjects:
  - {fileID: 11400000, guid: c6a5276089e6b2c4bb2f78cca94c4ded, type: 2}
  - {fileID: 11400000, guid: a0145e27134640343b894f03870256bc, type: 2}
  - {fileID: 11400000, guid: 1087fe497bde9c041a011b91e8351197, type: 2}
  - {fileID: 11400000, guid: f4ca32b3835d37b4d9c9f1470a53dd7c, type: 2}
  - {fileID: 11400000, guid: e7f45c09065c6084181e8770154e93b8, type: 2}
  - {fileID: 11400000, guid: ebaadf16121c7a848aa91a4d7d705cc1, type: 2}
  - {fileID: 11400000, guid: cd5d32e8b5cd9d74d98c36e8068cab64, type: 2}
  - {fileID: 11400000, guid: 6adaa8abda3ba07458dea05fc12104e8, type: 2}
