﻿{
	"_class": "Map",
	"width": 20,
	"height": 15,
	"name" : "Safari Zone gate",
	"tileset" : "Inside",
	"battleback" : "",
	"autoplay_bgm" : true,
	"bgm" : "route,80,100",
	"connections" : [
	],
	"table": [[[400, 400, 400, 401, 402, 403, 400, 400, 400, 542, 542, 542, 542, 542, 542, 542, 542, 542, 542, 542], 
[408, 408, 408, 409, 410, 411, 408, 408, 408, 542, 542, 542, 542, 542, 542, 542, 542, 542, 542, 542], 
[696, 696, 696, 1092, 1094, 1093, 696, 696, 696, 542, 542, 542, 542, 542, 542, 542, 542, 542, 542, 542], 
[696, 696, 696, 1095, 1086, 1085, 696, 696, 696, 542, 542, 542, 542, 542, 542, 542, 542, 542, 542, 542], 
[696, 696, 696, 1095, 1086, 1085, 696, 696, 696, 542, 542, 542, 542, 542, 542, 542, 542, 542, 542, 542], 
[696, 696, 696, 1095, 1086, 1085, 696, 696, 696, 542, 542, 542, 542, 542, 542, 542, 542, 542, 542, 542], 
[696, 696, 696, 1095, 1086, 1085, 696, 696, 696, 542, 542, 542, 542, 542, 542, 542, 542, 542, 542, 542], 
[696, 696, 696, 1095, 1086, 1085, 696, 696, 696, 542, 542, 542, 542, 542, 542, 542, 542, 542, 542, 542], 
[542, 542, 542, 542, 542, 542, 542, 542, 542, 542, 542, 542, 542, 542, 542, 542, 542, 542, 542, 542], 
[542, 542, 542, 542, 542, 542, 542, 542, 542, 542, 542, 542, 542, 542, 542, 542, 542, 542, 542, 542], 
[542, 542, 542, 542, 542, 542, 542, 542, 542, 542, 542, 542, 542, 542, 542, 542, 542, 542, 542, 542], 
[542, 542, 542, 542, 542, 542, 542, 542, 542, 542, 542, 542, 542, 542, 542, 542, 542, 542, 542, 542], 
[542, 542, 542, 542, 542, 542, 542, 542, 542, 542, 542, 542, 542, 542, 542, 542, 542, 542, 542, 542], 
[542, 542, 542, 542, 542, 542, 542, 542, 542, 542, 542, 542, 542, 542, 542, 542, 542, 542, 542, 542], 
[542, 542, 542, 542, 542, 542, 542, 542, 542, 542, 542, 542, 542, 542, 542, 542, 542, 542, 542, 542]], 

[[0, 0, 0, 0, 0, 0, 0, 0, 0, 0, 0, 0, 0, 0, 0, 0, 0, 0, 0, 0], 
[1772, 1772, 2032, 0, 0, 0, 2032, 1772, 1772, 0, 0, 0, 0, 0, 0, 0, 0, 0, 0, 0], 
[1780, 1780, 2048, 0, 0, 0, 2048, 1780, 1780, 0, 0, 0, 0, 0, 0, 0, 0, 0, 0, 0], 
[1727, 1670, 2048, 0, 0, 0, 2048, 1670, 1727, 0, 0, 0, 0, 0, 0, 0, 0, 0, 0, 0], 
[1735, 0, 2048, 0, 0, 0, 2048, 0, 1749, 0, 0, 0, 0, 0, 0, 0, 0, 0, 0, 0], 
[1743, 0, 2048, 0, 0, 0, 2048, 0, 0, 0, 0, 0, 0, 0, 0, 0, 0, 0, 0, 0], 
[1751, 1670, 2048, 0, 0, 0, 2048, 1670, 1727, 0, 0, 0, 0, 0, 0, 0, 0, 0, 0, 0], 
[1749, 0, 2056, 1245, 1246, 1247, 2056, 0, 1749, 0, 0, 0, 0, 0, 0, 0, 0, 0, 0, 0], 
[0, 0, 0, 1253, 1254, 1255, 0, 0, 0, 0, 0, 0, 0, 0, 0, 0, 0, 0, 0, 0], 
[0, 0, 0, 0, 0, 0, 0, 0, 0, 0, 0, 0, 0, 0, 0, 0, 0, 0, 0, 0], 
[0, 0, 0, 0, 0, 0, 0, 0, 0, 0, 0, 0, 0, 0, 0, 0, 0, 0, 0, 0], 
[0, 0, 0, 0, 0, 0, 0, 0, 0, 0, 0, 0, 0, 0, 0, 0, 0, 0, 0, 0], 
[0, 0, 0, 0, 0, 0, 0, 0, 0, 0, 0, 0, 0, 0, 0, 0, 0, 0, 0, 0], 
[0, 0, 0, 0, 0, 0, 0, 0, 0, 0, 0, 0, 0, 0, 0, 0, 0, 0, 0, 0], 
[0, 0, 0, 0, 0, 0, 0, 0, 0, 0, 0, 0, 0, 0, 0, 0, 0, 0, 0, 0]], 

[[0, 0, 0, 0, 0, 0, 0, 0, 0, 0, 0, 0, 0, 0, 0, 0, 0, 0, 0, 0], 
[0, 0, 0, 0, 0, 0, 0, 0, 0, 0, 0, 0, 0, 0, 0, 0, 0, 0, 0, 0], 
[0, 0, 0, 0, 0, 0, 0, 0, 0, 0, 0, 0, 0, 0, 0, 0, 0, 0, 0, 0], 
[0, 0, 0, 0, 0, 0, 0, 0, 0, 0, 0, 0, 0, 0, 0, 0, 0, 0, 0, 0], 
[0, 0, 0, 0, 0, 0, 0, 0, 0, 0, 0, 0, 0, 0, 0, 0, 0, 0, 0, 0], 
[0, 0, 0, 0, 0, 0, 0, 0, 0, 0, 0, 0, 0, 0, 0, 0, 0, 0, 0, 0], 
[0, 0, 0, 0, 0, 0, 0, 0, 0, 0, 0, 0, 0, 0, 0, 0, 0, 0, 0, 0], 
[0, 0, 0, 0, 0, 0, 0, 0, 0, 0, 0, 0, 0, 0, 0, 0, 0, 0, 0, 0], 
[0, 0, 0, 0, 0, 0, 0, 0, 0, 0, 0, 0, 0, 0, 0, 0, 0, 0, 0, 0], 
[0, 0, 0, 0, 0, 0, 0, 0, 0, 0, 0, 0, 0, 0, 0, 0, 0, 0, 0, 0], 
[0, 0, 0, 0, 0, 0, 0, 0, 0, 0, 0, 0, 0, 0, 0, 0, 0, 0, 0, 0], 
[0, 0, 0, 0, 0, 0, 0, 0, 0, 0, 0, 0, 0, 0, 0, 0, 0, 0, 0, 0], 
[0, 0, 0, 0, 0, 0, 0, 0, 0, 0, 0, 0, 0, 0, 0, 0, 0, 0, 0, 0], 
[0, 0, 0, 0, 0, 0, 0, 0, 0, 0, 0, 0, 0, 0, 0, 0, 0, 0, 0, 0], 
[0, 0, 0, 0, 0, 0, 0, 0, 0, 0, 0, 0, 0, 0, 0, 0, 0, 0, 0, 0]]]
}
