%YAML 1.1
%TAG !u! tag:unity3d.com,2011:
--- !u!114 &11400000
MonoBehaviour:
  m_ObjectHideFlags: 0
  m_CorrespondingSourceObject: {fileID: 0}
  m_PrefabInstance: {fileID: 0}
  m_PrefabAsset: {fileID: 0}
  m_GameObject: {fileID: 0}
  m_Enabled: 1
  m_EditorHideFlags: 0
  m_Script: {fileID: 11500000, guid: 204b71e7cde48cb43914d384e24d7f4a, type: 3}
  m_Name: PetiteBoite
  m_EditorClassIdentifier: 
  itemName: PetiteBoite
  difficultyLevel: 3
  correctBinColor: jaune
  pointsValue: 20
  message: 
