%YAML 1.1
%TAG !u! tag:unity3d.com,2011:
--- !u!114 &11400000
MonoBehaviour:
  m_ObjectHideFlags: 0
  m_CorrespondingSourceObject: {fileID: 0}
  m_PrefabInstance: {fileID: 0}
  m_PrefabAsset: {fileID: 0}
  m_GameObject: {fileID: 0}
  m_Enabled: 1
  m_EditorHideFlags: 0
  m_Script: {fileID: 11500000, guid: 204b71e7cde48cb43914d384e24d7f4a, type: 3}
  m_Name: carton
  m_EditorClassIdentifier: 
  itemName: Carton
  difficultyLevel: 0
  correctBinColor: blue
  pointsValue: 20
  message: "Les cartons doivent \xEAtre plac\xE9s dans la poubelle bleue pour \xEAtre
    recycl\xE9s en nouveaux produits en papier."
