%YAML 1.1
%TAG !u! tag:unity3d.com,2011:
--- !u!1001 &6111181466699369045
PrefabInstance:
  m_ObjectHideFlags: 0
  serializedVersion: 2
  m_Modification:
    serializedVersion: 3
    m_TransformParent: {fileID: 0}
    m_Modifications:
    - target: {fileID: 100000, guid: 47365cc78e5cfad41badc534e3d2b7e1, type: 3}
      propertyPath: m_Name
      value: Cheese 1
      objectReference: {fileID: 0}
    - target: {fileID: 100000, guid: 47365cc78e5cfad41badc534e3d2b7e1, type: 3}
      propertyPath: m_TagString
      value: PickupObject
      objectReference: {fileID: 0}
    - target: {fileID: 400000, guid: 47365cc78e5cfad41badc534e3d2b7e1, type: 3}
      propertyPath: m_LocalPosition.x
      value: 13.585812
      objectReference: {fileID: 0}
    - target: {fileID: 400000, guid: 47365cc78e5cfad41badc534e3d2b7e1, type: 3}
      propertyPath: m_LocalPosition.y
      value: -1.6804031
      objectReference: {fileID: 0}
    - target: {fileID: 400000, guid: 47365cc78e5cfad41badc534e3d2b7e1, type: 3}
      propertyPath: m_LocalPosition.z
      value: 2.3141131
      objectReference: {fileID: 0}
    - target: {fileID: 400000, guid: 47365cc78e5cfad41badc534e3d2b7e1, type: 3}
      propertyPath: m_LocalRotation.w
      value: 1
      objectReference: {fileID: 0}
    - target: {fileID: 400000, guid: 47365cc78e5cfad41badc534e3d2b7e1, type: 3}
      propertyPath: m_LocalRotation.x
      value: -0
      objectReference: {fileID: 0}
    - target: {fileID: 400000, guid: 47365cc78e5cfad41badc534e3d2b7e1, type: 3}
      propertyPath: m_LocalRotation.y
      value: -0
      objectReference: {fileID: 0}
    - target: {fileID: 400000, guid: 47365cc78e5cfad41badc534e3d2b7e1, type: 3}
      propertyPath: m_LocalRotation.z
      value: -0
      objectReference: {fileID: 0}
    - target: {fileID: 400000, guid: 47365cc78e5cfad41badc534e3d2b7e1, type: 3}
      propertyPath: m_LocalEulerAnglesHint.x
      value: 0
      objectReference: {fileID: 0}
    - target: {fileID: 400000, guid: 47365cc78e5cfad41badc534e3d2b7e1, type: 3}
      propertyPath: m_LocalEulerAnglesHint.y
      value: 0
      objectReference: {fileID: 0}
    - target: {fileID: 400000, guid: 47365cc78e5cfad41badc534e3d2b7e1, type: 3}
      propertyPath: m_LocalEulerAnglesHint.z
      value: 0
      objectReference: {fileID: 0}
    m_RemovedComponents: []
    m_RemovedGameObjects: []
    m_AddedGameObjects: []
    m_AddedComponents:
    - targetCorrespondingSourceObject: {fileID: 100000, guid: 47365cc78e5cfad41badc534e3d2b7e1,
        type: 3}
      insertIndex: -1
      addedObject: {fileID: 5866535202134586588}
    - targetCorrespondingSourceObject: {fileID: 100000, guid: 47365cc78e5cfad41badc534e3d2b7e1,
        type: 3}
      insertIndex: -1
      addedObject: {fileID: 8736200798880691659}
    - targetCorrespondingSourceObject: {fileID: 100000, guid: 47365cc78e5cfad41badc534e3d2b7e1,
        type: 3}
      insertIndex: -1
      addedObject: {fileID: 1610757022274302073}
  m_SourcePrefab: {fileID: 100100000, guid: 47365cc78e5cfad41badc534e3d2b7e1, type: 3}
--- !u!1 &6111181466699336949 stripped
GameObject:
  m_CorrespondingSourceObject: {fileID: 100000, guid: 47365cc78e5cfad41badc534e3d2b7e1,
    type: 3}
  m_PrefabInstance: {fileID: 6111181466699369045}
  m_PrefabAsset: {fileID: 0}
--- !u!65 &5866535202134586588
BoxCollider:
  m_ObjectHideFlags: 0
  m_CorrespondingSourceObject: {fileID: 0}
  m_PrefabInstance: {fileID: 0}
  m_PrefabAsset: {fileID: 0}
  m_GameObject: {fileID: 6111181466699336949}
  m_Material: {fileID: 0}
  m_IncludeLayers:
    serializedVersion: 2
    m_Bits: 0
  m_ExcludeLayers:
    serializedVersion: 2
    m_Bits: 0
  m_LayerOverridePriority: 0
  m_IsTrigger: 0
  m_ProvidesContacts: 0
  m_Enabled: 1
  serializedVersion: 3
  m_Size: {x: 0.30166253, y: 0.22488499, z: 0.3877521}
  m_Center: {x: 0, y: 0.11244245, z: -0.000000014901161}
--- !u!54 &8736200798880691659
Rigidbody:
  m_ObjectHideFlags: 0
  m_CorrespondingSourceObject: {fileID: 0}
  m_PrefabInstance: {fileID: 0}
  m_PrefabAsset: {fileID: 0}
  m_GameObject: {fileID: 6111181466699336949}
  serializedVersion: 4
  m_Mass: 1
  m_Drag: 0
  m_AngularDrag: 0.05
  m_CenterOfMass: {x: 0, y: 0, z: 0}
  m_InertiaTensor: {x: 1, y: 1, z: 1}
  m_InertiaRotation: {x: 0, y: 0, z: 0, w: 1}
  m_IncludeLayers:
    serializedVersion: 2
    m_Bits: 0
  m_ExcludeLayers:
    serializedVersion: 2
    m_Bits: 0
  m_ImplicitCom: 1
  m_ImplicitTensor: 1
  m_UseGravity: 1
  m_IsKinematic: 1
  m_Interpolate: 0
  m_Constraints: 0
  m_CollisionDetection: 2
--- !u!114 &1610757022274302073
MonoBehaviour:
  m_ObjectHideFlags: 0
  m_CorrespondingSourceObject: {fileID: 0}
  m_PrefabInstance: {fileID: 0}
  m_PrefabAsset: {fileID: 0}
  m_GameObject: {fileID: 6111181466699336949}
  m_Enabled: 1
  m_EditorHideFlags: 0
  m_Script: {fileID: 11500000, guid: 3248807b45a52fa4fa7000d10f5561ab, type: 3}
  m_Name: 
  m_EditorClassIdentifier: 
  itemData: {fileID: 11400000, guid: 2d9c1ab408abea746b1d7dec75963275, type: 2}
