%YAML 1.1
%TAG !u! tag:unity3d.com,2011:
--- !u!1001 &8844370336762605189
PrefabInstance:
  m_ObjectHideFlags: 0
  serializedVersion: 2
  m_Modification:
    serializedVersion: 3
    m_TransformParent: {fileID: 0}
    m_Modifications:
    - target: {fileID: -8679921383154817045, guid: d60676ff34a187349872683db5c2eb5f,
        type: 3}
      propertyPath: m_LocalScale.x
      value: 0.52
      objectReference: {fileID: 0}
    - target: {fileID: -8679921383154817045, guid: d60676ff34a187349872683db5c2eb5f,
        type: 3}
      propertyPath: m_LocalScale.y
      value: 0.52
      objectReference: {fileID: 0}
    - target: {fileID: -8679921383154817045, guid: d60676ff34a187349872683db5c2eb5f,
        type: 3}
      propertyPath: m_LocalScale.z
      value: 0.52
      objectReference: {fileID: 0}
    - target: {fileID: -8679921383154817045, guid: d60676ff34a187349872683db5c2eb5f,
        type: 3}
      propertyPath: m_LocalPosition.x
      value: 14.56
      objectReference: {fileID: 0}
    - target: {fileID: -8679921383154817045, guid: d60676ff34a187349872683db5c2eb5f,
        type: 3}
      propertyPath: m_LocalPosition.y
      value: -1.497
      objectReference: {fileID: 0}
    - target: {fileID: -8679921383154817045, guid: d60676ff34a187349872683db5c2eb5f,
        type: 3}
      propertyPath: m_LocalPosition.z
      value: 1.026
      objectReference: {fileID: 0}
    - target: {fileID: -8679921383154817045, guid: d60676ff34a187349872683db5c2eb5f,
        type: 3}
      propertyPath: m_LocalRotation.w
      value: 0.7071068
      objectReference: {fileID: 0}
    - target: {fileID: -8679921383154817045, guid: d60676ff34a187349872683db5c2eb5f,
        type: 3}
      propertyPath: m_LocalRotation.x
      value: -0.7071068
      objectReference: {fileID: 0}
    - target: {fileID: -8679921383154817045, guid: d60676ff34a187349872683db5c2eb5f,
        type: 3}
      propertyPath: m_LocalRotation.y
      value: 0
      objectReference: {fileID: 0}
    - target: {fileID: -8679921383154817045, guid: d60676ff34a187349872683db5c2eb5f,
        type: 3}
      propertyPath: m_LocalRotation.z
      value: 0
      objectReference: {fileID: 0}
    - target: {fileID: -8679921383154817045, guid: d60676ff34a187349872683db5c2eb5f,
        type: 3}
      propertyPath: m_LocalEulerAnglesHint.x
      value: -90
      objectReference: {fileID: 0}
    - target: {fileID: -8679921383154817045, guid: d60676ff34a187349872683db5c2eb5f,
        type: 3}
      propertyPath: m_LocalEulerAnglesHint.y
      value: 0
      objectReference: {fileID: 0}
    - target: {fileID: -8679921383154817045, guid: d60676ff34a187349872683db5c2eb5f,
        type: 3}
      propertyPath: m_LocalEulerAnglesHint.z
      value: 0
      objectReference: {fileID: 0}
    - target: {fileID: -8679921383154817045, guid: d60676ff34a187349872683db5c2eb5f,
        type: 3}
      propertyPath: m_ConstrainProportionsScale
      value: 1
      objectReference: {fileID: 0}
    - target: {fileID: -7511558181221131132, guid: d60676ff34a187349872683db5c2eb5f,
        type: 3}
      propertyPath: m_Materials.Array.data[0]
      value: 
      objectReference: {fileID: 2100000, guid: 62dad06c47d1d1a448901a67f077f0b6, type: 2}
    - target: {fileID: 919132149155446097, guid: d60676ff34a187349872683db5c2eb5f,
        type: 3}
      propertyPath: m_Name
      value: Bottle_Sebastien 1
      objectReference: {fileID: 0}
    - target: {fileID: 919132149155446097, guid: d60676ff34a187349872683db5c2eb5f,
        type: 3}
      propertyPath: m_IsActive
      value: 1
      objectReference: {fileID: 0}
    - target: {fileID: 919132149155446097, guid: d60676ff34a187349872683db5c2eb5f,
        type: 3}
      propertyPath: m_TagString
      value: PickupObject
      objectReference: {fileID: 0}
    m_RemovedComponents: []
    m_RemovedGameObjects: []
    m_AddedGameObjects: []
    m_AddedComponents:
    - targetCorrespondingSourceObject: {fileID: 919132149155446097, guid: d60676ff34a187349872683db5c2eb5f,
        type: 3}
      insertIndex: -1
      addedObject: {fileID: 1472574038136358150}
    - targetCorrespondingSourceObject: {fileID: 919132149155446097, guid: d60676ff34a187349872683db5c2eb5f,
        type: 3}
      insertIndex: -1
      addedObject: {fileID: 4383262920273381701}
    - targetCorrespondingSourceObject: {fileID: 919132149155446097, guid: d60676ff34a187349872683db5c2eb5f,
        type: 3}
      insertIndex: -1
      addedObject: {fileID: 7034024377958386279}
  m_SourcePrefab: {fileID: 100100000, guid: d60676ff34a187349872683db5c2eb5f, type: 3}
--- !u!1 &8537956450514867156 stripped
GameObject:
  m_CorrespondingSourceObject: {fileID: 919132149155446097, guid: d60676ff34a187349872683db5c2eb5f,
    type: 3}
  m_PrefabInstance: {fileID: 8844370336762605189}
  m_PrefabAsset: {fileID: 0}
--- !u!65 &1472574038136358150
BoxCollider:
  m_ObjectHideFlags: 0
  m_CorrespondingSourceObject: {fileID: 0}
  m_PrefabInstance: {fileID: 0}
  m_PrefabAsset: {fileID: 0}
  m_GameObject: {fileID: 8537956450514867156}
  m_Material: {fileID: 0}
  m_IncludeLayers:
    serializedVersion: 2
    m_Bits: 0
  m_ExcludeLayers:
    serializedVersion: 2
    m_Bits: 0
  m_LayerOverridePriority: 0
  m_IsTrigger: 0
  m_ProvidesContacts: 0
  m_Enabled: 1
  serializedVersion: 3
  m_Size: {x: 0.31, y: 0.30999997, z: 1.3299931}
  m_Center: {x: 0, y: 0, z: 0.66499656}
--- !u!54 &4383262920273381701
Rigidbody:
  m_ObjectHideFlags: 0
  m_CorrespondingSourceObject: {fileID: 0}
  m_PrefabInstance: {fileID: 0}
  m_PrefabAsset: {fileID: 0}
  m_GameObject: {fileID: 8537956450514867156}
  serializedVersion: 4
  m_Mass: 1
  m_Drag: 0
  m_AngularDrag: 0.05
  m_CenterOfMass: {x: 0, y: 0, z: 0}
  m_InertiaTensor: {x: 1, y: 1, z: 1}
  m_InertiaRotation: {x: 0, y: 0, z: 0, w: 1}
  m_IncludeLayers:
    serializedVersion: 2
    m_Bits: 0
  m_ExcludeLayers:
    serializedVersion: 2
    m_Bits: 0
  m_ImplicitCom: 1
  m_ImplicitTensor: 1
  m_UseGravity: 1
  m_IsKinematic: 1
  m_Interpolate: 0
  m_Constraints: 0
  m_CollisionDetection: 2
--- !u!114 &7034024377958386279
MonoBehaviour:
  m_ObjectHideFlags: 0
  m_CorrespondingSourceObject: {fileID: 0}
  m_PrefabInstance: {fileID: 0}
  m_PrefabAsset: {fileID: 0}
  m_GameObject: {fileID: 8537956450514867156}
  m_Enabled: 1
  m_EditorHideFlags: 0
  m_Script: {fileID: 11500000, guid: 3248807b45a52fa4fa7000d10f5561ab, type: 3}
  m_Name: 
  m_EditorClassIdentifier: 
  itemData: {fileID: 11400000, guid: b772de1b604db8648ad7a6b1de29ac46, type: 2}
