%!PS-Adobe-3.0 EPSF-3.0
%%Creator: (MATLAB, The Mathworks, Inc. Version 9.7.0.1190202 \(R2019b\). Operating System: Mac OS X)
%%Title: /Volumes/MATH_SHARE_PAPAT/ANUM/TP/09/ode.eps
%%CreationDate: 2020-03-26T21:02:08
%%Pages: (atend)
%%BoundingBox: 0 0 560 420
%%LanguageLevel: 3
%%EndComments
%%BeginProlog
%%BeginResource: procset (Apache XML Graphics Std ProcSet) 1.2 0
%%Version: 1.2 0
%%Copyright: (Copyright 2001-2003,2010 The Apache Software Foundation. License terms: http://www.apache.org/licenses/LICENSE-2.0)
/bd{bind def}bind def
/ld{load def}bd
/GR/grestore ld
/GS/gsave ld
/RM/rmoveto ld
/C/curveto ld
/t/show ld
/L/lineto ld
/ML/setmiterlimit ld
/CT/concat ld
/f/fill ld
/N/newpath ld
/S/stroke ld
/CC/setcmykcolor ld
/A/ashow ld
/cp/closepath ld
/RC/setrgbcolor ld
/LJ/setlinejoin ld
/GC/setgray ld
/LW/setlinewidth ld
/M/moveto ld
/re {4 2 roll M
1 index 0 rlineto
0 exch rlineto
neg 0 rlineto
cp } bd
/_ctm matrix def
/_tm matrix def
/BT { _ctm currentmatrix pop matrix _tm copy pop 0 0 moveto } bd
/ET { _ctm setmatrix } bd
/iTm { _ctm setmatrix _tm concat } bd
/Tm { _tm astore pop iTm 0 0 moveto } bd
/ux 0.0 def
/uy 0.0 def
/F {
  /Tp exch def
  /Tf exch def
  Tf findfont Tp scalefont setfont
  /cf Tf def  /cs Tp def
} bd
/ULS {currentpoint /uy exch def /ux exch def} bd
/ULE {
  /Tcx currentpoint pop def
  gsave
  newpath
  cf findfont cs scalefont dup
  /FontMatrix get 0 get /Ts exch def /FontInfo get dup
  /UnderlinePosition get Ts mul /To exch def
  /UnderlineThickness get Ts mul /Tt exch def
  ux uy To add moveto  Tcx uy To add lineto
  Tt setlinewidth stroke
  grestore
} bd
/OLE {
  /Tcx currentpoint pop def
  gsave
  newpath
  cf findfont cs scalefont dup
  /FontMatrix get 0 get /Ts exch def /FontInfo get dup
  /UnderlinePosition get Ts mul /To exch def
  /UnderlineThickness get Ts mul /Tt exch def
  ux uy To add cs add moveto Tcx uy To add cs add lineto
  Tt setlinewidth stroke
  grestore
} bd
/SOE {
  /Tcx currentpoint pop def
  gsave
  newpath
  cf findfont cs scalefont dup
  /FontMatrix get 0 get /Ts exch def /FontInfo get dup
  /UnderlinePosition get Ts mul /To exch def
  /UnderlineThickness get Ts mul /Tt exch def
  ux uy To add cs 10 mul 26 idiv add moveto Tcx uy To add cs 10 mul 26 idiv add lineto
  Tt setlinewidth stroke
  grestore
} bd
/QT {
/Y22 exch store
/X22 exch store
/Y21 exch store
/X21 exch store
currentpoint
/Y21 load 2 mul add 3 div exch
/X21 load 2 mul add 3 div exch
/X21 load 2 mul /X22 load add 3 div
/Y21 load 2 mul /Y22 load add 3 div
/X22 load /Y22 load curveto
} bd
/SSPD {
dup length /d exch dict def
{
/v exch def
/k exch def
currentpagedevice k known {
/cpdv currentpagedevice k get def
v cpdv ne {
/upd false def
/nullv v type /nulltype eq def
/nullcpdv cpdv type /nulltype eq def
nullv nullcpdv or
{
/upd true def
} {
/sametype v type cpdv type eq def
sametype {
v type /arraytype eq {
/vlen v length def
/cpdvlen cpdv length def
vlen cpdvlen eq {
0 1 vlen 1 sub {
/i exch def
/obj v i get def
/cpdobj cpdv i get def
obj cpdobj ne {
/upd true def
exit
} if
} for
} {
/upd true def
} ifelse
} {
v type /dicttype eq {
v {
/dv exch def
/dk exch def
/cpddv cpdv dk get def
dv cpddv ne {
/upd true def
exit
} if
} forall
} {
/upd true def
} ifelse
} ifelse
} if
} ifelse
upd true eq {
d k v put
} if
} if
} if
} forall
d length 0 gt {
d setpagedevice
} if
} bd
/RE { % /NewFontName [NewEncodingArray] /FontName RE -
  findfont dup length dict begin
  {
    1 index /FID ne
    {def} {pop pop} ifelse
  } forall
  /Encoding exch def
  /FontName 1 index def
  currentdict definefont pop
  end
} bind def
%%EndResource
%%BeginResource: procset (Apache XML Graphics EPS ProcSet) 1.0 0
%%Version: 1.0 0
%%Copyright: (Copyright 2002-2003 The Apache Software Foundation. License terms: http://www.apache.org/licenses/LICENSE-2.0)
/BeginEPSF { %def
/b4_Inc_state save def         % Save state for cleanup
/dict_count countdictstack def % Count objects on dict stack
/op_count count 1 sub def      % Count objects on operand stack
userdict begin                 % Push userdict on dict stack
/showpage { } def              % Redefine showpage, { } = null proc
0 setgray 0 setlinecap         % Prepare graphics state
1 setlinewidth 0 setlinejoin
10 setmiterlimit [ ] 0 setdash newpath
/languagelevel where           % If level not equal to 1 then
{pop languagelevel             % set strokeadjust and
1 ne                           % overprint to their defaults.
{false setstrokeadjust false setoverprint
} if
} if
} bd
/EndEPSF { %def
count op_count sub {pop} repeat            % Clean up stacks
countdictstack dict_count sub {end} repeat
b4_Inc_state restore
} bd
%%EndResource
%FOPBeginFontDict
%%IncludeResource: font Courier-Oblique
%%IncludeResource: font Courier-BoldOblique
%%IncludeResource: font Courier-Bold
%%IncludeResource: font ZapfDingbats
%%IncludeResource: font Symbol
%%IncludeResource: font Helvetica
%%IncludeResource: font Helvetica-Oblique
%%IncludeResource: font Helvetica-Bold
%%IncludeResource: font Helvetica-BoldOblique
%%IncludeResource: font Times-Roman
%%IncludeResource: font Times-Italic
%%IncludeResource: font Times-Bold
%%IncludeResource: font Times-BoldItalic
%%IncludeResource: font Courier
%FOPEndFontDict
%%BeginResource: encoding WinAnsiEncoding
/WinAnsiEncoding [
/.notdef /.notdef /.notdef /.notdef /.notdef
/.notdef /.notdef /.notdef /.notdef /.notdef
/.notdef /.notdef /.notdef /.notdef /.notdef
/.notdef /.notdef /.notdef /.notdef /.notdef
/.notdef /.notdef /.notdef /.notdef /.notdef
/.notdef /.notdef /.notdef /.notdef /.notdef
/.notdef /.notdef /space /exclam /quotedbl
/numbersign /dollar /percent /ampersand /quotesingle
/parenleft /parenright /asterisk /plus /comma
/hyphen /period /slash /zero /one
/two /three /four /five /six
/seven /eight /nine /colon /semicolon
/less /equal /greater /question /at
/A /B /C /D /E
/F /G /H /I /J
/K /L /M /N /O
/P /Q /R /S /T
/U /V /W /X /Y
/Z /bracketleft /backslash /bracketright /asciicircum
/underscore /quoteleft /a /b /c
/d /e /f /g /h
/i /j /k /l /m
/n /o /p /q /r
/s /t /u /v /w
/x /y /z /braceleft /bar
/braceright /asciitilde /bullet /Euro /bullet
/quotesinglbase /florin /quotedblbase /ellipsis /dagger
/daggerdbl /circumflex /perthousand /Scaron /guilsinglleft
/OE /bullet /Zcaron /bullet /bullet
/quoteleft /quoteright /quotedblleft /quotedblright /bullet
/endash /emdash /asciitilde /trademark /scaron
/guilsinglright /oe /bullet /zcaron /Ydieresis
/space /exclamdown /cent /sterling /currency
/yen /brokenbar /section /dieresis /copyright
/ordfeminine /guillemotleft /logicalnot /sfthyphen /registered
/macron /degree /plusminus /twosuperior /threesuperior
/acute /mu /paragraph /middot /cedilla
/onesuperior /ordmasculine /guillemotright /onequarter /onehalf
/threequarters /questiondown /Agrave /Aacute /Acircumflex
/Atilde /Adieresis /Aring /AE /Ccedilla
/Egrave /Eacute /Ecircumflex /Edieresis /Igrave
/Iacute /Icircumflex /Idieresis /Eth /Ntilde
/Ograve /Oacute /Ocircumflex /Otilde /Odieresis
/multiply /Oslash /Ugrave /Uacute /Ucircumflex
/Udieresis /Yacute /Thorn /germandbls /agrave
/aacute /acircumflex /atilde /adieresis /aring
/ae /ccedilla /egrave /eacute /ecircumflex
/edieresis /igrave /iacute /icircumflex /idieresis
/eth /ntilde /ograve /oacute /ocircumflex
/otilde /odieresis /divide /oslash /ugrave
/uacute /ucircumflex /udieresis /yacute /thorn
/ydieresis
] def
%%EndResource
%FOPBeginFontReencode
/Courier-Oblique findfont
dup length dict begin
  {1 index /FID ne {def} {pop pop} ifelse} forall
  /Encoding WinAnsiEncoding def
  currentdict
end
/Courier-Oblique exch definefont pop
/Courier-BoldOblique findfont
dup length dict begin
  {1 index /FID ne {def} {pop pop} ifelse} forall
  /Encoding WinAnsiEncoding def
  currentdict
end
/Courier-BoldOblique exch definefont pop
/Courier-Bold findfont
dup length dict begin
  {1 index /FID ne {def} {pop pop} ifelse} forall
  /Encoding WinAnsiEncoding def
  currentdict
end
/Courier-Bold exch definefont pop
/Helvetica findfont
dup length dict begin
  {1 index /FID ne {def} {pop pop} ifelse} forall
  /Encoding WinAnsiEncoding def
  currentdict
end
/Helvetica exch definefont pop
/Helvetica-Oblique findfont
dup length dict begin
  {1 index /FID ne {def} {pop pop} ifelse} forall
  /Encoding WinAnsiEncoding def
  currentdict
end
/Helvetica-Oblique exch definefont pop
/Helvetica-Bold findfont
dup length dict begin
  {1 index /FID ne {def} {pop pop} ifelse} forall
  /Encoding WinAnsiEncoding def
  currentdict
end
/Helvetica-Bold exch definefont pop
/Helvetica-BoldOblique findfont
dup length dict begin
  {1 index /FID ne {def} {pop pop} ifelse} forall
  /Encoding WinAnsiEncoding def
  currentdict
end
/Helvetica-BoldOblique exch definefont pop
/Times-Roman findfont
dup length dict begin
  {1 index /FID ne {def} {pop pop} ifelse} forall
  /Encoding WinAnsiEncoding def
  currentdict
end
/Times-Roman exch definefont pop
/Times-Italic findfont
dup length dict begin
  {1 index /FID ne {def} {pop pop} ifelse} forall
  /Encoding WinAnsiEncoding def
  currentdict
end
/Times-Italic exch definefont pop
/Times-Bold findfont
dup length dict begin
  {1 index /FID ne {def} {pop pop} ifelse} forall
  /Encoding WinAnsiEncoding def
  currentdict
end
/Times-Bold exch definefont pop
/Times-BoldItalic findfont
dup length dict begin
  {1 index /FID ne {def} {pop pop} ifelse} forall
  /Encoding WinAnsiEncoding def
  currentdict
end
/Times-BoldItalic exch definefont pop
/Courier findfont
dup length dict begin
  {1 index /FID ne {def} {pop pop} ifelse} forall
  /Encoding WinAnsiEncoding def
  currentdict
end
/Courier exch definefont pop
%FOPEndFontReencode
%%EndProlog
%%Page: 1 1
%%PageBoundingBox: 0 0 560 420
%%BeginPageSetup
[1 0 0 -1 0 420] CT
%%EndPageSetup
GS
1 GC
N
0 0 560 420 re
f
GR
GS
1 GC
N
0 0 560 420 re
f
GR
GS
1 GC
N
73 363 M
507 363 L
507 31.5 L
73 31.5 L
cp
f
GR
GS
0.149 GC
2 setlinecap
1 LJ
1.3 LW
N
73 363 M
507 363 L
S
GR
GS
0.149 GC
2 setlinecap
1 LJ
1.3 LW
N
73 31.5 M
507 31.5 L
S
GR
GS
0.149 GC
2 setlinecap
1 LJ
1.3 LW
N
73 363 M
73 358.66 L
S
GR
GS
0.149 GC
2 setlinecap
1 LJ
1.3 LW
N
159.8 363 M
159.8 358.66 L
S
GR
GS
0.149 GC
2 setlinecap
1 LJ
1.3 LW
N
246.6 363 M
246.6 358.66 L
S
GR
GS
0.149 GC
2 setlinecap
1 LJ
1.3 LW
N
333.4 363 M
333.4 358.66 L
S
GR
GS
0.149 GC
2 setlinecap
1 LJ
1.3 LW
N
420.2 363 M
420.2 358.66 L
S
GR
GS
0.149 GC
2 setlinecap
1 LJ
1.3 LW
N
507 363 M
507 358.66 L
S
GR
GS
0.149 GC
2 setlinecap
1 LJ
1.3 LW
N
73 31.5 M
73 35.84 L
S
GR
GS
0.149 GC
2 setlinecap
1 LJ
1.3 LW
N
159.8 31.5 M
159.8 35.84 L
S
GR
GS
0.149 GC
2 setlinecap
1 LJ
1.3 LW
N
246.6 31.5 M
246.6 35.84 L
S
GR
GS
0.149 GC
2 setlinecap
1 LJ
1.3 LW
N
333.4 31.5 M
333.4 35.84 L
S
GR
GS
0.149 GC
2 setlinecap
1 LJ
1.3 LW
N
420.2 31.5 M
420.2 35.84 L
S
GR
GS
0.149 GC
2 setlinecap
1 LJ
1.3 LW
N
507 31.5 M
507 35.84 L
S
GR
GS
[1 0 0 1 73 369] CT
0.149 GC
/Helvetica 20 F
GS
[1 0 0 1 0 0] CT
-6 20 moveto 
1 -1 scale
(0) t 
GR
GR
GS
[1 0 0 1 159.8 369] CT
0.149 GC
/Helvetica 20 F
GS
[1 0 0 1 0 0] CT
-14 20 moveto 
1 -1 scale
(0.2) t 
GR
GR
GS
[1 0 0 1 246.60001 369] CT
0.149 GC
/Helvetica 20 F
GS
[1 0 0 1 0 0] CT
-14 20 moveto 
1 -1 scale
(0.4) t 
GR
GR
GS
[1 0 0 1 333.40002 369] CT
0.149 GC
/Helvetica 20 F
GS
[1 0 0 1 0 0] CT
-14 20 moveto 
1 -1 scale
(0.6) t 
GR
GR
GS
[1 0 0 1 420.20001 369] CT
0.149 GC
/Helvetica 20 F
GS
[1 0 0 1 0 0] CT
-14 20 moveto 
1 -1 scale
(0.8) t 
GR
GR
GS
[1 0 0 1 507 369] CT
0.149 GC
/Helvetica 20 F
GS
[1 0 0 1 0 0] CT
-6 20 moveto 
1 -1 scale
(1) t 
GR
GR
GS
[1 0 0 1 290.00021 394] CT
0.149 GC
/Helvetica 22 F
GS
[1 0 0 1 0 0] CT
-3.5 21 moveto 
1 -1 scale
(t) t 
GR
GR
GS
0.149 GC
2 setlinecap
1 LJ
1.3 LW
N
73 363 M
73 31.5 L
S
GR
GS
0.149 GC
2 setlinecap
1 LJ
1.3 LW
N
507 363 M
507 31.5 L
S
GR
GS
0.149 GC
2 setlinecap
1 LJ
1.3 LW
N
73 327.167 M
77.34 327.167 L
S
GR
GS
0.149 GC
2 setlinecap
1 LJ
1.3 LW
N
73 253.5 M
77.34 253.5 L
S
GR
GS
0.149 GC
2 setlinecap
1 LJ
1.3 LW
N
73 179.833 M
77.34 179.833 L
S
GR
GS
0.149 GC
2 setlinecap
1 LJ
1.3 LW
N
73 106.167 M
77.34 106.167 L
S
GR
GS
0.149 GC
2 setlinecap
1 LJ
1.3 LW
N
73 32.5 M
77.34 32.5 L
S
GR
GS
0.149 GC
2 setlinecap
1 LJ
1.3 LW
N
507 327.167 M
502.66 327.167 L
S
GR
GS
0.149 GC
2 setlinecap
1 LJ
1.3 LW
N
507 253.5 M
502.66 253.5 L
S
GR
GS
0.149 GC
2 setlinecap
1 LJ
1.3 LW
N
507 179.833 M
502.66 179.833 L
S
GR
GS
0.149 GC
2 setlinecap
1 LJ
1.3 LW
N
507 106.167 M
502.66 106.167 L
S
GR
GS
0.149 GC
2 setlinecap
1 LJ
1.3 LW
N
507 32.5 M
502.66 32.5 L
S
GR
GS
[1 0 0 1 67 327.16666] CT
0.149 GC
/Helvetica 20 F
GS
[1 0 0 1 0 0] CT
-12 7.5 moveto 
1 -1 scale
(0) t 
GR
GR
GS
[1 0 0 1 67 253.5] CT
0.149 GC
/Helvetica 20 F
GS
[1 0 0 1 0 0] CT
-12 7.5 moveto 
1 -1 scale
(1) t 
GR
GR
GS
[1 0 0 1 67 179.83333] CT
0.149 GC
/Helvetica 20 F
GS
[1 0 0 1 0 0] CT
-12 7.5 moveto 
1 -1 scale
(2) t 
GR
GR
GS
[1 0 0 1 67 106.16666] CT
0.149 GC
/Helvetica 20 F
GS
[1 0 0 1 0 0] CT
-12 7.5 moveto 
1 -1 scale
(3) t 
GR
GR
GS
[1 0 0 1 67 32.5] CT
0.149 GC
/Helvetica 20 F
GS
[1 0 0 1 0 0] CT
-12 7.5 moveto 
1 -1 scale
(4) t 
GR
GR
GS
[0 -1 1 0 52.5 197.24985] CT
0.149 GC
/Helvetica 22 F
GS
[1 0 0 1 0 0] CT
-15 -5 moveto 
1 -1 scale
(v\(t\)) t 
GR
GR
GS
1 0 0 RC
1 LJ
2 LW
N
73 327.167 M
90.36 332.759 L
107.72 337.874 L
125.08 342.507 L
142.44 346.659 L
159.8 350.333 L
177.16 353.532 L
194.52 356.262 L
211.88 358.527 L
229.24 360.333 L
246.6 361.683 L
263.96 362.581 L
281.32 363.03 L
298.68 363.03 L
316.04 362.581 L
333.4 361.683 L
350.76 360.333 L
368.12 358.527 L
385.48 356.262 L
402.84 353.532 L
420.2 350.333 L
437.56 346.659 L
454.92 342.507 L
472.28 337.874 L
489.64 332.759 L
507 327.167 L
S
GR
GS
0 0 1 RC
1 LJ
2 LW
N
73 327.167 M
90.36 297.201 L
107.72 266.87 L
125.08 236.404 L
142.44 206.147 L
159.8 176.541 L
177.16 148.115 L
194.52 121.475 L
211.88 97.312 L
229.24 76.408 L
246.6 59.619 L
263.96 47.803 L
281.32 41.684 L
298.68 41.684 L
316.04 47.803 L
333.4 59.619 L
350.76 76.408 L
368.12 97.312 L
385.48 121.475 L
402.84 148.115 L
420.2 176.541 L
437.56 206.147 L
454.92 236.404 L
472.28 266.87 L
489.64 297.201 L
507 327.167 L
S
GR
GS
1 GC
N
497 89 M
497 41.5 L
413 41.5 L
413 89 L
cp
f
GR
GS
[1 0 0 1 450 61] CT
N
3.625 0.203 M
2.766 0.203 2.102 -0.203 QT
1.438 -0.609 1.078 -1.297 QT
0.719 -1.984 0.719 -2.844 QT
0.719 -4.063 1.398 -5.258 QT
2.078 -6.453 3.211 -7.203 QT
4.344 -7.953 5.578 -7.953 QT
6.5 -7.953 7.195 -7.477 QT
7.891 -7 8.25 -6.203 QT
8.609 -5.406 8.609 -4.5 QT
8.625 -3.297 L
9.234 -4.156 9.664 -5.07 QT
10.094 -5.984 10.313 -6.969 QT
10.359 -7.078 10.453 -7.078 QT
10.672 -7.078 L
10.844 -7.078 10.844 -6.906 QT
10.844 -6.891 10.813 -6.859 QT
10.609 -6.031 10.289 -5.273 QT
9.969 -4.516 9.547 -3.797 QT
9.125 -3.078 8.625 -2.5 QT
8.625 -0.266 9.141 -0.266 QT
9.469 -0.266 9.688 -0.469 QT
9.906 -0.672 10.07 -0.961 QT
10.234 -1.25 10.281 -1.25 QT
10.5 -1.25 L
10.641 -1.25 10.641 -1.078 QT
10.641 -0.641 10.125 -0.219 QT
9.609 0.203 9.109 0.203 QT
8.453 0.203 8.023 -0.219 QT
7.594 -0.641 7.438 -1.313 QT
6.594 -0.594 5.609 -0.195 QT
4.625 0.203 3.625 0.203 QT
cp
3.656 -0.266 M
5.578 -0.266 7.344 -1.859 QT
7.344 -1.953 7.32 -2.109 QT
7.297 -2.266 7.297 -2.281 QT
7.297 -4.234 L
7.297 -7.484 5.547 -7.484 QT
4.484 -7.484 3.695 -6.586 QT
2.906 -5.688 2.508 -4.438 QT
2.109 -3.188 2.109 -2.141 QT
2.109 -1.359 2.508 -0.813 QT
2.906 -0.266 3.656 -0.266 QT
cp
f
GR
GS
[1 0 0 1 462 61] CT
/Helvetica 18 F
GS
[1 0 0 1 0 0] CT
0 0 moveto 
1 -1 scale
(=0) t 
GR
GR
GS
1 0 0 RC
1 LJ
2 LW
N
417 54.25 M
447 54.25 L
S
GR
GS
[1 0 0 1 450 83] CT
N
/f552039163{3.625 0.203 M
2.766 0.203 2.102 -0.203 QT
1.438 -0.609 1.078 -1.297 QT
0.719 -1.984 0.719 -2.844 QT
0.719 -4.063 1.398 -5.258 QT
2.078 -6.453 3.211 -7.203 QT
4.344 -7.953 5.578 -7.953 QT
6.5 -7.953 7.195 -7.477 QT
7.891 -7 8.25 -6.203 QT
8.609 -5.406 8.609 -4.5 QT
8.625 -3.297 L
9.234 -4.156 9.664 -5.07 QT
10.094 -5.984 10.313 -6.969 QT
10.359 -7.078 10.453 -7.078 QT
10.672 -7.078 L
10.844 -7.078 10.844 -6.906 QT
10.844 -6.891 10.813 -6.859 QT
10.609 -6.031 10.289 -5.273 QT
9.969 -4.516 9.547 -3.797 QT
9.125 -3.078 8.625 -2.5 QT
8.625 -0.266 9.141 -0.266 QT
9.469 -0.266 9.688 -0.469 QT
9.906 -0.672 10.07 -0.961 QT
10.234 -1.25 10.281 -1.25 QT
10.5 -1.25 L
10.641 -1.25 10.641 -1.078 QT
10.641 -0.641 10.125 -0.219 QT
9.609 0.203 9.109 0.203 QT
8.453 0.203 8.023 -0.219 QT
7.594 -0.641 7.438 -1.313 QT
6.594 -0.594 5.609 -0.195 QT
4.625 0.203 3.625 0.203 QT
cp
3.656 -0.266 M
5.578 -0.266 7.344 -1.859 QT
7.344 -1.953 7.32 -2.109 QT
7.297 -2.266 7.297 -2.281 QT
7.297 -4.234 L
7.297 -7.484 5.547 -7.484 QT
4.484 -7.484 3.695 -6.586 QT
2.906 -5.688 2.508 -4.438 QT
2.109 -3.188 2.109 -2.141 QT
2.109 -1.359 2.508 -0.813 QT
2.906 -0.266 3.656 -0.266 QT
cp}def
f552039163
f
GR
GS
[1 0 0 1 462 83] CT
/Helvetica 18 F
GS
[1 0 0 1 0 0] CT
0 0 moveto 
1 -1 scale
(=20) t 
GR
GR
GS
0 0 1 RC
1 LJ
2 LW
N
417 76.25 M
447 76.25 L
S
GR
GS
0.149 GC
10.0 ML
1.3 LW
N
413 89 M
413 41.5 L
497 41.5 L
497 89 L
cp
S
GR
%%Trailer
%%Pages: 1
%%EOF
