%!PS-Adobe-3.0 EPSF-3.0
%%Creator: (MATLAB, The Mathworks, Inc. Version 9.8.0.1359463 \(R2020a\) Update 1. Operating System: Windows 10)
%%Title: (C:/Users/Conor/Desktop/UNIGE/Research/PhD thesis/FIG_ASPN/MTLB_optsin_f_v1_20220704.eps)
%%CreationDate: 2022-07-04T14:31:02
%%Pages: (atend)
%%BoundingBox:     0     0  1440   722
%%LanguageLevel: 3
%%EndComments
%%BeginProlog
%%BeginResource: procset (Apache XML Graphics Std ProcSet) 1.2 0
%%Version: 1.2 0
%%Copyright: (Copyright 2001-2003,2010 The Apache Software Foundation. License terms: http://www.apache.org/licenses/LICENSE-2.0)
/bd{bind def}bind def
/ld{load def}bd
/GR/grestore ld
/GS/gsave ld
/RM/rmoveto ld
/C/curveto ld
/t/show ld
/L/lineto ld
/ML/setmiterlimit ld
/CT/concat ld
/f/fill ld
/N/newpath ld
/S/stroke ld
/CC/setcmykcolor ld
/A/ashow ld
/cp/closepath ld
/RC/setrgbcolor ld
/LJ/setlinejoin ld
/GC/setgray ld
/LW/setlinewidth ld
/M/moveto ld
/re {4 2 roll M
1 index 0 rlineto
0 exch rlineto
neg 0 rlineto
cp } bd
/_ctm matrix def
/_tm matrix def
/BT { _ctm currentmatrix pop matrix _tm copy pop 0 0 moveto } bd
/ET { _ctm setmatrix } bd
/iTm { _ctm setmatrix _tm concat } bd
/Tm { _tm astore pop iTm 0 0 moveto } bd
/ux 0.0 def
/uy 0.0 def
/F {
  /Tp exch def
  /Tf exch def
  Tf findfont Tp scalefont setfont
  /cf Tf def  /cs Tp def
} bd
/ULS {currentpoint /uy exch def /ux exch def} bd
/ULE {
  /Tcx currentpoint pop def
  gsave
  newpath
  cf findfont cs scalefont dup
  /FontMatrix get 0 get /Ts exch def /FontInfo get dup
  /UnderlinePosition get Ts mul /To exch def
  /UnderlineThickness get Ts mul /Tt exch def
  ux uy To add moveto  Tcx uy To add lineto
  Tt setlinewidth stroke
  grestore
} bd
/OLE {
  /Tcx currentpoint pop def
  gsave
  newpath
  cf findfont cs scalefont dup
  /FontMatrix get 0 get /Ts exch def /FontInfo get dup
  /UnderlinePosition get Ts mul /To exch def
  /UnderlineThickness get Ts mul /Tt exch def
  ux uy To add cs add moveto Tcx uy To add cs add lineto
  Tt setlinewidth stroke
  grestore
} bd
/SOE {
  /Tcx currentpoint pop def
  gsave
  newpath
  cf findfont cs scalefont dup
  /FontMatrix get 0 get /Ts exch def /FontInfo get dup
  /UnderlinePosition get Ts mul /To exch def
  /UnderlineThickness get Ts mul /Tt exch def
  ux uy To add cs 10 mul 26 idiv add moveto Tcx uy To add cs 10 mul 26 idiv add lineto
  Tt setlinewidth stroke
  grestore
} bd
/QT {
/Y22 exch store
/X22 exch store
/Y21 exch store
/X21 exch store
currentpoint
/Y21 load 2 mul add 3 div exch
/X21 load 2 mul add 3 div exch
/X21 load 2 mul /X22 load add 3 div
/Y21 load 2 mul /Y22 load add 3 div
/X22 load /Y22 load curveto
} bd
/SSPD {
dup length /d exch dict def
{
/v exch def
/k exch def
currentpagedevice k known {
/cpdv currentpagedevice k get def
v cpdv ne {
/upd false def
/nullv v type /nulltype eq def
/nullcpdv cpdv type /nulltype eq def
nullv nullcpdv or
{
/upd true def
} {
/sametype v type cpdv type eq def
sametype {
v type /arraytype eq {
/vlen v length def
/cpdvlen cpdv length def
vlen cpdvlen eq {
0 1 vlen 1 sub {
/i exch def
/obj v i get def
/cpdobj cpdv i get def
obj cpdobj ne {
/upd true def
exit
} if
} for
} {
/upd true def
} ifelse
} {
v type /dicttype eq {
v {
/dv exch def
/dk exch def
/cpddv cpdv dk get def
dv cpddv ne {
/upd true def
exit
} if
} forall
} {
/upd true def
} ifelse
} ifelse
} if
} ifelse
upd true eq {
d k v put
} if
} if
} if
} forall
d length 0 gt {
d setpagedevice
} if
} bd
/RE { % /NewFontName [NewEncodingArray] /FontName RE -
  findfont dup length dict begin
  {
    1 index /FID ne
    {def} {pop pop} ifelse
  } forall
  /Encoding exch def
  /FontName 1 index def
  currentdict definefont pop
  end
} bind def
%%EndResource
%%BeginResource: procset (Apache XML Graphics EPS ProcSet) 1.0 0
%%Version: 1.0 0
%%Copyright: (Copyright 2002-2003 The Apache Software Foundation. License terms: http://www.apache.org/licenses/LICENSE-2.0)
/BeginEPSF { %def
/b4_Inc_state save def         % Save state for cleanup
/dict_count countdictstack def % Count objects on dict stack
/op_count count 1 sub def      % Count objects on operand stack
userdict begin                 % Push userdict on dict stack
/showpage { } def              % Redefine showpage, { } = null proc
0 setgray 0 setlinecap         % Prepare graphics state
1 setlinewidth 0 setlinejoin
10 setmiterlimit [ ] 0 setdash newpath
/languagelevel where           % If level not equal to 1 then
{pop languagelevel             % set strokeadjust and
1 ne                           % overprint to their defaults.
{false setstrokeadjust false setoverprint
} if
} if
} bd
/EndEPSF { %def
count op_count sub {pop} repeat            % Clean up stacks
countdictstack dict_count sub {end} repeat
b4_Inc_state restore
} bd
%%EndResource
%FOPBeginFontDict
%%IncludeResource: font Courier-Oblique
%%IncludeResource: font Courier-BoldOblique
%%IncludeResource: font Courier-Bold
%%IncludeResource: font ZapfDingbats
%%IncludeResource: font Symbol
%%IncludeResource: font Helvetica
%%IncludeResource: font Helvetica-Oblique
%%IncludeResource: font Helvetica-Bold
%%IncludeResource: font Helvetica-BoldOblique
%%IncludeResource: font Times-Roman
%%IncludeResource: font Times-Italic
%%IncludeResource: font Times-Bold
%%IncludeResource: font Times-BoldItalic
%%IncludeResource: font Courier
%FOPEndFontDict
%%BeginResource: encoding WinAnsiEncoding
/WinAnsiEncoding [
/.notdef /.notdef /.notdef /.notdef /.notdef
/.notdef /.notdef /.notdef /.notdef /.notdef
/.notdef /.notdef /.notdef /.notdef /.notdef
/.notdef /.notdef /.notdef /.notdef /.notdef
/.notdef /.notdef /.notdef /.notdef /.notdef
/.notdef /.notdef /.notdef /.notdef /.notdef
/.notdef /.notdef /space /exclam /quotedbl
/numbersign /dollar /percent /ampersand /quotesingle
/parenleft /parenright /asterisk /plus /comma
/hyphen /period /slash /zero /one
/two /three /four /five /six
/seven /eight /nine /colon /semicolon
/less /equal /greater /question /at
/A /B /C /D /E
/F /G /H /I /J
/K /L /M /N /O
/P /Q /R /S /T
/U /V /W /X /Y
/Z /bracketleft /backslash /bracketright /asciicircum
/underscore /quoteleft /a /b /c
/d /e /f /g /h
/i /j /k /l /m
/n /o /p /q /r
/s /t /u /v /w
/x /y /z /braceleft /bar
/braceright /asciitilde /bullet /Euro /bullet
/quotesinglbase /florin /quotedblbase /ellipsis /dagger
/daggerdbl /circumflex /perthousand /Scaron /guilsinglleft
/OE /bullet /Zcaron /bullet /bullet
/quoteleft /quoteright /quotedblleft /quotedblright /bullet
/endash /emdash /asciitilde /trademark /scaron
/guilsinglright /oe /bullet /zcaron /Ydieresis
/space /exclamdown /cent /sterling /currency
/yen /brokenbar /section /dieresis /copyright
/ordfeminine /guillemotleft /logicalnot /sfthyphen /registered
/macron /degree /plusminus /twosuperior /threesuperior
/acute /mu /paragraph /middot /cedilla
/onesuperior /ordmasculine /guillemotright /onequarter /onehalf
/threequarters /questiondown /Agrave /Aacute /Acircumflex
/Atilde /Adieresis /Aring /AE /Ccedilla
/Egrave /Eacute /Ecircumflex /Edieresis /Igrave
/Iacute /Icircumflex /Idieresis /Eth /Ntilde
/Ograve /Oacute /Ocircumflex /Otilde /Odieresis
/multiply /Oslash /Ugrave /Uacute /Ucircumflex
/Udieresis /Yacute /Thorn /germandbls /agrave
/aacute /acircumflex /atilde /adieresis /aring
/ae /ccedilla /egrave /eacute /ecircumflex
/edieresis /igrave /iacute /icircumflex /idieresis
/eth /ntilde /ograve /oacute /ocircumflex
/otilde /odieresis /divide /oslash /ugrave
/uacute /ucircumflex /udieresis /yacute /thorn
/ydieresis
] def
%%EndResource
%FOPBeginFontReencode
/Courier-Oblique findfont
dup length dict begin
  {1 index /FID ne {def} {pop pop} ifelse} forall
  /Encoding WinAnsiEncoding def
  currentdict
end
/Courier-Oblique exch definefont pop
/Courier-BoldOblique findfont
dup length dict begin
  {1 index /FID ne {def} {pop pop} ifelse} forall
  /Encoding WinAnsiEncoding def
  currentdict
end
/Courier-BoldOblique exch definefont pop
/Courier-Bold findfont
dup length dict begin
  {1 index /FID ne {def} {pop pop} ifelse} forall
  /Encoding WinAnsiEncoding def
  currentdict
end
/Courier-Bold exch definefont pop
/Helvetica findfont
dup length dict begin
  {1 index /FID ne {def} {pop pop} ifelse} forall
  /Encoding WinAnsiEncoding def
  currentdict
end
/Helvetica exch definefont pop
/Helvetica-Oblique findfont
dup length dict begin
  {1 index /FID ne {def} {pop pop} ifelse} forall
  /Encoding WinAnsiEncoding def
  currentdict
end
/Helvetica-Oblique exch definefont pop
/Helvetica-Bold findfont
dup length dict begin
  {1 index /FID ne {def} {pop pop} ifelse} forall
  /Encoding WinAnsiEncoding def
  currentdict
end
/Helvetica-Bold exch definefont pop
/Helvetica-BoldOblique findfont
dup length dict begin
  {1 index /FID ne {def} {pop pop} ifelse} forall
  /Encoding WinAnsiEncoding def
  currentdict
end
/Helvetica-BoldOblique exch definefont pop
/Times-Roman findfont
dup length dict begin
  {1 index /FID ne {def} {pop pop} ifelse} forall
  /Encoding WinAnsiEncoding def
  currentdict
end
/Times-Roman exch definefont pop
/Times-Italic findfont
dup length dict begin
  {1 index /FID ne {def} {pop pop} ifelse} forall
  /Encoding WinAnsiEncoding def
  currentdict
end
/Times-Italic exch definefont pop
/Times-Bold findfont
dup length dict begin
  {1 index /FID ne {def} {pop pop} ifelse} forall
  /Encoding WinAnsiEncoding def
  currentdict
end
/Times-Bold exch definefont pop
/Times-BoldItalic findfont
dup length dict begin
  {1 index /FID ne {def} {pop pop} ifelse} forall
  /Encoding WinAnsiEncoding def
  currentdict
end
/Times-BoldItalic exch definefont pop
/Courier findfont
dup length dict begin
  {1 index /FID ne {def} {pop pop} ifelse} forall
  /Encoding WinAnsiEncoding def
  currentdict
end
/Courier exch definefont pop
%FOPEndFontReencode
%%EndProlog
%%Page: 1 1
%%PageBoundingBox: 0 0 1440 722
%%BeginPageSetup
[1 0 0 -1 0 722] CT
%%EndPageSetup
GS
[0.75 0 0 0.75 0 -0.25] CT
1 GC
N
0 0 1920 963 re
f
GR
GS
[0.75 0 0 0.75 0 -0.25] CT
1 GC
N
0 0 1920 963 re
f
GR
GS
[0.75 0 0 0.75 0 -0.25] CT
1 GC
N
250 785.5 M
892 785.5 L
892 143.5 L
250 143.5 L
cp
f
GR
GS
[0.75 0 0 0.75 0 -0.25] CT
0.149 GC
2 setlinecap
1 LJ
2.667 LW
N
250 785.5 M
892 785.5 L
S
GR
GS
[0.75 0 0 0.75 0 -0.25] CT
0.149 GC
2 setlinecap
1 LJ
2.667 LW
N
250 143.5 M
892 143.5 L
S
GR
GS
[0.75 0 0 0.75 0 -0.25] CT
0.149 GC
2 setlinecap
1 LJ
2.667 LW
N
250 785.5 M
250 779.08 L
S
GR
GS
[0.75 0 0 0.75 0 -0.25] CT
0.149 GC
2 setlinecap
1 LJ
2.667 LW
N
410.5 785.5 M
410.5 779.08 L
S
GR
GS
[0.75 0 0 0.75 0 -0.25] CT
0.149 GC
2 setlinecap
1 LJ
2.667 LW
N
571 785.5 M
571 779.08 L
S
GR
GS
[0.75 0 0 0.75 0 -0.25] CT
0.149 GC
2 setlinecap
1 LJ
2.667 LW
N
731.5 785.5 M
731.5 779.08 L
S
GR
GS
[0.75 0 0 0.75 0 -0.25] CT
0.149 GC
2 setlinecap
1 LJ
2.667 LW
N
892 785.5 M
892 779.08 L
S
GR
GS
[0.75 0 0 0.75 0 -0.25] CT
0.149 GC
2 setlinecap
1 LJ
2.667 LW
N
250 143.5 M
250 149.92 L
S
GR
GS
[0.75 0 0 0.75 0 -0.25] CT
0.149 GC
2 setlinecap
1 LJ
2.667 LW
N
410.5 143.5 M
410.5 149.92 L
S
GR
GS
[0.75 0 0 0.75 0 -0.25] CT
0.149 GC
2 setlinecap
1 LJ
2.667 LW
N
571 143.5 M
571 149.92 L
S
GR
GS
[0.75 0 0 0.75 0 -0.25] CT
0.149 GC
2 setlinecap
1 LJ
2.667 LW
N
731.5 143.5 M
731.5 149.92 L
S
GR
GS
[0.75 0 0 0.75 0 -0.25] CT
0.149 GC
2 setlinecap
1 LJ
2.667 LW
N
892 143.5 M
892 149.92 L
S
GR
GS
[0.75 0 0 0.75 187.5 596.07498] CT
0.149 GC
/Helvetica 34.667 F
GS
[1 0 0 1 0 0] CT
-15.5 35 moveto 
1 -1 scale
(-2) t 
GR
GR
GS
[0.75 0 0 0.75 307.875 596.07498] CT
0.149 GC
/Helvetica 34.667 F
GS
[1 0 0 1 0 0] CT
-15.5 35 moveto 
1 -1 scale
(-1) t 
GR
GR
GS
[0.75 0 0 0.75 428.25 596.07498] CT
0.149 GC
/Helvetica 34.667 F
GS
[1 0 0 1 0 0] CT
-10 35 moveto 
1 -1 scale
(0) t 
GR
GR
GS
[0.75 0 0 0.75 548.625 596.07498] CT
0.149 GC
/Helvetica 34.667 F
GS
[1 0 0 1 0 0] CT
-10 35 moveto 
1 -1 scale
(1) t 
GR
GR
GS
[0.75 0 0 0.75 669 596.07498] CT
0.149 GC
/Helvetica 34.667 F
GS
[1 0 0 1 0 0] CT
-10 35 moveto 
1 -1 scale
(2) t 
GR
GR
GS
[0.75 0 0 0.75 420.75 658.25] CT
0.149 GC
N
11.203 7.438 M
11.203 6.594 11.586 4.961 QT
11.969 3.328 12.516 1.477 QT
13.063 -0.375 13.453 -1.563 QT
13.594 -3.453 13.594 -4.422 QT
13.594 -6.859 13.117 -8.969 QT
12.641 -11.078 11.305 -12.5 QT
9.969 -13.922 7.578 -13.922 QT
6.313 -13.922 5.055 -13.383 QT
3.797 -12.844 2.898 -11.875 QT
2 -10.906 1.672 -9.688 QT
1.594 -9.469 1.375 -9.469 QT
0.906 -9.469 L
0.609 -9.469 0.609 -9.797 QT
0.609 -9.922 L
1.047 -11.641 2.125 -13.227 QT
3.203 -14.813 4.773 -15.805 QT
6.344 -16.797 8.094 -16.797 QT
9.875 -16.797 11.172 -15.586 QT
12.469 -14.375 13.25 -12.523 QT
14.031 -10.672 14.375 -8.781 QT
14.719 -6.891 14.719 -5.219 QT
16.625 -10.406 19 -15.047 QT
19.578 -16.266 L
19.688 -16.391 19.828 -16.391 QT
20.297 -16.391 L
20.594 -16.391 20.594 -16.031 QT
20.594 -15.953 20.516 -15.813 QT
19.953 -14.625 L
18.297 -11.344 16.914 -7.961 QT
15.531 -4.578 14.547 -1.453 QT
14.406 -0.172 13.984 2.055 QT
13.563 4.281 12.969 6.203 QT
12.375 8.125 11.781 8.203 QT
11.203 8.203 11.203 7.438 QT
cp
f
GR
GS
[0.75 0 0 0.75 0 -0.25] CT
0.149 GC
2 setlinecap
1 LJ
2.667 LW
N
250 785.5 M
250 143.5 L
S
GR
GS
[0.75 0 0 0.75 0 -0.25] CT
0.149 GC
2 setlinecap
1 LJ
2.667 LW
N
892 785.5 M
892 143.5 L
S
GR
GS
[0.75 0 0 0.75 0 -0.25] CT
0.149 GC
2 setlinecap
1 LJ
2.667 LW
N
250 785.5 M
256.42 785.5 L
S
GR
GS
[0.75 0 0 0.75 0 -0.25] CT
0.149 GC
2 setlinecap
1 LJ
2.667 LW
N
250 705.25 M
256.42 705.25 L
S
GR
GS
[0.75 0 0 0.75 0 -0.25] CT
0.149 GC
2 setlinecap
1 LJ
2.667 LW
N
250 625 M
256.42 625 L
S
GR
GS
[0.75 0 0 0.75 0 -0.25] CT
0.149 GC
2 setlinecap
1 LJ
2.667 LW
N
250 544.75 M
256.42 544.75 L
S
GR
GS
[0.75 0 0 0.75 0 -0.25] CT
0.149 GC
2 setlinecap
1 LJ
2.667 LW
N
250 464.5 M
256.42 464.5 L
S
GR
GS
[0.75 0 0 0.75 0 -0.25] CT
0.149 GC
2 setlinecap
1 LJ
2.667 LW
N
250 384.25 M
256.42 384.25 L
S
GR
GS
[0.75 0 0 0.75 0 -0.25] CT
0.149 GC
2 setlinecap
1 LJ
2.667 LW
N
250 304 M
256.42 304 L
S
GR
GS
[0.75 0 0 0.75 0 -0.25] CT
0.149 GC
2 setlinecap
1 LJ
2.667 LW
N
250 223.75 M
256.42 223.75 L
S
GR
GS
[0.75 0 0 0.75 0 -0.25] CT
0.149 GC
2 setlinecap
1 LJ
2.667 LW
N
250 143.5 M
256.42 143.5 L
S
GR
GS
[0.75 0 0 0.75 0 -0.25] CT
0.149 GC
2 setlinecap
1 LJ
2.667 LW
N
892 785.5 M
885.58 785.5 L
S
GR
GS
[0.75 0 0 0.75 0 -0.25] CT
0.149 GC
2 setlinecap
1 LJ
2.667 LW
N
892 705.25 M
885.58 705.25 L
S
GR
GS
[0.75 0 0 0.75 0 -0.25] CT
0.149 GC
2 setlinecap
1 LJ
2.667 LW
N
892 625 M
885.58 625 L
S
GR
GS
[0.75 0 0 0.75 0 -0.25] CT
0.149 GC
2 setlinecap
1 LJ
2.667 LW
N
892 544.75 M
885.58 544.75 L
S
GR
GS
[0.75 0 0 0.75 0 -0.25] CT
0.149 GC
2 setlinecap
1 LJ
2.667 LW
N
892 464.5 M
885.58 464.5 L
S
GR
GS
[0.75 0 0 0.75 0 -0.25] CT
0.149 GC
2 setlinecap
1 LJ
2.667 LW
N
892 384.25 M
885.58 384.25 L
S
GR
GS
[0.75 0 0 0.75 0 -0.25] CT
0.149 GC
2 setlinecap
1 LJ
2.667 LW
N
892 304 M
885.58 304 L
S
GR
GS
[0.75 0 0 0.75 0 -0.25] CT
0.149 GC
2 setlinecap
1 LJ
2.667 LW
N
892 223.75 M
885.58 223.75 L
S
GR
GS
[0.75 0 0 0.75 0 -0.25] CT
0.149 GC
2 setlinecap
1 LJ
2.667 LW
N
892 143.5 M
885.58 143.5 L
S
GR
GS
[0.75 0 0 0.75 180.30001 588.875] CT
0.149 GC
/Helvetica 34.667 F
GS
[1 0 0 1 0 0] CT
-31 13.5 moveto 
1 -1 scale
(-2) t 
GR
GR
GS
[0.75 0 0 0.75 180.30001 528.6875] CT
0.149 GC
/Helvetica 34.667 F
GS
[1 0 0 1 0 0] CT
-60 13.5 moveto 
1 -1 scale
(-1.5) t 
GR
GR
GS
[0.75 0 0 0.75 180.30001 468.5] CT
0.149 GC
/Helvetica 34.667 F
GS
[1 0 0 1 0 0] CT
-31 13.5 moveto 
1 -1 scale
(-1) t 
GR
GR
GS
[0.75 0 0 0.75 180.30001 408.3125] CT
0.149 GC
/Helvetica 34.667 F
GS
[1 0 0 1 0 0] CT
-60 13.5 moveto 
1 -1 scale
(-0.5) t 
GR
GR
GS
[0.75 0 0 0.75 180.30001 348.125] CT
0.149 GC
/Helvetica 34.667 F
GS
[1 0 0 1 0 0] CT
-20 13.5 moveto 
1 -1 scale
(0) t 
GR
GR
GS
[0.75 0 0 0.75 180.30001 287.9375] CT
0.149 GC
/Helvetica 34.667 F
GS
[1 0 0 1 0 0] CT
-49 13.5 moveto 
1 -1 scale
(0.5) t 
GR
GR
GS
[0.75 0 0 0.75 180.30001 227.75] CT
0.149 GC
/Helvetica 34.667 F
GS
[1 0 0 1 0 0] CT
-20 13.5 moveto 
1 -1 scale
(1) t 
GR
GR
GS
[0.75 0 0 0.75 180.30001 167.5625] CT
0.149 GC
/Helvetica 34.667 F
GS
[1 0 0 1 0 0] CT
-49 13.5 moveto 
1 -1 scale
(1.5) t 
GR
GR
GS
[0.75 0 0 0.75 180.30001 107.375] CT
0.149 GC
/Helvetica 34.667 F
GS
[1 0 0 1 0 0] CT
-20 13.5 moveto 
1 -1 scale
(2) t 
GR
GR
GS
[0 -0.75 0.75 0 125.25 373.25] CT
0.149 GC
/Helvetica 38.133 F
GS
[1 0 0 1 0 0] CT
0 0 moveto 
1 -1 scale
(g\() t 
GR
GR
GS
[0 -0.75 0.75 0 125.25 347.75] CT
0.149 GC
N
/f854921044{11.203 7.438 M
11.203 6.594 11.586 4.961 QT
11.969 3.328 12.516 1.477 QT
13.063 -0.375 13.453 -1.563 QT
13.594 -3.453 13.594 -4.422 QT
13.594 -6.859 13.117 -8.969 QT
12.641 -11.078 11.305 -12.5 QT
9.969 -13.922 7.578 -13.922 QT
6.313 -13.922 5.055 -13.383 QT
3.797 -12.844 2.898 -11.875 QT
2 -10.906 1.672 -9.688 QT
1.594 -9.469 1.375 -9.469 QT
0.906 -9.469 L
0.609 -9.469 0.609 -9.797 QT
0.609 -9.922 L
1.047 -11.641 2.125 -13.227 QT
3.203 -14.813 4.773 -15.805 QT
6.344 -16.797 8.094 -16.797 QT
9.875 -16.797 11.172 -15.586 QT
12.469 -14.375 13.25 -12.523 QT
14.031 -10.672 14.375 -8.781 QT
14.719 -6.891 14.719 -5.219 QT
16.625 -10.406 19 -15.047 QT
19.578 -16.266 L
19.688 -16.391 19.828 -16.391 QT
20.297 -16.391 L
20.594 -16.391 20.594 -16.031 QT
20.594 -15.953 20.516 -15.813 QT
19.953 -14.625 L
18.297 -11.344 16.914 -7.961 QT
15.531 -4.578 14.547 -1.453 QT
14.406 -0.172 13.984 2.055 QT
13.563 4.281 12.969 6.203 QT
12.375 8.125 11.781 8.203 QT
11.203 8.203 11.203 7.438 QT
cp}def
f854921044
f
GR
GS
[0 -0.75 0.75 0 125.25 332.75] CT
0.149 GC
/Helvetica 38.133 F
GS
[1 0 0 1 0 0] CT
0 0 moveto 
1 -1 scale
(\)) t 
GR
GR
GS
[0.75 0 0 0.75 187.5 189.12039] CT
N
2.222 0 M
2.222 1.227 1.227 2.222 0 2.222 C
-1.227 2.222 -2.222 1.227 -2.222 0 C
-2.222 -1.227 -1.227 -2.222 0 -2.222 C
1.227 -2.222 2.222 -1.227 2.222 0 C
cp
f
GR
GS
[0.75 0 0 0.75 188.70375 182.93695] CT
N
/f-1759579234{2.222 0 M
2.222 1.227 1.227 2.222 0 2.222 C
-1.227 2.222 -2.222 1.227 -2.222 0 C
-2.222 -1.227 -1.227 -2.222 0 -2.222 C
1.227 -2.222 2.222 -1.227 2.222 0 C
cp}def
f-1759579234
f
GR
GS
[0.75 0 0 0.75 189.90749 176.96704] CT
N
f-1759579234
f
GR
GS
[0.75 0 0 0.75 191.11125 171.27732] CT
N
f-1759579234
f
GR
GS
[0.75 0 0 0.75 192.31499 165.93143] CT
N
f-1759579234
f
GR
GS
[0.75 0 0 0.75 193.51875 160.98713] CT
N
f-1759579234
f
GR
GS
[0.75 0 0 0.75 194.7225 156.49376] CT
N
f-1759579234
f
GR
GS
[0.75 0 0 0.75 195.92626 152.48997] CT
N
f-1759579234
f
GR
GS
[0.75 0 0 0.75 197.13 149.00188] CT
N
f-1759579234
f
GR
GS
[0.75 0 0 0.75 198.33376 146.04208] CT
N
f-1759579234
f
GR
GS
[0.75 0 0 0.75 199.53751 143.60944] CT
N
f-1759579234
f
GR
GS
[0.75 0 0 0.75 200.74125 141.68962] CT
N
f-1759579234
f
GR
GS
[0.75 0 0 0.75 201.94501 140.25629] CT
N
f-1759579234
f
GR
GS
[0.75 0 0 0.75 203.14874 139.27304] CT
N
f-1759579234
f
GR
GS
[0.75 0 0 0.75 204.3525 138.69555] CT
N
f-1759579234
f
GR
GS
[0.75 0 0 0.75 205.55624 138.47391] CT
N
f-1759579234
f
GR
GS
[0.75 0 0 0.75 206.75999 138.55517] CT
N
f-1759579234
f
GR
GS
[0.75 0 0 0.75 207.96375 138.88533] CT
N
f-1759579234
f
GR
GS
[0.75 0 0 0.75 209.16749 139.41143] CT
N
f-1759579234
f
GR
GS
[0.75 0 0 0.75 210.37125 140.08302] CT
N
f-1759579234
f
GR
GS
[0.75 0 0 0.75 211.575 140.85349] CT
N
f-1759579234
f
GR
GS
[0.75 0 0 0.75 212.77876 141.68084] CT
N
f-1759579234
f
GR
GS
[0.75 0 0 0.75 213.9825 142.52829] CT
N
f-1759579234
f
GR
GS
[0.75 0 0 0.75 215.18626 143.36448] CT
N
f-1759579234
f
GR
GS
[0.75 0 0 0.75 216.38999 144.16367] CT
N
f-1759579234
f
GR
GS
[0.75 0 0 0.75 217.59375 144.90545] CT
N
f-1759579234
f
GR
GS
[0.75 0 0 0.75 218.79751 145.57468] CT
N
f-1759579234
f
GR
GS
[0.75 0 0 0.75 220.00124 146.16104] CT
N
f-1759579234
f
GR
GS
[0.75 0 0 0.75 221.205 146.65878] CT
N
f-1759579234
f
GR
GS
[0.75 0 0 0.75 222.40874 147.06627] CT
N
f-1759579234
f
GR
GS
[0.75 0 0 0.75 223.6125 147.38565] CT
N
f-1759579234
f
GR
GS
[0.75 0 0 0.75 224.81625 147.62235] CT
N
f-1759579234
f
GR
GS
[0.75 0 0 0.75 226.02001 147.78475] CT
N
f-1759579234
f
GR
GS
[0.75 0 0 0.75 227.22375 147.88367] CT
N
f-1759579234
f
GR
GS
[0.75 0 0 0.75 228.42751 147.93208] CT
N
f-1759579234
f
GR
GS
[0.75 0 0 0.75 229.63126 147.9445] CT
N
f-1759579234
f
GR
GS
[0.75 0 0 0.75 230.835 147.93673] CT
N
f-1759579234
f
GR
GS
[0.75 0 0 0.75 232.03876 147.92526] CT
N
f-1759579234
f
GR
GS
[0.75 0 0 0.75 233.24249 147.9269] CT
N
f-1759579234
f
GR
GS
[0.75 0 0 0.75 234.44625 147.95821] CT
N
f-1759579234
f
GR
GS
[0.75 0 0 0.75 235.64999 148.03518] CT
N
f-1759579234
f
GR
GS
[0.75 0 0 0.75 236.85374 148.17263] CT
N
f-1759579234
f
GR
GS
[0.75 0 0 0.75 238.0575 148.38388] CT
N
f-1759579234
f
GR
GS
[0.75 0 0 0.75 239.26124 148.68037] CT
N
f-1759579234
f
GR
GS
[0.75 0 0 0.75 240.465 149.07125] CT
N
f-1759579234
f
GR
GS
[0.75 0 0 0.75 241.66875 149.56328] CT
N
f-1759579234
f
GR
GS
[0.75 0 0 0.75 242.87251 150.1605] CT
N
f-1759579234
f
GR
GS
[0.75 0 0 0.75 244.07625 150.86427] CT
N
f-1759579234
f
GR
GS
[0.75 0 0 0.75 245.28001 151.6732] CT
N
f-1759579234
f
GR
GS
[0.75 0 0 0.75 246.48374 152.58341] CT
N
f-1759579234
f
GR
GS
[0.75 0 0 0.75 247.6875 153.5886] CT
N
f-1759579234
f
GR
GS
[0.75 0 0 0.75 248.89126 154.68038] CT
N
f-1759579234
f
GR
GS
[0.75 0 0 0.75 250.09499 155.84867] CT
N
f-1759579234
f
GR
GS
[0.75 0 0 0.75 251.29875 157.08204] CT
N
f-1759579234
f
GR
GS
[0.75 0 0 0.75 252.50249 158.36817] CT
N
f-1759579234
f
GR
GS
[0.75 0 0 0.75 253.70625 159.69426] CT
N
f-1759579234
f
GR
GS
[0.75 0 0 0.75 254.91 161.04754] CT
N
f-1759579234
f
GR
GS
[0.75 0 0 0.75 256.11376 162.41555] CT
N
f-1759579234
f
GR
GS
[0.75 0 0 0.75 257.3175 163.78661] CT
N
f-1759579234
f
GR
GS
[0.75 0 0 0.75 258.52126 165.15017] CT
N
f-1759579234
f
GR
GS
[0.75 0 0 0.75 259.72501 166.497] CT
N
f-1759579234
f
GR
GS
[0.75 0 0 0.75 260.92875 167.8195] CT
N
f-1759579234
f
GR
GS
[0.75 0 0 0.75 262.13251 169.1119] CT
N
f-1759579234
f
GR
GS
[0.75 0 0 0.75 263.33624 170.37035] CT
N
f-1759579234
f
GR
GS
[0.75 0 0 0.75 264.54 171.59303] CT
N
f-1759579234
f
GR
GS
[0.75 0 0 0.75 265.74374 172.78023] CT
N
f-1759579234
f
GR
GS
[0.75 0 0 0.75 266.94749 173.93434] CT
N
f-1759579234
f
GR
GS
[0.75 0 0 0.75 268.15125 175.05983] CT
N
f-1759579234
f
GR
GS
[0.75 0 0 0.75 269.35499 176.16324] CT
N
f-1759579234
f
GR
GS
[0.75 0 0 0.75 270.55875 177.25301] CT
N
f-1759579234
f
GR
GS
[0.75 0 0 0.75 271.7625 178.3395] CT
N
f-1759579234
f
GR
GS
[0.75 0 0 0.75 272.96626 179.43462] CT
N
f-1759579234
f
GR
GS
[0.75 0 0 0.75 274.17 180.55189] CT
N
f-1759579234
f
GR
GS
[0.75 0 0 0.75 275.37376 181.70601] CT
N
f-1759579234
f
GR
GS
[0.75 0 0 0.75 276.57749 182.91275] CT
N
f-1759579234
f
GR
GS
[0.75 0 0 0.75 277.78125 184.1885] CT
N
f-1759579234
f
GR
GS
[0.75 0 0 0.75 278.98501 185.55008] CT
N
f-1759579234
f
GR
GS
[0.75 0 0 0.75 280.18874 187.01425] CT
N
f-1759579234
f
GR
GS
[0.75 0 0 0.75 281.3925 188.59737] CT
N
f-1759579234
f
GR
GS
[0.75 0 0 0.75 282.59624 190.3149] CT
N
f-1759579234
f
GR
GS
[0.75 0 0 0.75 283.8 192.1811] CT
N
f-1759579234
f
GR
GS
[0.75 0 0 0.75 285.00375 194.20844] CT
N
f-1759579234
f
GR
GS
[0.75 0 0 0.75 286.20751 196.40733] CT
N
f-1759579234
f
GR
GS
[0.75 0 0 0.75 287.41125 198.78564] CT
N
f-1759579234
f
GR
GS
[0.75 0 0 0.75 288.61501 201.34848] CT
N
f-1759579234
f
GR
GS
[0.75 0 0 0.75 289.81876 204.09792] CT
N
f-1759579234
f
GR
GS
[0.75 0 0 0.75 291.0225 207.03276] CT
N
f-1759579234
f
GR
GS
[0.75 0 0 0.75 292.22626 210.14869] CT
N
f-1759579234
f
GR
GS
[0.75 0 0 0.75 293.42999 213.43813] CT
N
f-1759579234
f
GR
GS
[0.75 0 0 0.75 294.63375 216.89052] CT
N
f-1759579234
f
GR
GS
[0.75 0 0 0.75 295.83749 220.49248] CT
N
f-1759579234
f
GR
GS
[0.75 0 0 0.75 297.04124 224.22826] CT
N
f-1759579234
f
GR
GS
[0.75 0 0 0.75 298.245 228.08009] CT
N
f-1759579234
f
GR
GS
[0.75 0 0 0.75 299.44874 232.02865] CT
N
f-1759579234
f
GR
GS
[0.75 0 0 0.75 300.6525 236.05354] CT
N
f-1759579234
f
GR
GS
[0.75 0 0 0.75 301.85625 240.13377] CT
N
f-1759579234
f
GR
GS
[0.75 0 0 0.75 303.06001 244.24828] CT
N
f-1759579234
f
GR
GS
[0.75 0 0 0.75 304.26375 248.37637] CT
N
f-1759579234
f
GR
GS
[0.75 0 0 0.75 305.46751 252.49803] CT
N
f-1759579234
f
GR
GS
[0.75 0 0 0.75 306.67124 256.59431] CT
N
f-1759579234
f
GR
GS
[0.75 0 0 0.75 307.875 260.6476] CT
N
f-1759579234
f
GR
GS
[0.75 0 0 0.75 309.07876 264.64182] CT
N
f-1759579234
f
GR
GS
[0.75 0 0 0.75 310.28249 268.56256] CT
N
f-1759579234
f
GR
GS
[0.75 0 0 0.75 311.48625 272.39711] CT
N
f-1759579234
f
GR
GS
[0.75 0 0 0.75 312.69001 276.13457] CT
N
f-1759579234
f
GR
GS
[0.75 0 0 0.75 313.89375 279.76575] CT
N
f-1759579234
f
GR
GS
[0.75 0 0 0.75 315.0975 283.28314] CT
N
f-1759579234
f
GR
GS
[0.75 0 0 0.75 316.30124 286.68087] CT
N
f-1759579234
f
GR
GS
[0.75 0 0 0.75 317.505 289.9545] CT
N
f-1759579234
f
GR
GS
[0.75 0 0 0.75 318.70876 293.10094] CT
N
f-1759579234
f
GR
GS
[0.75 0 0 0.75 319.91251 296.11842] CT
N
f-1759579234
f
GR
GS
[0.75 0 0 0.75 321.11625 299.0062] CT
N
f-1759579234
f
GR
GS
[0.75 0 0 0.75 322.32001 301.76453] CT
N
f-1759579234
f
GR
GS
[0.75 0 0 0.75 323.52374 304.39452] CT
N
f-1759579234
f
GR
GS
[0.75 0 0 0.75 324.7275 306.89798] CT
N
f-1759579234
f
GR
GS
[0.75 0 0 0.75 325.93124 309.27739] CT
N
f-1759579234
f
GR
GS
[0.75 0 0 0.75 327.13499 311.53568] CT
N
f-1759579234
f
GR
GS
[0.75 0 0 0.75 328.33875 313.67622] CT
N
f-1759579234
f
GR
GS
[0.75 0 0 0.75 329.54251 315.70277] CT
N
f-1759579234
f
GR
GS
[0.75 0 0 0.75 330.74625 317.61929] CT
N
f-1759579234
f
GR
GS
[0.75 0 0 0.75 331.95 319.42992] CT
N
f-1759579234
f
GR
GS
[0.75 0 0 0.75 333.15374 321.13901] CT
N
f-1759579234
f
GR
GS
[0.75 0 0 0.75 334.3575 322.75093] CT
N
f-1759579234
f
GR
GS
[0.75 0 0 0.75 335.56126 324.27013] CT
N
f-1759579234
f
GR
GS
[0.75 0 0 0.75 336.76499 325.70106] CT
N
f-1759579234
f
GR
GS
[0.75 0 0 0.75 337.96875 327.0481] CT
N
f-1759579234
f
GR
GS
[0.75 0 0 0.75 339.17251 328.31562] CT
N
f-1759579234
f
GR
GS
[0.75 0 0 0.75 340.37624 329.50787] CT
N
f-1759579234
f
GR
GS
[0.75 0 0 0.75 341.58 330.629] CT
N
f-1759579234
f
GR
GS
[0.75 0 0 0.75 342.78376 331.68311] CT
N
f-1759579234
f
GR
GS
[0.75 0 0 0.75 343.9875 332.67408] CT
N
f-1759579234
f
GR
GS
[0.75 0 0 0.75 345.19125 333.60567] CT
N
f-1759579234
f
GR
GS
[0.75 0 0 0.75 346.39499 334.48154] CT
N
f-1759579234
f
GR
GS
[0.75 0 0 0.75 347.59875 335.30512] CT
N
f-1759579234
f
GR
GS
[0.75 0 0 0.75 348.80251 336.07975] CT
N
f-1759579234
f
GR
GS
[0.75 0 0 0.75 350.00626 336.80856] CT
N
f-1759579234
f
GR
GS
[0.75 0 0 0.75 351.21 337.49454] CT
N
f-1759579234
f
GR
GS
[0.75 0 0 0.75 352.41376 338.14046] CT
N
f-1759579234
f
GR
GS
[0.75 0 0 0.75 353.61749 338.74904] CT
N
f-1759579234
f
GR
GS
[0.75 0 0 0.75 354.82125 339.32271] CT
N
f-1759579234
f
GR
GS
[0.75 0 0 0.75 356.02499 339.86381] CT
N
f-1759579234
f
GR
GS
[0.75 0 0 0.75 357.22874 340.37453] CT
N
f-1759579234
f
GR
GS
[0.75 0 0 0.75 358.4325 340.85686] CT
N
f-1759579234
f
GR
GS
[0.75 0 0 0.75 359.63626 341.31265] CT
N
f-1759579234
f
GR
GS
[0.75 0 0 0.75 360.84 341.74364] CT
N
f-1759579234
f
GR
GS
[0.75 0 0 0.75 362.04375 342.15139] CT
N
f-1759579234
f
GR
GS
[0.75 0 0 0.75 363.24749 342.53735] CT
N
f-1759579234
f
GR
GS
[0.75 0 0 0.75 364.45125 342.90281] CT
N
f-1759579234
f
GR
GS
[0.75 0 0 0.75 365.65501 343.24899] CT
N
f-1759579234
f
GR
GS
[0.75 0 0 0.75 366.85874 343.57696] CT
N
f-1759579234
f
GR
GS
[0.75 0 0 0.75 368.0625 343.88766] CT
N
f-1759579234
f
GR
GS
[0.75 0 0 0.75 369.26626 344.18201] CT
N
f-1759579234
f
GR
GS
[0.75 0 0 0.75 370.46999 344.46076] CT
N
f-1759579234
f
GR
GS
[0.75 0 0 0.75 371.67375 344.72464] CT
N
f-1759579234
f
GR
GS
[0.75 0 0 0.75 372.87751 344.97426] CT
N
f-1759579234
f
GR
GS
[0.75 0 0 0.75 374.08125 345.21026] CT
N
f-1759579234
f
GR
GS
[0.75 0 0 0.75 375.285 345.4331] CT
N
f-1759579234
f
GR
GS
[0.75 0 0 0.75 376.48874 345.64335] CT
N
f-1759579234
f
GR
GS
[0.75 0 0 0.75 377.6925 345.8414] CT
N
f-1759579234
f
GR
GS
[0.75 0 0 0.75 378.89626 346.02773] CT
N
f-1759579234
f
GR
GS
[0.75 0 0 0.75 380.09999 346.20278] CT
N
f-1759579234
f
GR
GS
[0.75 0 0 0.75 381.30375 346.36691] CT
N
f-1759579234
f
GR
GS
[0.75 0 0 0.75 382.50751 346.52056] CT
N
f-1759579234
f
GR
GS
[0.75 0 0 0.75 383.71124 346.66412] CT
N
f-1759579234
f
GR
GS
[0.75 0 0 0.75 384.91498 346.79797] CT
N
f-1759579234
f
GR
GS
[0.75 0 0 0.75 386.11876 346.92252] CT
N
f-1759579234
f
GR
GS
[0.75 0 0 0.75 387.32249 347.03818] CT
N
f-1759579234
f
GR
GS
[0.75 0 0 0.75 388.52623 347.14532] CT
N
f-1759579234
f
GR
GS
[0.75 0 0 0.75 389.73001 347.24438] CT
N
f-1759579234
f
GR
GS
[0.75 0 0 0.75 390.93375 347.33575] CT
N
f-1759579234
f
GR
GS
[0.75 0 0 0.75 392.13748 347.41982] CT
N
f-1759579234
f
GR
GS
[0.75 0 0 0.75 393.34126 347.49697] CT
N
f-1759579234
f
GR
GS
[0.75 0 0 0.75 394.545 347.56763] CT
N
f-1759579234
f
GR
GS
[0.75 0 0 0.75 395.74873 347.63215] CT
N
f-1759579234
f
GR
GS
[0.75 0 0 0.75 396.95251 347.6909] CT
N
f-1759579234
f
GR
GS
[0.75 0 0 0.75 398.15625 347.74426] CT
N
f-1759579234
f
GR
GS
[0.75 0 0 0.75 399.35999 347.79255] CT
N
f-1759579234
f
GR
GS
[0.75 0 0 0.75 400.56377 347.83615] CT
N
f-1759579234
f
GR
GS
[0.75 0 0 0.75 401.7675 347.87538] CT
N
f-1759579234
f
GR
GS
[0.75 0 0 0.75 402.97124 347.91051] CT
N
f-1759579234
f
GR
GS
[0.75 0 0 0.75 404.17502 347.94189] CT
N
f-1759579234
f
GR
GS
[0.75 0 0 0.75 405.37875 347.9698] CT
N
f-1759579234
f
GR
GS
[0.75 0 0 0.75 406.58249 347.99447] CT
N
f-1759579234
f
GR
GS
[0.75 0 0 0.75 407.78627 348.01619] CT
N
f-1759579234
f
GR
GS
[0.75 0 0 0.75 408.99001 348.03516] CT
N
f-1759579234
f
GR
GS
[0.75 0 0 0.75 410.19374 348.05169] CT
N
f-1759579234
f
GR
GS
[0.75 0 0 0.75 411.39752 348.06593] CT
N
f-1759579234
f
GR
GS
[0.75 0 0 0.75 412.60126 348.07808] CT
N
f-1759579234
f
GR
GS
[0.75 0 0 0.75 413.80499 348.0884] CT
N
f-1759579234
f
GR
GS
[0.75 0 0 0.75 415.00873 348.09701] CT
N
f-1759579234
f
GR
GS
[0.75 0 0 0.75 416.21251 348.1041] CT
N
f-1759579234
f
GR
GS
[0.75 0 0 0.75 417.41624 348.10985] CT
N
f-1759579234
f
GR
GS
[0.75 0 0 0.75 418.61998 348.11443] CT
N
f-1759579234
f
GR
GS
[0.75 0 0 0.75 419.82376 348.11795] CT
N
f-1759579234
f
GR
GS
[0.75 0 0 0.75 421.0275 348.12058] CT
N
f-1759579234
f
GR
GS
[0.75 0 0 0.75 422.23123 348.12246] CT
N
f-1759579234
f
GR
GS
[0.75 0 0 0.75 423.43501 348.1237] CT
N
f-1759579234
f
GR
GS
[0.75 0 0 0.75 424.63875 348.12445] CT
N
f-1759579234
f
GR
GS
[0.75 0 0 0.75 425.84248 348.12484] CT
N
f-1759579234
f
GR
GS
[0.75 0 0 0.75 427.04626 348.12498] CT
N
f-1759579234
f
GR
GS
[0.75 0 0 0.75 428.25 348.125] CT
N
f-1759579234
f
GR
GS
[0.75 0 0 0.75 669 507.12962] CT
N
f-1759579234
f
GR
GS
[0.75 0 0 0.75 667.79626 513.31305] CT
N
f-1759579234
f
GR
GS
[0.75 0 0 0.75 666.59248 519.28297] CT
N
f-1759579234
f
GR
GS
[0.75 0 0 0.75 665.38875 524.97266] CT
N
f-1759579234
f
GR
GS
[0.75 0 0 0.75 664.18501 530.31856] CT
N
f-1759579234
f
GR
GS
[0.75 0 0 0.75 662.98128 535.26286] CT
N
f-1759579234
f
GR
GS
[0.75 0 0 0.75 661.7775 539.75623] CT
N
f-1759579234
f
GR
GS
[0.75 0 0 0.75 660.57376 543.76001] CT
N
f-1759579234
f
GR
GS
[0.75 0 0 0.75 659.36998 547.24812] CT
N
f-1759579234
f
GR
GS
[0.75 0 0 0.75 658.16624 550.20793] CT
N
f-1759579234
f
GR
GS
[0.75 0 0 0.75 656.96251 552.64058] CT
N
f-1759579234
f
GR
GS
[0.75 0 0 0.75 655.75873 554.56039] CT
N
f-1759579234
f
GR
GS
[0.75 0 0 0.75 654.55499 555.9937] CT
N
f-1759579234
f
GR
GS
[0.75 0 0 0.75 653.35126 556.97697] CT
N
f-1759579234
f
GR
GS
[0.75 0 0 0.75 652.14752 557.55444] CT
N
f-1759579234
f
GR
GS
[0.75 0 0 0.75 650.94374 557.77609] CT
N
f-1759579234
f
GR
GS
[0.75 0 0 0.75 649.74001 557.69484] CT
N
f-1759579234
f
GR
GS
[0.75 0 0 0.75 648.53627 557.36465] CT
N
f-1759579234
f
GR
GS
[0.75 0 0 0.75 647.33249 556.83859] CT
N
f-1759579234
f
GR
GS
[0.75 0 0 0.75 646.12875 556.16701] CT
N
f-1759579234
f
GR
GS
[0.75 0 0 0.75 644.92497 555.3965] CT
N
f-1759579234
f
GR
GS
[0.75 0 0 0.75 643.72124 554.56918] CT
N
f-1759579234
f
GR
GS
[0.75 0 0 0.75 642.5175 553.72173] CT
N
f-1759579234
f
GR
GS
[0.75 0 0 0.75 641.31377 552.88553] CT
N
f-1759579234
f
GR
GS
[0.75 0 0 0.75 640.10999 552.08632] CT
N
f-1759579234
f
GR
GS
[0.75 0 0 0.75 638.90625 551.34456] CT
N
f-1759579234
f
GR
GS
[0.75 0 0 0.75 637.70251 550.67531] CT
N
f-1759579234
f
GR
GS
[0.75 0 0 0.75 636.49873 550.08896] CT
N
f-1759579234
f
GR
GS
[0.75 0 0 0.75 635.295 549.59123] CT
N
f-1759579234
f
GR
GS
[0.75 0 0 0.75 634.09126 549.18373] CT
N
f-1759579234
f
GR
GS
[0.75 0 0 0.75 632.88753 548.86435] CT
N
f-1759579234
f
GR
GS
[0.75 0 0 0.75 631.68375 548.62764] CT
N
f-1759579234
f
GR
GS
[0.75 0 0 0.75 630.48001 548.46527] CT
N
f-1759579234
f
GR
GS
[0.75 0 0 0.75 629.27623 548.3663] CT
N
f-1759579234
f
GR
GS
[0.75 0 0 0.75 628.07249 548.31792] CT
N
f-1759579234
f
GR
GS
[0.75 0 0 0.75 626.86876 548.30551] CT
N
f-1759579234
f
GR
GS
[0.75 0 0 0.75 625.66498 548.31329] CT
N
f-1759579234
f
GR
GS
[0.75 0 0 0.75 624.46124 548.32474] CT
N
f-1759579234
f
GR
GS
[0.75 0 0 0.75 623.25751 548.32309] CT
N
f-1759579234
f
GR
GS
[0.75 0 0 0.75 622.05377 548.29178] CT
N
f-1759579234
f
GR
GS
[0.75 0 0 0.75 620.84999 548.21483] CT
N
f-1759579234
f
GR
GS
[0.75 0 0 0.75 619.64626 548.07736] CT
N
f-1759579234
f
GR
GS
[0.75 0 0 0.75 618.44252 547.8661] CT
N
f-1759579234
f
GR
GS
[0.75 0 0 0.75 617.23874 547.56966] CT
N
f-1759579234
f
GR
GS
[0.75 0 0 0.75 616.035 547.17873] CT
N
f-1759579234
f
GR
GS
[0.75 0 0 0.75 614.83122 546.68672] CT
N
f-1759579234
f
GR
GS
[0.75 0 0 0.75 613.62749 546.08948] CT
N
f-1759579234
f
GR
GS
[0.75 0 0 0.75 612.42375 545.38576] CT
N
f-1759579234
f
GR
GS
[0.75 0 0 0.75 611.22002 544.5768] CT
N
f-1759579234
f
GR
GS
[0.75 0 0 0.75 610.01624 543.66658] CT
N
f-1759579234
f
GR
GS
[0.75 0 0 0.75 608.8125 542.66138] CT
N
f-1759579234
f
GR
GS
[0.75 0 0 0.75 607.60876 541.56961] CT
N
f-1759579234
f
GR
GS
[0.75 0 0 0.75 606.40498 540.40131] CT
N
f-1759579234
f
GR
GS
[0.75 0 0 0.75 605.20125 539.16795] CT
N
f-1759579234
f
GR
GS
[0.75 0 0 0.75 603.99751 537.88182] CT
N
f-1759579234
f
GR
GS
[0.75 0 0 0.75 602.79378 536.55573] CT
N
f-1759579234
f
GR
GS
[0.75 0 0 0.75 601.59 535.20244] CT
N
f-1759579234
f
GR
GS
[0.75 0 0 0.75 600.38626 533.83446] CT
N
f-1759579234
f
GR
GS
[0.75 0 0 0.75 599.18248 532.46336] CT
N
f-1759579234
f
GR
GS
[0.75 0 0 0.75 597.97874 531.09982] CT
N
f-1759579234
f
GR
GS
[0.75 0 0 0.75 596.77501 529.75299] CT
N
f-1759579234
f
GR
GS
[0.75 0 0 0.75 595.57123 528.43051] CT
N
f-1759579234
f
GR
GS
[0.75 0 0 0.75 594.36749 527.13811] CT
N
f-1759579234
f
GR
GS
[0.75 0 0 0.75 593.16376 525.87962] CT
N
f-1759579234
f
GR
GS
[0.75 0 0 0.75 591.96002 524.65698] CT
N
f-1759579234
f
GR
GS
[0.75 0 0 0.75 590.75624 523.46977] CT
N
f-1759579234
f
GR
GS
[0.75 0 0 0.75 589.55251 522.31566] CT
N
f-1759579234
f
GR
GS
[0.75 0 0 0.75 588.34877 521.19016] CT
N
f-1759579234
f
GR
GS
[0.75 0 0 0.75 587.14499 520.08676] CT
N
f-1759579234
f
GR
GS
[0.75 0 0 0.75 585.94125 518.99696] CT
N
f-1759579234
f
GR
GS
[0.75 0 0 0.75 584.73747 517.91051] CT
N
f-1759579234
f
GR
GS
[0.75 0 0 0.75 583.53374 516.8154] CT
N
f-1759579234
f
GR
GS
[0.75 0 0 0.75 582.33 515.69814] CT
N
f-1759579234
f
GR
GS
[0.75 0 0 0.75 581.12627 514.54398] CT
N
f-1759579234
f
GR
GS
[0.75 0 0 0.75 579.92249 513.33727] CT
N
f-1759579234
f
GR
GS
[0.75 0 0 0.75 578.71875 512.06148] CT
N
f-1759579234
f
GR
GS
[0.75 0 0 0.75 577.51501 510.69991] CT
N
f-1759579234
f
GR
GS
[0.75 0 0 0.75 576.31123 509.23575] CT
N
f-1759579234
f
GR
GS
[0.75 0 0 0.75 575.1075 507.65262] CT
N
f-1759579234
f
GR
GS
[0.75 0 0 0.75 573.90376 505.93509] CT
N
f-1759579234
f
GR
GS
[0.75 0 0 0.75 572.70003 504.06892] CT
N
f-1759579234
f
GR
GS
[0.75 0 0 0.75 571.49625 502.04153] CT
N
f-1759579234
f
GR
GS
[0.75 0 0 0.75 570.29251 499.84267] CT
N
f-1759579234
f
GR
GS
[0.75 0 0 0.75 569.08873 497.46436] CT
N
f-1759579234
f
GR
GS
[0.75 0 0 0.75 567.88499 494.90152] CT
N
f-1759579234
f
GR
GS
[0.75 0 0 0.75 566.68126 492.1521] CT
N
f-1759579234
f
GR
GS
[0.75 0 0 0.75 565.47748 489.21724] CT
N
f-1759579234
f
GR
GS
[0.75 0 0 0.75 564.27374 486.10129] CT
N
f-1759579234
f
GR
GS
[0.75 0 0 0.75 563.07001 482.81184] CT
N
f-1759579234
f
GR
GS
[0.75 0 0 0.75 561.86627 479.35948] CT
N
f-1759579234
f
GR
GS
[0.75 0 0 0.75 560.66249 475.75752] CT
N
f-1759579234
f
GR
GS
[0.75 0 0 0.75 559.45876 472.02171] CT
N
f-1759579234
f
GR
GS
[0.75 0 0 0.75 558.25502 468.16991] CT
N
f-1759579234
f
GR
GS
[0.75 0 0 0.75 557.05124 464.22133] CT
N
f-1759579234
f
GR
GS
[0.75 0 0 0.75 555.8475 460.19649] CT
N
f-1759579234
f
GR
GS
[0.75 0 0 0.75 554.64372 456.11626] CT
N
f-1759579234
f
GR
GS
[0.75 0 0 0.75 553.43999 452.00169] CT
N
f-1759579234
f
GR
GS
[0.75 0 0 0.75 552.23625 447.87363] CT
N
f-1759579234
f
GR
GS
[0.75 0 0 0.75 551.03252 443.75197] CT
N
f-1759579234
f
GR
GS
[0.75 0 0 0.75 549.82874 439.65572] CT
N
f-1759579234
f
GR
GS
[0.75 0 0 0.75 548.625 435.6024] CT
N
f-1759579234
f
GR
GS
[0.75 0 0 0.75 547.42126 431.60818] CT
N
f-1759579234
f
GR
GS
[0.75 0 0 0.75 546.21748 427.68744] CT
N
f-1759579234
f
GR
GS
[0.75 0 0 0.75 545.01375 423.85289] CT
N
f-1759579234
f
GR
GS
[0.75 0 0 0.75 543.81001 420.11543] CT
N
f-1759579234
f
GR
GS
[0.75 0 0 0.75 542.60623 416.48427] CT
N
f-1759579234
f
GR
GS
[0.75 0 0 0.75 541.4025 412.96686] CT
N
f-1759579234
f
GR
GS
[0.75 0 0 0.75 540.19876 409.56911] CT
N
f-1759579234
f
GR
GS
[0.75 0 0 0.75 538.99498 406.2955] CT
N
f-1759579234
f
GR
GS
[0.75 0 0 0.75 537.79124 403.14906] CT
N
f-1759579234
f
GR
GS
[0.75 0 0 0.75 536.58751 400.13158] CT
N
f-1759579234
f
GR
GS
[0.75 0 0 0.75 535.38373 397.24382] CT
N
f-1759579234
f
GR
GS
[0.75 0 0 0.75 534.17999 394.48547] CT
N
f-1759579234
f
GR
GS
[0.75 0 0 0.75 532.97626 391.85548] CT
N
f-1759579234
f
GR
GS
[0.75 0 0 0.75 531.77252 389.35202] CT
N
f-1759579234
f
GR
GS
[0.75 0 0 0.75 530.56874 386.97261] CT
N
f-1759579234
f
GR
GS
[0.75 0 0 0.75 529.36501 384.71432] CT
N
f-1759579234
f
GR
GS
[0.75 0 0 0.75 528.16127 382.57378] CT
N
f-1759579234
f
GR
GS
[0.75 0 0 0.75 526.95749 380.54723] CT
N
f-1759579234
f
GR
GS
[0.75 0 0 0.75 525.75375 378.63071] CT
N
f-1759579234
f
GR
GS
[0.75 0 0 0.75 524.55002 376.82008] CT
N
f-1759579234
f
GR
GS
[0.75 0 0 0.75 523.34624 375.11099] CT
N
f-1759579234
f
GR
GS
[0.75 0 0 0.75 522.1425 373.49907] CT
N
f-1759579234
f
GR
GS
[0.75 0 0 0.75 520.93877 371.97987] CT
N
f-1759579234
f
GR
GS
[0.75 0 0 0.75 519.73499 370.54894] CT
N
f-1759579234
f
GR
GS
[0.75 0 0 0.75 518.53125 369.2019] CT
N
f-1759579234
f
GR
GS
[0.75 0 0 0.75 517.32751 367.93438] CT
N
f-1759579234
f
GR
GS
[0.75 0 0 0.75 516.12373 366.74213] CT
N
f-1759579234
f
GR
GS
[0.75 0 0 0.75 514.92 365.621] CT
N
f-1759579234
f
GR
GS
[0.75 0 0 0.75 513.71626 364.56689] CT
N
f-1759579234
f
GR
GS
[0.75 0 0 0.75 512.51248 363.57592] CT
N
f-1759579234
f
GR
GS
[0.75 0 0 0.75 511.30875 362.64433] CT
N
f-1759579234
f
GR
GS
[0.75 0 0 0.75 510.10501 361.76846] CT
N
f-1759579234
f
GR
GS
[0.75 0 0 0.75 508.90123 360.94488] CT
N
f-1759579234
f
GR
GS
[0.75 0 0 0.75 507.69749 360.17025] CT
N
f-1759579234
f
GR
GS
[0.75 0 0 0.75 506.49376 359.44144] CT
N
f-1759579234
f
GR
GS
[0.75 0 0 0.75 505.28998 358.75546] CT
N
f-1759579234
f
GR
GS
[0.75 0 0 0.75 504.08624 358.10954] CT
N
f-1759579234
f
GR
GS
[0.75 0 0 0.75 502.88251 357.50096] CT
N
f-1759579234
f
GR
GS
[0.75 0 0 0.75 501.67877 356.92729] CT
N
f-1759579234
f
GR
GS
[0.75 0 0 0.75 500.47499 356.38619] CT
N
f-1759579234
f
GR
GS
[0.75 0 0 0.75 499.27126 355.87547] CT
N
f-1759579234
f
GR
GS
[0.75 0 0 0.75 498.06752 355.39314] CT
N
f-1759579234
f
GR
GS
[0.75 0 0 0.75 496.86374 354.93735] CT
N
f-1759579234
f
GR
GS
[0.75 0 0 0.75 495.66 354.50636] CT
N
f-1759579234
f
GR
GS
[0.75 0 0 0.75 494.45627 354.09861] CT
N
f-1759579234
f
GR
GS
[0.75 0 0 0.75 493.25249 353.71265] CT
N
f-1759579234
f
GR
GS
[0.75 0 0 0.75 492.04875 353.34719] CT
N
f-1759579234
f
GR
GS
[0.75 0 0 0.75 490.84502 353.00101] CT
N
f-1759579234
f
GR
GS
[0.75 0 0 0.75 489.64124 352.67304] CT
N
f-1759579234
f
GR
GS
[0.75 0 0 0.75 488.4375 352.36234] CT
N
f-1759579234
f
GR
GS
[0.75 0 0 0.75 487.23376 352.06799] CT
N
f-1759579234
f
GR
GS
[0.75 0 0 0.75 486.02998 351.78924] CT
N
f-1759579234
f
GR
GS
[0.75 0 0 0.75 484.82625 351.52536] CT
N
f-1759579234
f
GR
GS
[0.75 0 0 0.75 483.62251 351.27574] CT
N
f-1759579234
f
GR
GS
[0.75 0 0 0.75 482.41873 351.03974] CT
N
f-1759579234
f
GR
GS
[0.75 0 0 0.75 481.215 350.8169] CT
N
f-1759579234
f
GR
GS
[0.75 0 0 0.75 480.01126 350.60665] CT
N
f-1759579234
f
GR
GS
[0.75 0 0 0.75 478.80748 350.4086] CT
N
f-1759579234
f
GR
GS
[0.75 0 0 0.75 477.60374 350.22227] CT
N
f-1759579234
f
GR
GS
[0.75 0 0 0.75 476.40001 350.04722] CT
N
f-1759579234
f
GR
GS
[0.75 0 0 0.75 475.19623 349.88309] CT
N
f-1759579234
f
GR
GS
[0.75 0 0 0.75 473.99249 349.72944] CT
N
f-1759579234
f
GR
GS
[0.75 0 0 0.75 472.78876 349.58588] CT
N
f-1759579234
f
GR
GS
[0.75 0 0 0.75 471.58502 349.45203] CT
N
f-1759579234
f
GR
GS
[0.75 0 0 0.75 470.38124 349.32748] CT
N
f-1759579234
f
GR
GS
[0.75 0 0 0.75 469.17751 349.21182] CT
N
f-1759579234
f
GR
GS
[0.75 0 0 0.75 467.97377 349.10468] CT
N
f-1759579234
f
GR
GS
[0.75 0 0 0.75 466.76999 349.00562] CT
N
f-1759579234
f
GR
GS
[0.75 0 0 0.75 465.56625 348.91425] CT
N
f-1759579234
f
GR
GS
[0.75 0 0 0.75 464.36252 348.83018] CT
N
f-1759579234
f
GR
GS
[0.75 0 0 0.75 463.15874 348.75303] CT
N
f-1759579234
f
GR
GS
[0.75 0 0 0.75 461.955 348.68237] CT
N
f-1759579234
f
GR
GS
[0.75 0 0 0.75 460.75127 348.61785] CT
N
f-1759579234
f
GR
GS
[0.75 0 0 0.75 459.54749 348.5591] CT
N
f-1759579234
f
GR
GS
[0.75 0 0 0.75 458.34375 348.50574] CT
N
f-1759579234
f
GR
GS
[0.75 0 0 0.75 457.14001 348.45745] CT
N
f-1759579234
f
GR
GS
[0.75 0 0 0.75 455.93623 348.41385] CT
N
f-1759579234
f
GR
GS
[0.75 0 0 0.75 454.7325 348.37462] CT
N
f-1759579234
f
GR
GS
[0.75 0 0 0.75 453.52876 348.33949] CT
N
f-1759579234
f
GR
GS
[0.75 0 0 0.75 452.32498 348.30811] CT
N
f-1759579234
f
GR
GS
[0.75 0 0 0.75 451.12125 348.2802] CT
N
f-1759579234
f
GR
GS
[0.75 0 0 0.75 449.91751 348.25553] CT
N
f-1759579234
f
GR
GS
[0.75 0 0 0.75 448.71373 348.23381] CT
N
f-1759579234
f
GR
GS
[0.75 0 0 0.75 447.50999 348.21484] CT
N
f-1759579234
f
GR
GS
[0.75 0 0 0.75 446.30626 348.19831] CT
N
f-1759579234
f
GR
GS
[0.75 0 0 0.75 445.10248 348.18407] CT
N
f-1759579234
f
GR
GS
[0.75 0 0 0.75 443.89874 348.17192] CT
N
f-1759579234
f
GR
GS
[0.75 0 0 0.75 442.69501 348.1616] CT
N
f-1759579234
f
GR
GS
[0.75 0 0 0.75 441.49127 348.15299] CT
N
f-1759579234
f
GR
GS
[0.75 0 0 0.75 440.28749 348.1459] CT
N
f-1759579234
f
GR
GS
[0.75 0 0 0.75 439.08376 348.14015] CT
N
f-1759579234
f
GR
GS
[0.75 0 0 0.75 437.88002 348.13557] CT
N
f-1759579234
f
GR
GS
[0.75 0 0 0.75 436.67624 348.13205] CT
N
f-1759579234
f
GR
GS
[0.75 0 0 0.75 435.4725 348.12942] CT
N
f-1759579234
f
GR
GS
[0.75 0 0 0.75 434.26877 348.12754] CT
N
f-1759579234
f
GR
GS
[0.75 0 0 0.75 433.06499 348.1263] CT
N
f-1759579234
f
GR
GS
[0.75 0 0 0.75 431.86125 348.12555] CT
N
f-1759579234
f
GR
GS
[0.75 0 0 0.75 430.65752 348.12516] CT
N
f-1759579234
f
GR
GS
[0.75 0 0 0.75 429.45374 348.12502] CT
N
f-1759579234
f
GR
GS
[0.75 0 0 0.75 428.25 348.125] CT
N
f-1759579234
f
GR
GS
[0.75 0 0 0.75 0 -0.25] CT
1 0 0 RC
[10 6] 0 setdash
2 LJ
0.667 LW
N
250 143.5 M
251.605 145.105 L
253.21 146.71 L
254.815 148.315 L
256.42 149.92 L
258.025 151.525 L
259.63 153.13 L
261.235 154.735 L
262.84 156.34 L
264.445 157.945 L
266.05 159.55 L
267.655 161.155 L
269.26 162.76 L
270.865 164.365 L
272.47 165.97 L
274.075 167.575 L
275.68 169.18 L
277.285 170.785 L
278.89 172.39 L
280.495 173.995 L
282.1 175.6 L
283.705 177.205 L
285.31 178.81 L
286.915 180.415 L
288.52 182.02 L
290.125 183.625 L
291.73 185.23 L
293.335 186.835 L
294.94 188.44 L
296.545 190.045 L
298.15 191.65 L
299.755 193.255 L
301.36 194.86 L
302.965 196.465 L
304.57 198.07 L
306.175 199.675 L
307.78 201.28 L
309.385 202.885 L
310.99 204.49 L
312.595 206.095 L
314.2 207.7 L
315.805 209.305 L
317.41 210.91 L
319.015 212.515 L
320.62 214.12 L
322.225 215.725 L
323.83 217.33 L
325.435 218.935 L
327.04 220.54 L
328.645 222.145 L
330.25 223.75 L
331.855 225.355 L
333.46 226.96 L
335.065 228.565 L
336.67 230.17 L
338.275 231.775 L
339.88 233.38 L
341.485 234.985 L
343.09 236.59 L
344.695 238.195 L
346.3 239.8 L
347.905 241.405 L
349.51 243.01 L
351.115 244.615 L
352.72 246.22 L
354.325 247.825 L
355.93 249.43 L
357.535 251.035 L
359.14 252.64 L
360.745 254.245 L
362.35 255.85 L
363.955 257.455 L
365.56 259.06 L
367.165 260.665 L
368.77 262.27 L
370.375 263.875 L
371.98 265.48 L
373.585 267.085 L
375.19 268.69 L
376.795 270.295 L
378.4 271.9 L
380.005 273.505 L
381.61 275.11 L
383.215 276.715 L
384.82 278.32 L
386.425 279.925 L
388.03 281.53 L
389.635 283.135 L
391.24 284.74 L
392.845 286.345 L
394.45 287.95 L
396.055 289.555 L
397.66 291.16 L
399.265 292.765 L
400.87 294.37 L
402.475 295.975 L
404.08 297.58 L
405.685 299.185 L
407.29 300.79 L
408.895 302.395 L
410.5 304 L
412.105 305.605 L
413.71 307.21 L
415.315 308.815 L
416.92 310.42 L
418.525 312.025 L
420.13 313.63 L
421.735 315.235 L
423.34 316.84 L
424.945 318.445 L
426.55 320.05 L
428.155 321.655 L
429.76 323.26 L
431.365 324.865 L
432.97 326.47 L
434.575 328.075 L
436.18 329.68 L
437.785 331.285 L
439.39 332.89 L
440.995 334.495 L
442.6 336.1 L
444.205 337.705 L
445.81 339.31 L
447.415 340.915 L
449.02 342.52 L
450.625 344.125 L
452.23 345.73 L
453.835 347.335 L
455.44 348.94 L
457.045 350.545 L
458.65 352.15 L
460.255 353.755 L
461.86 355.36 L
463.465 356.965 L
465.07 358.57 L
466.675 360.175 L
468.28 361.78 L
469.885 363.385 L
471.49 364.99 L
473.095 366.595 L
474.7 368.2 L
476.305 369.805 L
477.91 371.41 L
479.515 373.015 L
481.12 374.62 L
482.725 376.225 L
484.33 377.83 L
485.935 379.435 L
487.54 381.04 L
489.145 382.645 L
490.75 384.25 L
492.355 385.855 L
493.96 387.46 L
495.565 389.065 L
497.17 390.67 L
498.775 392.275 L
500.38 393.88 L
501.985 395.485 L
503.59 397.09 L
505.195 398.695 L
506.8 400.3 L
508.405 401.905 L
510.01 403.51 L
511.615 405.115 L
513.22 406.72 L
514.825 408.325 L
516.43 409.93 L
518.035 411.535 L
519.64 413.14 L
521.245 414.745 L
522.85 416.35 L
524.455 417.955 L
526.06 419.56 L
527.665 421.165 L
529.27 422.77 L
530.875 424.375 L
532.48 425.98 L
534.085 427.585 L
535.69 429.19 L
537.295 430.795 L
538.9 432.4 L
540.505 434.005 L
542.11 435.61 L
543.715 437.215 L
545.32 438.82 L
546.925 440.425 L
548.53 442.03 L
550.135 443.635 L
551.74 445.24 L
553.345 446.845 L
554.95 448.45 L
556.555 450.055 L
558.16 451.66 L
559.765 453.265 L
561.37 454.87 L
562.975 456.475 L
564.58 458.08 L
566.185 459.685 L
567.79 461.29 L
569.395 462.895 L
571 464.5 L
892 785.5 L
890.395 783.895 L
888.79 782.29 L
887.185 780.685 L
885.58 779.08 L
883.975 777.475 L
882.37 775.87 L
880.765 774.265 L
879.16 772.66 L
877.555 771.055 L
875.95 769.45 L
874.345 767.845 L
872.74 766.24 L
871.135 764.635 L
869.53 763.03 L
867.925 761.425 L
866.32 759.82 L
864.715 758.215 L
863.11 756.61 L
861.505 755.005 L
859.9 753.4 L
858.295 751.795 L
856.69 750.19 L
855.085 748.585 L
853.48 746.98 L
851.875 745.375 L
850.27 743.77 L
848.665 742.165 L
847.06 740.56 L
845.455 738.955 L
843.85 737.35 L
842.245 735.745 L
840.64 734.14 L
839.035 732.535 L
837.43 730.93 L
835.825 729.325 L
834.22 727.72 L
832.615 726.115 L
831.01 724.51 L
829.405 722.905 L
827.8 721.3 L
826.195 719.695 L
824.59 718.09 L
822.985 716.485 L
821.38 714.88 L
819.775 713.275 L
818.17 711.67 L
816.565 710.065 L
814.96 708.46 L
813.355 706.855 L
811.75 705.25 L
810.145 703.645 L
808.54 702.04 L
806.935 700.435 L
805.33 698.83 L
803.725 697.225 L
802.12 695.62 L
800.515 694.015 L
798.91 692.41 L
797.305 690.805 L
795.7 689.2 L
794.095 687.595 L
792.49 685.99 L
790.885 684.385 L
789.28 682.78 L
787.675 681.175 L
786.07 679.57 L
784.465 677.965 L
782.86 676.36 L
781.255 674.755 L
779.65 673.15 L
778.045 671.545 L
776.44 669.94 L
774.835 668.335 L
773.23 666.73 L
771.625 665.125 L
770.02 663.52 L
768.415 661.915 L
766.81 660.31 L
765.205 658.705 L
763.6 657.1 L
761.995 655.495 L
760.39 653.89 L
758.785 652.285 L
757.18 650.68 L
755.575 649.075 L
753.97 647.47 L
752.365 645.865 L
750.76 644.26 L
749.155 642.655 L
747.55 641.05 L
745.945 639.445 L
744.34 637.84 L
742.735 636.235 L
741.13 634.63 L
739.525 633.025 L
737.92 631.42 L
736.315 629.815 L
734.71 628.21 L
733.105 626.605 L
731.5 625 L
729.895 623.395 L
728.29 621.79 L
726.685 620.185 L
725.08 618.58 L
723.475 616.975 L
721.87 615.37 L
720.265 613.765 L
718.66 612.16 L
717.055 610.555 L
715.45 608.95 L
713.845 607.345 L
712.24 605.74 L
710.635 604.135 L
709.03 602.53 L
707.425 600.925 L
705.82 599.32 L
704.215 597.715 L
702.61 596.11 L
701.005 594.505 L
699.4 592.9 L
697.795 591.295 L
696.19 589.69 L
694.585 588.085 L
692.98 586.48 L
691.375 584.875 L
689.77 583.27 L
688.165 581.665 L
686.56 580.06 L
684.955 578.455 L
683.35 576.85 L
681.745 575.245 L
680.14 573.64 L
678.535 572.035 L
676.93 570.43 L
675.325 568.825 L
673.72 567.22 L
672.115 565.615 L
670.51 564.01 L
668.905 562.405 L
667.3 560.8 L
665.695 559.195 L
664.09 557.59 L
662.485 555.985 L
660.88 554.38 L
659.275 552.775 L
657.67 551.17 L
656.065 549.565 L
654.46 547.96 L
652.855 546.355 L
651.25 544.75 L
649.645 543.145 L
648.04 541.54 L
646.435 539.935 L
644.83 538.33 L
643.225 536.725 L
641.62 535.12 L
640.015 533.515 L
638.41 531.91 L
636.805 530.305 L
635.2 528.7 L
633.595 527.095 L
631.99 525.49 L
630.385 523.885 L
628.78 522.28 L
627.175 520.675 L
625.57 519.07 L
623.965 517.465 L
622.36 515.86 L
620.755 514.255 L
619.15 512.65 L
617.545 511.045 L
615.94 509.44 L
614.335 507.835 L
612.73 506.23 L
611.125 504.625 L
609.52 503.02 L
607.915 501.415 L
606.31 499.81 L
604.705 498.205 L
603.1 496.6 L
601.495 494.995 L
599.89 493.39 L
598.285 491.785 L
596.68 490.18 L
595.075 488.575 L
593.47 486.97 L
591.865 485.365 L
590.26 483.76 L
588.655 482.155 L
587.05 480.55 L
585.445 478.945 L
583.84 477.34 L
582.235 475.735 L
580.63 474.13 L
579.025 472.525 L
577.42 470.92 L
575.815 469.315 L
574.21 467.71 L
572.605 466.105 L
571 464.5 L
S
GR
GS
[0.75 0 0 0.75 0 -0.25] CT
1 0 0 RC
1 LJ
2 LW
N
375.19 660.31 M
375.19 251.796 L
783.703 251.796 L
S
GR
GS
[0.75 0 0 0.75 281.3925 494.9825] CT
1 0 0 RC
N
/f-1057828618{1.333 0 M
1.333 0.736 0.736 1.333 0 1.333 C
-0.736 1.333 -1.333 0.736 -1.333 0 C
-1.333 -0.736 -0.736 -1.333 0 -1.333 C
0.736 -1.333 1.333 -0.736 1.333 0 C
cp}def
f-1057828618
f
GR
GS
[0.75 0 0 0.75 281.3925 188.59737] CT
1 0 0 RC
N
f-1057828618
f
GR
GS
[0.75 0 0 0.75 587.77762 188.59737] CT
1 0 0 RC
N
f-1057828618
f
GR
GS
[0.75 0 0 0.75 0 -0.25] CT
1 0 0 RC
1 LJ
2 LW
N
783.703 251.796 M
783.703 694.552 L
340.947 694.552 L
S
GR
GS
[0.75 0 0 0.75 587.77762 188.59737] CT
1 0 0 RC
N
f-1057828618
f
GR
GS
[0.75 0 0 0.75 587.77762 520.66437] CT
1 0 0 RC
N
f-1057828618
f
GR
GS
[0.75 0 0 0.75 255.71061 520.66437] CT
1 0 0 RC
N
f-1057828618
f
GR
GS
[0.75 0 0 0.75 0 -0.25] CT
1 0 0 RC
1 LJ
2 LW
N
340.947 694.552 M
340.947 216.275 L
819.225 216.275 L
S
GR
GS
[0.75 0 0 0.75 255.71061 520.66437] CT
1 0 0 RC
N
f-1057828618
f
GR
GS
[0.75 0 0 0.75 255.71061 161.9565] CT
1 0 0 RC
N
f-1057828618
f
GR
GS
[0.75 0 0 0.75 614.4185 161.9565] CT
1 0 0 RC
N
f-1057828618
f
GR
GS
[0.75 0 0 0.75 0 -0.25] CT
1 0 0 RC
1 LJ
2 LW
N
819.225 216.275 M
819.225 728.992 L
306.508 728.992 L
S
GR
GS
[0.75 0 0 0.75 614.4185 161.9565] CT
1 0 0 RC
N
f-1057828618
f
GR
GS
[0.75 0 0 0.75 614.4185 546.49391] CT
1 0 0 RC
N
f-1057828618
f
GR
GS
[0.75 0 0 0.75 229.88109 546.49391] CT
1 0 0 RC
N
f-1057828618
f
GR
GS
[0.75 0 0 0.75 0 -0.25] CT
1 0 0 RC
1 LJ
2 LW
N
306.508 728.992 M
306.508 197.592 L
837.908 197.592 L
S
GR
GS
[0.75 0 0 0.75 229.88109 546.49391] CT
1 0 0 RC
N
f-1057828618
f
GR
GS
[0.75 0 0 0.75 229.88109 147.94402] CT
1 0 0 RC
N
f-1057828618
f
GR
GS
[0.75 0 0 0.75 628.43097 147.94402] CT
1 0 0 RC
N
f-1057828618
f
GR
GS
[0.75 0 0 0.75 0 -0.25] CT
1 0 0 RC
1 LJ
2 LW
N
837.908 197.592 M
837.908 731.437 L
304.063 731.437 L
S
GR
GS
[0.75 0 0 0.75 628.43097 147.94402] CT
1 0 0 RC
N
f-1057828618
f
GR
GS
[0.75 0 0 0.75 628.43097 548.3279] CT
1 0 0 RC
N
f-1057828618
f
GR
GS
[0.75 0 0 0.75 228.0471 548.3279] CT
1 0 0 RC
N
f-1057828618
f
GR
GS
[0.75 0 0 0.75 0 -0.25] CT
1 0 0 RC
1 LJ
2 LW
N
304.063 731.437 M
304.063 197.562 L
837.938 197.562 L
S
GR
GS
[0.75 0 0 0.75 228.0471 548.3279] CT
1 0 0 RC
N
f-1057828618
f
GR
GS
[0.75 0 0 0.75 228.0471 147.92138] CT
1 0 0 RC
N
f-1057828618
f
GR
GS
[0.75 0 0 0.75 628.45363 147.92138] CT
1 0 0 RC
N
f-1057828618
f
GR
GS
[0.75 0 0 0.75 0 -0.25] CT
1 0 0 RC
1 LJ
2 LW
N
837.938 197.562 M
837.938 731.438 L
304.062 731.438 L
S
GR
GS
[0.75 0 0 0.75 628.45363 147.92138] CT
1 0 0 RC
N
f-1057828618
f
GR
GS
[0.75 0 0 0.75 628.45363 548.32863] CT
1 0 0 RC
N
f-1057828618
f
GR
GS
[0.75 0 0 0.75 228.04635 548.32863] CT
1 0 0 RC
N
f-1057828618
f
GR
GS
[0.75 0 0 0.75 0 -0.25] CT
1 0 0 RC
1 LJ
2 LW
N
304.062 731.438 M
304.062 197.562 L
837.938 197.562 L
S
GR
GS
[0.75 0 0 0.75 228.04635 548.32863] CT
1 0 0 RC
N
f-1057828618
f
GR
GS
[0.75 0 0 0.75 228.04635 147.92136] CT
1 0 0 RC
N
f-1057828618
f
GR
GS
[0.75 0 0 0.75 628.45363 147.92136] CT
1 0 0 RC
N
f-1057828618
f
GR
GS
[0.75 0 0 0.75 0 -0.25] CT
1 0 0 RC
1 LJ
2 LW
N
837.938 197.562 M
837.938 731.438 L
304.062 731.438 L
S
GR
GS
[0.75 0 0 0.75 628.45363 147.92136] CT
1 0 0 RC
N
f-1057828618
f
GR
GS
[0.75 0 0 0.75 628.45363 548.32863] CT
1 0 0 RC
N
f-1057828618
f
GR
GS
[0.75 0 0 0.75 228.04635 548.32863] CT
1 0 0 RC
N
f-1057828618
f
GR
GS
[0.75 0 0 0.75 0 -0.25] CT
1 0 0 RC
1 LJ
2 LW
N
304.062 731.438 M
304.062 197.562 L
837.938 197.562 L
S
GR
GS
[0.75 0 0 0.75 228.04635 548.32863] CT
1 0 0 RC
N
f-1057828618
f
GR
GS
[0.75 0 0 0.75 228.04635 147.92136] CT
1 0 0 RC
N
f-1057828618
f
GR
GS
[0.75 0 0 0.75 628.45363 147.92136] CT
1 0 0 RC
N
f-1057828618
f
GR
GS
[0.75 0 0 0.75 0 -0.25] CT
1 0 0 RC
1 LJ
2 LW
N
837.938 197.562 M
837.938 731.438 L
304.062 731.438 L
S
GR
GS
[0.75 0 0 0.75 628.45363 147.92136] CT
1 0 0 RC
N
f-1057828618
f
GR
GS
[0.75 0 0 0.75 628.45363 548.32863] CT
1 0 0 RC
N
f-1057828618
f
GR
GS
[0.75 0 0 0.75 228.04635 548.32863] CT
1 0 0 RC
N
f-1057828618
f
GR
GS
[0.75 0 0 0.75 0 -0.25] CT
1 0 0 RC
1 LJ
2 LW
N
304.062 731.438 M
304.062 197.562 L
837.938 197.562 L
S
GR
GS
[0.75 0 0 0.75 228.04635 548.32863] CT
1 0 0 RC
N
f-1057828618
f
GR
GS
[0.75 0 0 0.75 228.04635 147.92136] CT
1 0 0 RC
N
f-1057828618
f
GR
GS
[0.75 0 0 0.75 628.45363 147.92136] CT
1 0 0 RC
N
f-1057828618
f
GR
GS
[0.75 0 0 0.75 0 -0.25] CT
1 0 0 RC
1 LJ
2 LW
N
837.938 197.562 M
837.938 731.438 L
304.062 731.438 L
S
GR
GS
[0.75 0 0 0.75 628.45363 147.92136] CT
1 0 0 RC
N
f-1057828618
f
GR
GS
[0.75 0 0 0.75 628.45363 548.32863] CT
1 0 0 RC
N
f-1057828618
f
GR
GS
[0.75 0 0 0.75 228.04635 548.32863] CT
1 0 0 RC
N
f-1057828618
f
GR
GS
[0.75 0 0 0.75 0 -0.25] CT
1 0 0 RC
1 LJ
2 LW
N
304.062 731.438 M
304.062 197.562 L
837.938 197.562 L
S
GR
GS
[0.75 0 0 0.75 228.04635 548.32863] CT
1 0 0 RC
N
f-1057828618
f
GR
GS
[0.75 0 0 0.75 228.04635 147.92136] CT
1 0 0 RC
N
f-1057828618
f
GR
GS
[0.75 0 0 0.75 628.45363 147.92136] CT
1 0 0 RC
N
f-1057828618
f
GR
GS
[0.75 0 0 0.75 0 -0.25] CT
1 0 0 RC
1 LJ
2 LW
N
837.938 197.562 M
837.938 731.438 L
304.062 731.438 L
S
GR
GS
[0.75 0 0 0.75 628.45363 147.92136] CT
1 0 0 RC
N
f-1057828618
f
GR
GS
[0.75 0 0 0.75 628.45363 548.32863] CT
1 0 0 RC
N
f-1057828618
f
GR
GS
[0.75 0 0 0.75 228.04635 548.32863] CT
1 0 0 RC
N
f-1057828618
f
GR
GS
[0.75 0 0 0.75 0 -0.25] CT
1 0 0 RC
1 LJ
2 LW
N
304.062 731.438 M
304.062 197.562 L
837.938 197.562 L
S
GR
GS
[0.75 0 0 0.75 228.04635 548.32863] CT
1 0 0 RC
N
f-1057828618
f
GR
GS
[0.75 0 0 0.75 228.04635 147.92136] CT
1 0 0 RC
N
f-1057828618
f
GR
GS
[0.75 0 0 0.75 628.45363 147.92136] CT
1 0 0 RC
N
f-1057828618
f
GR
GS
[0.75 0 0 0.75 0 -0.25] CT
1 0 0 RC
1 LJ
2 LW
N
837.938 197.562 M
837.938 731.438 L
304.062 731.438 L
S
GR
GS
[0.75 0 0 0.75 628.45363 147.92136] CT
1 0 0 RC
N
f-1057828618
f
GR
GS
[0.75 0 0 0.75 628.45363 548.32863] CT
1 0 0 RC
N
f-1057828618
f
GR
GS
[0.75 0 0 0.75 228.04635 548.32863] CT
1 0 0 RC
N
f-1057828618
f
GR
GS
[0.75 0 0 0.75 0 -0.25] CT
1 0 0 RC
1 LJ
2 LW
N
304.062 731.438 M
304.062 197.562 L
837.938 197.562 L
S
GR
GS
[0.75 0 0 0.75 228.04635 548.32863] CT
1 0 0 RC
N
f-1057828618
f
GR
GS
[0.75 0 0 0.75 228.04635 147.92136] CT
1 0 0 RC
N
f-1057828618
f
GR
GS
[0.75 0 0 0.75 628.45363 147.92136] CT
1 0 0 RC
N
f-1057828618
f
GR
GS
[0.75 0 0 0.75 0 -0.25] CT
1 0 0 RC
1 LJ
2 LW
N
837.938 197.562 M
837.938 731.438 L
304.062 731.438 L
S
GR
GS
[0.75 0 0 0.75 628.45363 147.92136] CT
1 0 0 RC
N
f-1057828618
f
GR
GS
[0.75 0 0 0.75 628.45363 548.32863] CT
1 0 0 RC
N
f-1057828618
f
GR
GS
[0.75 0 0 0.75 228.04635 548.32863] CT
1 0 0 RC
N
f-1057828618
f
GR
GS
[0.75 0 0 0.75 0 -0.25] CT
1 0 0 RC
1 LJ
2 LW
N
304.062 731.438 M
304.062 197.562 L
837.938 197.562 L
S
GR
GS
[0.75 0 0 0.75 228.04635 548.32863] CT
1 0 0 RC
N
f-1057828618
f
GR
GS
[0.75 0 0 0.75 228.04635 147.92136] CT
1 0 0 RC
N
f-1057828618
f
GR
GS
[0.75 0 0 0.75 628.45363 147.92136] CT
1 0 0 RC
N
f-1057828618
f
GR
GS
[0.75 0 0 0.75 0 -0.25] CT
1 0 0 RC
1 LJ
2 LW
N
837.938 197.562 M
837.938 731.438 L
304.062 731.438 L
S
GR
GS
[0.75 0 0 0.75 628.45363 147.92136] CT
1 0 0 RC
N
f-1057828618
f
GR
GS
[0.75 0 0 0.75 628.45363 548.32863] CT
1 0 0 RC
N
f-1057828618
f
GR
GS
[0.75 0 0 0.75 228.04635 548.32863] CT
1 0 0 RC
N
f-1057828618
f
GR
GS
[0.75 0 0 0.75 0 -0.25] CT
1 0 0 RC
1 LJ
2 LW
N
304.062 731.438 M
304.062 197.562 L
837.938 197.562 L
S
GR
GS
[0.75 0 0 0.75 228.04635 548.32863] CT
1 0 0 RC
N
f-1057828618
f
GR
GS
[0.75 0 0 0.75 228.04635 147.92136] CT
1 0 0 RC
N
f-1057828618
f
GR
GS
[0.75 0 0 0.75 628.45363 147.92136] CT
1 0 0 RC
N
f-1057828618
f
GR
GS
[0.75 0 0 0.75 0 -0.25] CT
1 0 0 RC
1 LJ
2 LW
N
837.938 197.562 M
837.938 731.438 L
304.062 731.438 L
S
GR
GS
[0.75 0 0 0.75 628.45363 147.92136] CT
1 0 0 RC
N
f-1057828618
f
GR
GS
[0.75 0 0 0.75 628.45363 548.32863] CT
1 0 0 RC
N
f-1057828618
f
GR
GS
[0.75 0 0 0.75 228.04635 548.32863] CT
1 0 0 RC
N
f-1057828618
f
GR
GS
[0.75 0 0 0.75 0 -0.25] CT
1 0 0 RC
1 LJ
2 LW
N
304.062 731.438 M
304.062 197.562 L
837.938 197.562 L
S
GR
GS
[0.75 0 0 0.75 228.04635 548.32863] CT
1 0 0 RC
N
f-1057828618
f
GR
GS
[0.75 0 0 0.75 228.04635 147.92136] CT
1 0 0 RC
N
f-1057828618
f
GR
GS
[0.75 0 0 0.75 628.45363 147.92136] CT
1 0 0 RC
N
f-1057828618
f
GR
GS
[0.75 0 0 0.75 0 -0.25] CT
1 0 0 RC
1 LJ
2 LW
N
837.938 197.562 M
837.938 731.438 L
304.062 731.438 L
S
GR
GS
[0.75 0 0 0.75 628.45363 147.92136] CT
1 0 0 RC
N
f-1057828618
f
GR
GS
[0.75 0 0 0.75 628.45363 548.32863] CT
1 0 0 RC
N
f-1057828618
f
GR
GS
[0.75 0 0 0.75 228.04635 548.32863] CT
1 0 0 RC
N
f-1057828618
f
GR
GS
[0.75 0 0 0.75 0 -0.25] CT
1 0 0 RC
1 LJ
2 LW
N
304.062 731.438 M
304.062 197.562 L
837.938 197.562 L
S
GR
GS
[0.75 0 0 0.75 228.04635 548.32863] CT
1 0 0 RC
N
f-1057828618
f
GR
GS
[0.75 0 0 0.75 228.04635 147.92136] CT
1 0 0 RC
N
f-1057828618
f
GR
GS
[0.75 0 0 0.75 628.45363 147.92136] CT
1 0 0 RC
N
f-1057828618
f
GR
GS
[0.75 0 0 0.75 0 -0.25] CT
1 0 0 RC
1 LJ
2 LW
N
837.938 197.562 M
837.938 731.438 L
304.062 731.438 L
S
GR
GS
[0.75 0 0 0.75 628.45363 147.92136] CT
1 0 0 RC
N
f-1057828618
f
GR
GS
[0.75 0 0 0.75 628.45363 548.32863] CT
1 0 0 RC
N
f-1057828618
f
GR
GS
[0.75 0 0 0.75 228.04635 548.32863] CT
1 0 0 RC
N
f-1057828618
f
GR
GS
[0.75 0 0 0.75 0 -0.25] CT
1 0 0 RC
1 LJ
2 LW
N
304.062 731.438 M
304.062 197.562 L
837.938 197.562 L
S
GR
GS
[0.75 0 0 0.75 228.04635 548.32863] CT
1 0 0 RC
N
f-1057828618
f
GR
GS
[0.75 0 0 0.75 228.04635 147.92136] CT
1 0 0 RC
N
f-1057828618
f
GR
GS
[0.75 0 0 0.75 628.45363 147.92136] CT
1 0 0 RC
N
f-1057828618
f
GR
GS
[0.75 0 0 0.75 0 -0.25] CT
1 0 0 RC
1 LJ
2 LW
N
837.938 197.562 M
837.938 731.438 L
304.062 731.438 L
S
GR
GS
[0.75 0 0 0.75 628.45363 147.92136] CT
1 0 0 RC
N
f-1057828618
f
GR
GS
[0.75 0 0 0.75 628.45363 548.32863] CT
1 0 0 RC
N
f-1057828618
f
GR
GS
[0.75 0 0 0.75 228.04635 548.32863] CT
1 0 0 RC
N
f-1057828618
f
GR
GS
[0.75 0 0 0.75 0 -0.25] CT
1 0 0 RC
1 LJ
2 LW
N
304.062 731.438 M
304.062 197.562 L
837.938 197.562 L
S
GR
GS
[0.75 0 0 0.75 228.04635 548.32863] CT
1 0 0 RC
N
f-1057828618
f
GR
GS
[0.75 0 0 0.75 228.04635 147.92136] CT
1 0 0 RC
N
f-1057828618
f
GR
GS
[0.75 0 0 0.75 628.45363 147.92136] CT
1 0 0 RC
N
f-1057828618
f
GR
GS
[0.75 0 0 0.75 0 -0.25] CT
1 0 0 RC
1 LJ
2 LW
N
837.938 197.562 M
837.938 731.438 L
304.062 731.438 L
S
GR
GS
[0.75 0 0 0.75 628.45363 147.92136] CT
1 0 0 RC
N
f-1057828618
f
GR
GS
[0.75 0 0 0.75 628.45363 548.32863] CT
1 0 0 RC
N
f-1057828618
f
GR
GS
[0.75 0 0 0.75 228.04635 548.32863] CT
1 0 0 RC
N
f-1057828618
f
GR
GS
[0.75 0 0 0.75 0 -0.25] CT
1 0 0 RC
1 LJ
2 LW
N
304.062 731.438 M
304.062 197.562 L
837.938 197.562 L
S
GR
GS
[0.75 0 0 0.75 228.04635 548.32863] CT
1 0 0 RC
N
f-1057828618
f
GR
GS
[0.75 0 0 0.75 228.04635 147.92136] CT
1 0 0 RC
N
f-1057828618
f
GR
GS
[0.75 0 0 0.75 628.45363 147.92136] CT
1 0 0 RC
N
f-1057828618
f
GR
GS
[0.75 0 0 0.75 0 -0.25] CT
1 0 0 RC
1 LJ
2 LW
N
837.938 197.562 M
837.938 731.438 L
304.062 731.438 L
S
GR
GS
[0.75 0 0 0.75 628.45363 147.92136] CT
1 0 0 RC
N
f-1057828618
f
GR
GS
[0.75 0 0 0.75 628.45363 548.32863] CT
1 0 0 RC
N
f-1057828618
f
GR
GS
[0.75 0 0 0.75 228.04635 548.32863] CT
1 0 0 RC
N
f-1057828618
f
GR
GS
[0.75 0 0 0.75 0 -0.25] CT
1 0 0 RC
1 LJ
2 LW
N
304.062 731.438 M
304.062 197.562 L
837.938 197.562 L
S
GR
GS
[0.75 0 0 0.75 228.04635 548.32863] CT
1 0 0 RC
N
f-1057828618
f
GR
GS
[0.75 0 0 0.75 228.04635 147.92136] CT
1 0 0 RC
N
f-1057828618
f
GR
GS
[0.75 0 0 0.75 628.45363 147.92136] CT
1 0 0 RC
N
f-1057828618
f
GR
GS
[0.75 0 0 0.75 0 -0.25] CT
1 0 0 RC
1 LJ
2 LW
N
837.938 197.562 M
837.938 731.438 L
304.062 731.438 L
S
GR
GS
[0.75 0 0 0.75 628.45363 147.92136] CT
1 0 0 RC
N
f-1057828618
f
GR
GS
[0.75 0 0 0.75 628.45363 548.32863] CT
1 0 0 RC
N
f-1057828618
f
GR
GS
[0.75 0 0 0.75 228.04635 548.32863] CT
1 0 0 RC
N
f-1057828618
f
GR
GS
[0.75 0 0 0.75 0 -0.25] CT
1 0 0 RC
1 LJ
2 LW
N
304.062 731.438 M
304.062 197.562 L
837.938 197.562 L
S
GR
GS
[0.75 0 0 0.75 228.04635 548.32863] CT
1 0 0 RC
N
f-1057828618
f
GR
GS
[0.75 0 0 0.75 228.04635 147.92136] CT
1 0 0 RC
N
f-1057828618
f
GR
GS
[0.75 0 0 0.75 628.45363 147.92136] CT
1 0 0 RC
N
f-1057828618
f
GR
GS
[0.75 0 0 0.75 0 -0.25] CT
1 0 0 RC
1 LJ
2 LW
N
837.938 197.562 M
837.938 731.438 L
304.062 731.438 L
S
GR
GS
[0.75 0 0 0.75 628.45363 147.92136] CT
1 0 0 RC
N
f-1057828618
f
GR
GS
[0.75 0 0 0.75 628.45363 548.32863] CT
1 0 0 RC
N
f-1057828618
f
GR
GS
[0.75 0 0 0.75 228.04635 548.32863] CT
1 0 0 RC
N
f-1057828618
f
GR
GS
[0.75 0 0 0.75 0 -0.25] CT
1 0 0 RC
1 LJ
2 LW
N
304.062 731.438 M
304.062 197.562 L
837.938 197.562 L
S
GR
GS
[0.75 0 0 0.75 228.04635 548.32863] CT
1 0 0 RC
N
f-1057828618
f
GR
GS
[0.75 0 0 0.75 228.04635 147.92136] CT
1 0 0 RC
N
f-1057828618
f
GR
GS
[0.75 0 0 0.75 628.45363 147.92136] CT
1 0 0 RC
N
f-1057828618
f
GR
GS
[0.75 0 0 0.75 0 -0.25] CT
1 0 0 RC
1 LJ
2 LW
N
837.938 197.562 M
837.938 731.438 L
304.062 731.438 L
S
GR
GS
[0.75 0 0 0.75 628.45363 147.92136] CT
1 0 0 RC
N
f-1057828618
f
GR
GS
[0.75 0 0 0.75 628.45363 548.32863] CT
1 0 0 RC
N
f-1057828618
f
GR
GS
[0.75 0 0 0.75 228.04635 548.32863] CT
1 0 0 RC
N
f-1057828618
f
GR
GS
[0.75 0 0 0.75 0 -0.25] CT
1 0 0 RC
1 LJ
2 LW
N
304.062 731.438 M
304.062 197.562 L
837.938 197.562 L
S
GR
GS
[0.75 0 0 0.75 228.04635 548.32863] CT
1 0 0 RC
N
f-1057828618
f
GR
GS
[0.75 0 0 0.75 228.04635 147.92136] CT
1 0 0 RC
N
f-1057828618
f
GR
GS
[0.75 0 0 0.75 628.45363 147.92136] CT
1 0 0 RC
N
f-1057828618
f
GR
GS
[0.75 0 0 0.75 0 -0.25] CT
1 0 0 RC
1 LJ
2 LW
N
837.938 197.562 M
837.938 731.438 L
304.062 731.438 L
S
GR
GS
[0.75 0 0 0.75 628.45363 147.92136] CT
1 0 0 RC
N
f-1057828618
f
GR
GS
[0.75 0 0 0.75 628.45363 548.32863] CT
1 0 0 RC
N
f-1057828618
f
GR
GS
[0.75 0 0 0.75 228.04635 548.32863] CT
1 0 0 RC
N
f-1057828618
f
GR
GS
[0.75 0 0 0.75 0 -0.25] CT
1 0 0 RC
1 LJ
2 LW
N
304.062 731.438 M
304.062 197.562 L
837.938 197.562 L
S
GR
GS
[0.75 0 0 0.75 228.04635 548.32863] CT
1 0 0 RC
N
f-1057828618
f
GR
GS
[0.75 0 0 0.75 228.04635 147.92136] CT
1 0 0 RC
N
f-1057828618
f
GR
GS
[0.75 0 0 0.75 628.45363 147.92136] CT
1 0 0 RC
N
f-1057828618
f
GR
GS
[0.75 0 0 0.75 0 -0.25] CT
1 0 0 RC
1 LJ
2 LW
N
837.938 197.562 M
837.938 731.438 L
304.062 731.438 L
S
GR
GS
[0.75 0 0 0.75 628.45363 147.92136] CT
1 0 0 RC
N
f-1057828618
f
GR
GS
[0.75 0 0 0.75 628.45363 548.32863] CT
1 0 0 RC
N
f-1057828618
f
GR
GS
[0.75 0 0 0.75 228.04635 548.32863] CT
1 0 0 RC
N
f-1057828618
f
GR
GS
[0.75 0 0 0.75 0 -0.25] CT
1 0 0 RC
1 LJ
2 LW
N
304.062 731.438 M
304.062 197.562 L
837.938 197.562 L
S
GR
GS
[0.75 0 0 0.75 228.04635 548.32863] CT
1 0 0 RC
N
f-1057828618
f
GR
GS
[0.75 0 0 0.75 228.04635 147.92136] CT
1 0 0 RC
N
f-1057828618
f
GR
GS
[0.75 0 0 0.75 628.45363 147.92136] CT
1 0 0 RC
N
f-1057828618
f
GR
GS
[0.75 0 0 0.75 0 -0.25] CT
1 0 0 RC
1 LJ
2 LW
N
837.938 197.562 M
837.938 731.438 L
304.062 731.438 L
S
GR
GS
[0.75 0 0 0.75 628.45363 147.92136] CT
1 0 0 RC
N
f-1057828618
f
GR
GS
[0.75 0 0 0.75 628.45363 548.32863] CT
1 0 0 RC
N
f-1057828618
f
GR
GS
[0.75 0 0 0.75 228.04635 548.32863] CT
1 0 0 RC
N
f-1057828618
f
GR
GS
[0.75 0 0 0.75 0 -0.25] CT
1 0 0 RC
1 LJ
2 LW
N
304.062 731.438 M
304.062 197.562 L
837.938 197.562 L
S
GR
GS
[0.75 0 0 0.75 228.04635 548.32863] CT
1 0 0 RC
N
f-1057828618
f
GR
GS
[0.75 0 0 0.75 228.04635 147.92136] CT
1 0 0 RC
N
f-1057828618
f
GR
GS
[0.75 0 0 0.75 628.45363 147.92136] CT
1 0 0 RC
N
f-1057828618
f
GR
GS
[0.75 0 0 0.75 0 -0.25] CT
1 0 0 RC
1 LJ
2 LW
N
837.938 197.562 M
837.938 731.438 L
304.062 731.438 L
S
GR
GS
[0.75 0 0 0.75 628.45363 147.92136] CT
1 0 0 RC
N
f-1057828618
f
GR
GS
[0.75 0 0 0.75 628.45363 548.32863] CT
1 0 0 RC
N
f-1057828618
f
GR
GS
[0.75 0 0 0.75 228.04635 548.32863] CT
1 0 0 RC
N
f-1057828618
f
GR
GS
[0.75 0 0 0.75 0 -0.25] CT
1 0 0 RC
1 LJ
2 LW
N
304.062 731.438 M
304.062 197.562 L
837.938 197.562 L
S
GR
GS
[0.75 0 0 0.75 228.04635 548.32863] CT
1 0 0 RC
N
f-1057828618
f
GR
GS
[0.75 0 0 0.75 228.04635 147.92136] CT
1 0 0 RC
N
f-1057828618
f
GR
GS
[0.75 0 0 0.75 628.45363 147.92136] CT
1 0 0 RC
N
f-1057828618
f
GR
GS
[0.75 0 0 0.75 0 -0.25] CT
1 0 0 RC
1 LJ
2 LW
N
837.938 197.562 M
837.938 731.438 L
304.062 731.438 L
S
GR
GS
[0.75 0 0 0.75 628.45363 147.92136] CT
1 0 0 RC
N
f-1057828618
f
GR
GS
[0.75 0 0 0.75 628.45363 548.32863] CT
1 0 0 RC
N
f-1057828618
f
GR
GS
[0.75 0 0 0.75 228.04635 548.32863] CT
1 0 0 RC
N
f-1057828618
f
GR
GS
[0.75 0 0 0.75 0 -0.25] CT
0 0 1 RC
[10 6] 0 setdash
2 LJ
0.667 LW
N
250 785.5 M
410.5 625 L
571 464.5 L
731.5 304 L
892 143.5 L
S
GR
GS
[0.75 0 0 0.75 0 -0.25] CT
1 GC
N
1095 786 M
1738 786 L
1738 143 L
1095 143 L
cp
f
GR
GS
[0.75 0 0 0.75 0 -0.25] CT
0.149 GC
2 setlinecap
1 LJ
2.667 LW
N
1095 786 M
1738 786 L
S
GR
GS
[0.75 0 0 0.75 0 -0.25] CT
0.149 GC
2 setlinecap
1 LJ
2.667 LW
N
1095 143 M
1738 143 L
S
GR
GS
[0.75 0 0 0.75 0 -0.25] CT
0.149 GC
2 setlinecap
1 LJ
2.667 LW
N
1095 786 M
1095 779.57 L
S
GR
GS
[0.75 0 0 0.75 0 -0.25] CT
0.149 GC
2 setlinecap
1 LJ
2.667 LW
N
1255.75 786 M
1255.75 779.57 L
S
GR
GS
[0.75 0 0 0.75 0 -0.25] CT
0.149 GC
2 setlinecap
1 LJ
2.667 LW
N
1416.5 786 M
1416.5 779.57 L
S
GR
GS
[0.75 0 0 0.75 0 -0.25] CT
0.149 GC
2 setlinecap
1 LJ
2.667 LW
N
1577.25 786 M
1577.25 779.57 L
S
GR
GS
[0.75 0 0 0.75 0 -0.25] CT
0.149 GC
2 setlinecap
1 LJ
2.667 LW
N
1738 786 M
1738 779.57 L
S
GR
GS
[0.75 0 0 0.75 0 -0.25] CT
0.149 GC
2 setlinecap
1 LJ
2.667 LW
N
1095 143 M
1095 149.43 L
S
GR
GS
[0.75 0 0 0.75 0 -0.25] CT
0.149 GC
2 setlinecap
1 LJ
2.667 LW
N
1255.75 143 M
1255.75 149.43 L
S
GR
GS
[0.75 0 0 0.75 0 -0.25] CT
0.149 GC
2 setlinecap
1 LJ
2.667 LW
N
1416.5 143 M
1416.5 149.43 L
S
GR
GS
[0.75 0 0 0.75 0 -0.25] CT
0.149 GC
2 setlinecap
1 LJ
2.667 LW
N
1577.25 143 M
1577.25 149.43 L
S
GR
GS
[0.75 0 0 0.75 0 -0.25] CT
0.149 GC
2 setlinecap
1 LJ
2.667 LW
N
1738 143 M
1738 149.43 L
S
GR
GS
[0.75 0 0 0.75 821.25 596.44998] CT
0.149 GC
/Helvetica 34.667 F
GS
[1 0 0 1 0 0] CT
-15.5 35 moveto 
1 -1 scale
(-1) t 
GR
GR
GS
[0.75 0 0 0.75 941.8125 596.44998] CT
0.149 GC
/Helvetica 34.667 F
GS
[1 0 0 1 0 0] CT
-30 35 moveto 
1 -1 scale
(-0.5) t 
GR
GR
GS
[0.75 0 0 0.75 1062.375 596.44998] CT
0.149 GC
/Helvetica 34.667 F
GS
[1 0 0 1 0 0] CT
-10 35 moveto 
1 -1 scale
(0) t 
GR
GR
GS
[0.75 0 0 0.75 1182.9375 596.44998] CT
0.149 GC
/Helvetica 34.667 F
GS
[1 0 0 1 0 0] CT
-24.5 35 moveto 
1 -1 scale
(0.5) t 
GR
GR
GS
[0.75 0 0 0.75 1303.5 596.44998] CT
0.149 GC
/Helvetica 34.667 F
GS
[1 0 0 1 0 0] CT
-10 35 moveto 
1 -1 scale
(1) t 
GR
GR
GS
[0.75 0 0 0.75 1062.37527 629.70001] CT
0.149 GC
/Helvetica 38.133 F
GS
[1 0 0 1 0 0] CT
-10 39 moveto 
1 -1 scale
(x) t 
GR
GR
GS
[0.75 0 0 0.75 0 -0.25] CT
0.149 GC
2 setlinecap
1 LJ
2.667 LW
N
1095 786 M
1095 143 L
S
GR
GS
[0.75 0 0 0.75 0 -0.25] CT
0.149 GC
2 setlinecap
1 LJ
2.667 LW
N
1738 786 M
1738 143 L
S
GR
GS
[0.75 0 0 0.75 0 -0.25] CT
0.149 GC
2 setlinecap
1 LJ
2.667 LW
N
1095 786 M
1101.43 786 L
S
GR
GS
[0.75 0 0 0.75 0 -0.25] CT
0.149 GC
2 setlinecap
1 LJ
2.667 LW
N
1095 705.625 M
1101.43 705.625 L
S
GR
GS
[0.75 0 0 0.75 0 -0.25] CT
0.149 GC
2 setlinecap
1 LJ
2.667 LW
N
1095 625.25 M
1101.43 625.25 L
S
GR
GS
[0.75 0 0 0.75 0 -0.25] CT
0.149 GC
2 setlinecap
1 LJ
2.667 LW
N
1095 544.875 M
1101.43 544.875 L
S
GR
GS
[0.75 0 0 0.75 0 -0.25] CT
0.149 GC
2 setlinecap
1 LJ
2.667 LW
N
1095 464.5 M
1101.43 464.5 L
S
GR
GS
[0.75 0 0 0.75 0 -0.25] CT
0.149 GC
2 setlinecap
1 LJ
2.667 LW
N
1095 384.125 M
1101.43 384.125 L
S
GR
GS
[0.75 0 0 0.75 0 -0.25] CT
0.149 GC
2 setlinecap
1 LJ
2.667 LW
N
1095 303.75 M
1101.43 303.75 L
S
GR
GS
[0.75 0 0 0.75 0 -0.25] CT
0.149 GC
2 setlinecap
1 LJ
2.667 LW
N
1095 223.375 M
1101.43 223.375 L
S
GR
GS
[0.75 0 0 0.75 0 -0.25] CT
0.149 GC
2 setlinecap
1 LJ
2.667 LW
N
1095 143 M
1101.43 143 L
S
GR
GS
[0.75 0 0 0.75 0 -0.25] CT
0.149 GC
2 setlinecap
1 LJ
2.667 LW
N
1738 786 M
1731.57 786 L
S
GR
GS
[0.75 0 0 0.75 0 -0.25] CT
0.149 GC
2 setlinecap
1 LJ
2.667 LW
N
1738 705.625 M
1731.57 705.625 L
S
GR
GS
[0.75 0 0 0.75 0 -0.25] CT
0.149 GC
2 setlinecap
1 LJ
2.667 LW
N
1738 625.25 M
1731.57 625.25 L
S
GR
GS
[0.75 0 0 0.75 0 -0.25] CT
0.149 GC
2 setlinecap
1 LJ
2.667 LW
N
1738 544.875 M
1731.57 544.875 L
S
GR
GS
[0.75 0 0 0.75 0 -0.25] CT
0.149 GC
2 setlinecap
1 LJ
2.667 LW
N
1738 464.5 M
1731.57 464.5 L
S
GR
GS
[0.75 0 0 0.75 0 -0.25] CT
0.149 GC
2 setlinecap
1 LJ
2.667 LW
N
1738 384.125 M
1731.57 384.125 L
S
GR
GS
[0.75 0 0 0.75 0 -0.25] CT
0.149 GC
2 setlinecap
1 LJ
2.667 LW
N
1738 303.75 M
1731.57 303.75 L
S
GR
GS
[0.75 0 0 0.75 0 -0.25] CT
0.149 GC
2 setlinecap
1 LJ
2.667 LW
N
1738 223.375 M
1731.57 223.375 L
S
GR
GS
[0.75 0 0 0.75 0 -0.25] CT
0.149 GC
2 setlinecap
1 LJ
2.667 LW
N
1738 143 M
1731.57 143 L
S
GR
GS
[0.75 0 0 0.75 814.05002 589.25] CT
0.149 GC
/Helvetica 34.667 F
GS
[1 0 0 1 0 0] CT
-31 13.5 moveto 
1 -1 scale
(-2) t 
GR
GR
GS
[0.75 0 0 0.75 814.05002 528.96875] CT
0.149 GC
/Helvetica 34.667 F
GS
[1 0 0 1 0 0] CT
-60 13.5 moveto 
1 -1 scale
(-1.5) t 
GR
GR
GS
[0.75 0 0 0.75 814.05002 468.6875] CT
0.149 GC
/Helvetica 34.667 F
GS
[1 0 0 1 0 0] CT
-31 13.5 moveto 
1 -1 scale
(-1) t 
GR
GR
GS
[0.75 0 0 0.75 814.05002 408.40625] CT
0.149 GC
/Helvetica 34.667 F
GS
[1 0 0 1 0 0] CT
-60 13.5 moveto 
1 -1 scale
(-0.5) t 
GR
GR
GS
[0.75 0 0 0.75 814.05002 348.125] CT
0.149 GC
/Helvetica 34.667 F
GS
[1 0 0 1 0 0] CT
-20 13.5 moveto 
1 -1 scale
(0) t 
GR
GR
GS
[0.75 0 0 0.75 814.05002 287.84375] CT
0.149 GC
/Helvetica 34.667 F
GS
[1 0 0 1 0 0] CT
-49 13.5 moveto 
1 -1 scale
(0.5) t 
GR
GR
GS
[0.75 0 0 0.75 814.05002 227.5625] CT
0.149 GC
/Helvetica 34.667 F
GS
[1 0 0 1 0 0] CT
-20 13.5 moveto 
1 -1 scale
(1) t 
GR
GR
GS
[0.75 0 0 0.75 814.05002 167.28125] CT
0.149 GC
/Helvetica 34.667 F
GS
[1 0 0 1 0 0] CT
-49 13.5 moveto 
1 -1 scale
(1.5) t 
GR
GR
GS
[0.75 0 0 0.75 814.05002 107] CT
0.149 GC
/Helvetica 34.667 F
GS
[1 0 0 1 0 0] CT
-20 13.5 moveto 
1 -1 scale
(2) t 
GR
GR
GS
[0 -0.75 0.75 0 766.05002 348.12477] CT
0.149 GC
/Helvetica 38.133 F
GS
[1 0 0 1 0 0] CT
-28 -9 moveto 
1 -1 scale
(f\(x\)) t 
GR
GR
GS
[0.75 0 0 0.75 0 -0.25] CT
1 0 0 RC
1 LJ
2.667 LW
N
1095 464.5 M
1101.43 467.243 L
1107.86 469.916 L
1114.29 472.437 L
1120.72 474.693 L
1127.15 476.541 L
1133.58 477.8 L
1140.01 478.267 L
1146.44 477.723 L
1152.87 475.961 L
1159.3 472.806 L
1165.73 468.145 L
1172.16 461.944 L
1178.59 454.271 L
1185.02 445.304 L
1191.45 435.326 L
1197.88 424.712 L
1204.31 413.906 L
1210.74 403.382 L
1217.17 393.602 L
1223.6 384.973 L
1230.03 377.795 L
1236.46 372.23 L
1242.89 368.268 L
1249.32 365.714 L
1255.75 364.194 L
1262.18 363.177 L
1268.61 362.009 L
1275.04 359.978 L
1281.47 356.373 L
1287.9 350.564 L
1294.33 342.068 L
1300.76 330.622 L
1307.19 316.234 L
1313.62 299.215 L
1320.05 280.191 L
1326.48 260.085 L
1332.91 240.076 L
1339.34 221.534 L
1345.77 205.929 L
1352.2 194.732 L
1358.63 189.306 L
1365.06 190.801 L
1371.49 200.055 L
1377.92 217.521 L
1384.35 243.212 L
1390.78 276.674 L
1397.21 317.007 L
1403.64 362.896 L
1410.07 412.69 L
1416.5 464.5 L
1422.93 516.31 L
1429.36 566.104 L
1435.79 611.993 L
1442.22 652.326 L
1448.65 685.789 L
1455.08 711.479 L
1461.51 728.945 L
1467.94 738.199 L
1474.37 739.694 L
1480.8 734.268 L
1487.23 723.071 L
1493.66 707.466 L
1500.09 688.924 L
1506.52 668.915 L
1512.95 648.809 L
1519.38 629.785 L
1525.81 612.766 L
1532.24 598.378 L
1538.67 586.932 L
1545.1 578.436 L
1551.53 572.627 L
1557.96 569.022 L
1564.39 566.991 L
1570.82 565.823 L
1577.25 564.806 L
1583.68 563.286 L
1590.11 560.732 L
1596.54 556.77 L
1602.97 551.205 L
1609.4 544.027 L
1615.83 535.398 L
1622.26 525.619 L
1628.69 515.094 L
1635.12 504.288 L
1641.55 493.674 L
1647.98 483.696 L
1654.41 474.729 L
1660.84 467.056 L
1667.27 460.855 L
1673.7 456.194 L
1680.13 453.039 L
1686.56 451.277 L
1692.99 450.733 L
1699.42 451.2 L
1705.85 452.459 L
1712.28 454.307 L
1718.71 456.563 L
1725.14 459.084 L
1731.57 461.757 L
1738 464.5 L
S
GR
%%Trailer
%%Pages: 1
%%EOF
