%!PS-Adobe-3.0 EPSF-3.0
%%Creator: (MATLAB, The Mathworks, Inc. Version 9.8.0.1359463 \(R2020a\) Update 1. Operating System: Windows 10)
%%Title: ./MTLB_1Dsin_NewtonGamma_v1_20210208.eps
%%CreationDate: 2021-02-08T18:49:21
%%Pages: (atend)
%%BoundingBox:   368     3  1046   677
%%LanguageLevel: 3
%%EndComments
%%BeginProlog
%%BeginResource: procset (Apache XML Graphics Std ProcSet) 1.2 0
%%Version: 1.2 0
%%Copyright: (Copyright 2001-2003,2010 The Apache Software Foundation. License terms: http://www.apache.org/licenses/LICENSE-2.0)
/bd{bind def}bind def
/ld{load def}bd
/GR/grestore ld
/GS/gsave ld
/RM/rmoveto ld
/C/curveto ld
/t/show ld
/L/lineto ld
/ML/setmiterlimit ld
/CT/concat ld
/f/fill ld
/N/newpath ld
/S/stroke ld
/CC/setcmykcolor ld
/A/ashow ld
/cp/closepath ld
/RC/setrgbcolor ld
/LJ/setlinejoin ld
/GC/setgray ld
/LW/setlinewidth ld
/M/moveto ld
/re {4 2 roll M
1 index 0 rlineto
0 exch rlineto
neg 0 rlineto
cp } bd
/_ctm matrix def
/_tm matrix def
/BT { _ctm currentmatrix pop matrix _tm copy pop 0 0 moveto } bd
/ET { _ctm setmatrix } bd
/iTm { _ctm setmatrix _tm concat } bd
/Tm { _tm astore pop iTm 0 0 moveto } bd
/ux 0.0 def
/uy 0.0 def
/F {
  /Tp exch def
  /Tf exch def
  Tf findfont Tp scalefont setfont
  /cf Tf def  /cs Tp def
} bd
/ULS {currentpoint /uy exch def /ux exch def} bd
/ULE {
  /Tcx currentpoint pop def
  gsave
  newpath
  cf findfont cs scalefont dup
  /FontMatrix get 0 get /Ts exch def /FontInfo get dup
  /UnderlinePosition get Ts mul /To exch def
  /UnderlineThickness get Ts mul /Tt exch def
  ux uy To add moveto  Tcx uy To add lineto
  Tt setlinewidth stroke
  grestore
} bd
/OLE {
  /Tcx currentpoint pop def
  gsave
  newpath
  cf findfont cs scalefont dup
  /FontMatrix get 0 get /Ts exch def /FontInfo get dup
  /UnderlinePosition get Ts mul /To exch def
  /UnderlineThickness get Ts mul /Tt exch def
  ux uy To add cs add moveto Tcx uy To add cs add lineto
  Tt setlinewidth stroke
  grestore
} bd
/SOE {
  /Tcx currentpoint pop def
  gsave
  newpath
  cf findfont cs scalefont dup
  /FontMatrix get 0 get /Ts exch def /FontInfo get dup
  /UnderlinePosition get Ts mul /To exch def
  /UnderlineThickness get Ts mul /Tt exch def
  ux uy To add cs 10 mul 26 idiv add moveto Tcx uy To add cs 10 mul 26 idiv add lineto
  Tt setlinewidth stroke
  grestore
} bd
/QT {
/Y22 exch store
/X22 exch store
/Y21 exch store
/X21 exch store
currentpoint
/Y21 load 2 mul add 3 div exch
/X21 load 2 mul add 3 div exch
/X21 load 2 mul /X22 load add 3 div
/Y21 load 2 mul /Y22 load add 3 div
/X22 load /Y22 load curveto
} bd
/SSPD {
dup length /d exch dict def
{
/v exch def
/k exch def
currentpagedevice k known {
/cpdv currentpagedevice k get def
v cpdv ne {
/upd false def
/nullv v type /nulltype eq def
/nullcpdv cpdv type /nulltype eq def
nullv nullcpdv or
{
/upd true def
} {
/sametype v type cpdv type eq def
sametype {
v type /arraytype eq {
/vlen v length def
/cpdvlen cpdv length def
vlen cpdvlen eq {
0 1 vlen 1 sub {
/i exch def
/obj v i get def
/cpdobj cpdv i get def
obj cpdobj ne {
/upd true def
exit
} if
} for
} {
/upd true def
} ifelse
} {
v type /dicttype eq {
v {
/dv exch def
/dk exch def
/cpddv cpdv dk get def
dv cpddv ne {
/upd true def
exit
} if
} forall
} {
/upd true def
} ifelse
} ifelse
} if
} ifelse
upd true eq {
d k v put
} if
} if
} if
} forall
d length 0 gt {
d setpagedevice
} if
} bd
/RE { % /NewFontName [NewEncodingArray] /FontName RE -
  findfont dup length dict begin
  {
    1 index /FID ne
    {def} {pop pop} ifelse
  } forall
  /Encoding exch def
  /FontName 1 index def
  currentdict definefont pop
  end
} bind def
%%EndResource
%%BeginResource: procset (Apache XML Graphics EPS ProcSet) 1.0 0
%%Version: 1.0 0
%%Copyright: (Copyright 2002-2003 The Apache Software Foundation. License terms: http://www.apache.org/licenses/LICENSE-2.0)
/BeginEPSF { %def
/b4_Inc_state save def         % Save state for cleanup
/dict_count countdictstack def % Count objects on dict stack
/op_count count 1 sub def      % Count objects on operand stack
userdict begin                 % Push userdict on dict stack
/showpage { } def              % Redefine showpage, { } = null proc
0 setgray 0 setlinecap         % Prepare graphics state
1 setlinewidth 0 setlinejoin
10 setmiterlimit [ ] 0 setdash newpath
/languagelevel where           % If level not equal to 1 then
{pop languagelevel             % set strokeadjust and
1 ne                           % overprint to their defaults.
{false setstrokeadjust false setoverprint
} if
} if
} bd
/EndEPSF { %def
count op_count sub {pop} repeat            % Clean up stacks
countdictstack dict_count sub {end} repeat
b4_Inc_state restore
} bd
%%EndResource
%FOPBeginFontDict
%%IncludeResource: font Courier-Oblique
%%IncludeResource: font Courier-BoldOblique
%%IncludeResource: font Courier-Bold
%%IncludeResource: font ZapfDingbats
%%IncludeResource: font Symbol
%%IncludeResource: font Helvetica
%%IncludeResource: font Helvetica-Oblique
%%IncludeResource: font Helvetica-Bold
%%IncludeResource: font Helvetica-BoldOblique
%%IncludeResource: font Times-Roman
%%IncludeResource: font Times-Italic
%%IncludeResource: font Times-Bold
%%IncludeResource: font Times-BoldItalic
%%IncludeResource: font Courier
%FOPEndFontDict
%%BeginResource: encoding WinAnsiEncoding
/WinAnsiEncoding [
/.notdef /.notdef /.notdef /.notdef /.notdef
/.notdef /.notdef /.notdef /.notdef /.notdef
/.notdef /.notdef /.notdef /.notdef /.notdef
/.notdef /.notdef /.notdef /.notdef /.notdef
/.notdef /.notdef /.notdef /.notdef /.notdef
/.notdef /.notdef /.notdef /.notdef /.notdef
/.notdef /.notdef /space /exclam /quotedbl
/numbersign /dollar /percent /ampersand /quotesingle
/parenleft /parenright /asterisk /plus /comma
/hyphen /period /slash /zero /one
/two /three /four /five /six
/seven /eight /nine /colon /semicolon
/less /equal /greater /question /at
/A /B /C /D /E
/F /G /H /I /J
/K /L /M /N /O
/P /Q /R /S /T
/U /V /W /X /Y
/Z /bracketleft /backslash /bracketright /asciicircum
/underscore /quoteleft /a /b /c
/d /e /f /g /h
/i /j /k /l /m
/n /o /p /q /r
/s /t /u /v /w
/x /y /z /braceleft /bar
/braceright /asciitilde /bullet /Euro /bullet
/quotesinglbase /florin /quotedblbase /ellipsis /dagger
/daggerdbl /circumflex /perthousand /Scaron /guilsinglleft
/OE /bullet /Zcaron /bullet /bullet
/quoteleft /quoteright /quotedblleft /quotedblright /bullet
/endash /emdash /asciitilde /trademark /scaron
/guilsinglright /oe /bullet /zcaron /Ydieresis
/space /exclamdown /cent /sterling /currency
/yen /brokenbar /section /dieresis /copyright
/ordfeminine /guillemotleft /logicalnot /sfthyphen /registered
/macron /degree /plusminus /twosuperior /threesuperior
/acute /mu /paragraph /middot /cedilla
/onesuperior /ordmasculine /guillemotright /onequarter /onehalf
/threequarters /questiondown /Agrave /Aacute /Acircumflex
/Atilde /Adieresis /Aring /AE /Ccedilla
/Egrave /Eacute /Ecircumflex /Edieresis /Igrave
/Iacute /Icircumflex /Idieresis /Eth /Ntilde
/Ograve /Oacute /Ocircumflex /Otilde /Odieresis
/multiply /Oslash /Ugrave /Uacute /Ucircumflex
/Udieresis /Yacute /Thorn /germandbls /agrave
/aacute /acircumflex /atilde /adieresis /aring
/ae /ccedilla /egrave /eacute /ecircumflex
/edieresis /igrave /iacute /icircumflex /idieresis
/eth /ntilde /ograve /oacute /ocircumflex
/otilde /odieresis /divide /oslash /ugrave
/uacute /ucircumflex /udieresis /yacute /thorn
/ydieresis
] def
%%EndResource
%FOPBeginFontReencode
/Courier-Oblique findfont
dup length dict begin
  {1 index /FID ne {def} {pop pop} ifelse} forall
  /Encoding WinAnsiEncoding def
  currentdict
end
/Courier-Oblique exch definefont pop
/Courier-BoldOblique findfont
dup length dict begin
  {1 index /FID ne {def} {pop pop} ifelse} forall
  /Encoding WinAnsiEncoding def
  currentdict
end
/Courier-BoldOblique exch definefont pop
/Courier-Bold findfont
dup length dict begin
  {1 index /FID ne {def} {pop pop} ifelse} forall
  /Encoding WinAnsiEncoding def
  currentdict
end
/Courier-Bold exch definefont pop
/Helvetica findfont
dup length dict begin
  {1 index /FID ne {def} {pop pop} ifelse} forall
  /Encoding WinAnsiEncoding def
  currentdict
end
/Helvetica exch definefont pop
/Helvetica-Oblique findfont
dup length dict begin
  {1 index /FID ne {def} {pop pop} ifelse} forall
  /Encoding WinAnsiEncoding def
  currentdict
end
/Helvetica-Oblique exch definefont pop
/Helvetica-Bold findfont
dup length dict begin
  {1 index /FID ne {def} {pop pop} ifelse} forall
  /Encoding WinAnsiEncoding def
  currentdict
end
/Helvetica-Bold exch definefont pop
/Helvetica-BoldOblique findfont
dup length dict begin
  {1 index /FID ne {def} {pop pop} ifelse} forall
  /Encoding WinAnsiEncoding def
  currentdict
end
/Helvetica-BoldOblique exch definefont pop
/Times-Roman findfont
dup length dict begin
  {1 index /FID ne {def} {pop pop} ifelse} forall
  /Encoding WinAnsiEncoding def
  currentdict
end
/Times-Roman exch definefont pop
/Times-Italic findfont
dup length dict begin
  {1 index /FID ne {def} {pop pop} ifelse} forall
  /Encoding WinAnsiEncoding def
  currentdict
end
/Times-Italic exch definefont pop
/Times-Bold findfont
dup length dict begin
  {1 index /FID ne {def} {pop pop} ifelse} forall
  /Encoding WinAnsiEncoding def
  currentdict
end
/Times-Bold exch definefont pop
/Times-BoldItalic findfont
dup length dict begin
  {1 index /FID ne {def} {pop pop} ifelse} forall
  /Encoding WinAnsiEncoding def
  currentdict
end
/Times-BoldItalic exch definefont pop
/Courier findfont
dup length dict begin
  {1 index /FID ne {def} {pop pop} ifelse} forall
  /Encoding WinAnsiEncoding def
  currentdict
end
/Courier exch definefont pop
%FOPEndFontReencode
%%EndProlog
%%Page: 1 1
%%PageBoundingBox: 0 0 1440 722
%%BeginPageSetup
[1 0 0 -1 0 722] CT
%%EndPageSetup
GS
[0.75 0 0 0.75 0 -0.25] CT
1 GC
N
0 0 1920 963 re
f
GR
GS
[0.75 0 0 0.75 0 -0.25] CT
1 GC
N
601.5 857 M
1386.5 857 L
1386.5 72 L
601.5 72 L
cp
f
GR
GS
[0.75 0 0 0.75 0 -0.25] CT
0.149 GC
2 setlinecap
1 LJ
2.667 LW
N
601.5 857 M
1386.5 857 L
S
GR
GS
[0.75 0 0 0.75 0 -0.25] CT
0.149 GC
2 setlinecap
1 LJ
2.667 LW
N
601.5 72 M
1386.5 72 L
S
GR
GS
[0.75 0 0 0.75 0 -0.25] CT
0.149 GC
2 setlinecap
1 LJ
2.667 LW
N
601.5 857 M
601.5 849.15 L
S
GR
GS
[0.75 0 0 0.75 0 -0.25] CT
0.149 GC
2 setlinecap
1 LJ
2.667 LW
N
797.75 857 M
797.75 849.15 L
S
GR
GS
[0.75 0 0 0.75 0 -0.25] CT
0.149 GC
2 setlinecap
1 LJ
2.667 LW
N
994 857 M
994 849.15 L
S
GR
GS
[0.75 0 0 0.75 0 -0.25] CT
0.149 GC
2 setlinecap
1 LJ
2.667 LW
N
1190.25 857 M
1190.25 849.15 L
S
GR
GS
[0.75 0 0 0.75 0 -0.25] CT
0.149 GC
2 setlinecap
1 LJ
2.667 LW
N
1386.5 857 M
1386.5 849.15 L
S
GR
GS
[0.75 0 0 0.75 0 -0.25] CT
0.149 GC
2 setlinecap
1 LJ
2.667 LW
N
601.5 72 M
601.5 79.85 L
S
GR
GS
[0.75 0 0 0.75 0 -0.25] CT
0.149 GC
2 setlinecap
1 LJ
2.667 LW
N
797.75 72 M
797.75 79.85 L
S
GR
GS
[0.75 0 0 0.75 0 -0.25] CT
0.149 GC
2 setlinecap
1 LJ
2.667 LW
N
994 72 M
994 79.85 L
S
GR
GS
[0.75 0 0 0.75 0 -0.25] CT
0.149 GC
2 setlinecap
1 LJ
2.667 LW
N
1190.25 72 M
1190.25 79.85 L
S
GR
GS
[0.75 0 0 0.75 0 -0.25] CT
0.149 GC
2 setlinecap
1 LJ
2.667 LW
N
1386.5 72 M
1386.5 79.85 L
S
GR
GS
[0.75 0 0 0.75 451.125 649.70003] CT
0.149 GC
/Helvetica 34.667 F
GS
[1 0 0 1 0 0] CT
-15.5 35 moveto 
1 -1 scale
(-2) t 
GR
GR
GS
[0.75 0 0 0.75 598.3125 649.70003] CT
0.149 GC
/Helvetica 34.667 F
GS
[1 0 0 1 0 0] CT
-15.5 35 moveto 
1 -1 scale
(-1) t 
GR
GR
GS
[0.75 0 0 0.75 745.5 649.70003] CT
0.149 GC
/Helvetica 34.667 F
GS
[1 0 0 1 0 0] CT
-10 35 moveto 
1 -1 scale
(0) t 
GR
GR
GS
[0.75 0 0 0.75 892.6875 649.70003] CT
0.149 GC
/Helvetica 34.667 F
GS
[1 0 0 1 0 0] CT
-10 35 moveto 
1 -1 scale
(1) t 
GR
GR
GS
[0.75 0 0 0.75 1039.875 649.70003] CT
0.149 GC
/Helvetica 34.667 F
GS
[1 0 0 1 0 0] CT
-10 35 moveto 
1 -1 scale
(2) t 
GR
GR
GS
[0.75 0 0 0.75 738 712.25] CT
0.149 GC
N
11.203 7.438 M
11.203 6.594 11.586 4.961 QT
11.969 3.328 12.516 1.477 QT
13.063 -0.375 13.453 -1.563 QT
13.594 -3.453 13.594 -4.422 QT
13.594 -6.859 13.117 -8.969 QT
12.641 -11.078 11.305 -12.5 QT
9.969 -13.922 7.578 -13.922 QT
6.313 -13.922 5.055 -13.383 QT
3.797 -12.844 2.898 -11.875 QT
2 -10.906 1.672 -9.688 QT
1.594 -9.469 1.375 -9.469 QT
0.906 -9.469 L
0.609 -9.469 0.609 -9.797 QT
0.609 -9.922 L
1.047 -11.641 2.125 -13.227 QT
3.203 -14.813 4.773 -15.805 QT
6.344 -16.797 8.094 -16.797 QT
9.875 -16.797 11.172 -15.586 QT
12.469 -14.375 13.25 -12.523 QT
14.031 -10.672 14.375 -8.781 QT
14.719 -6.891 14.719 -5.219 QT
16.625 -10.406 19 -15.047 QT
19.578 -16.266 L
19.688 -16.391 19.828 -16.391 QT
20.297 -16.391 L
20.594 -16.391 20.594 -16.031 QT
20.594 -15.953 20.516 -15.813 QT
19.953 -14.625 L
18.297 -11.344 16.914 -7.961 QT
15.531 -4.578 14.547 -1.453 QT
14.406 -0.172 13.984 2.055 QT
13.563 4.281 12.969 6.203 QT
12.375 8.125 11.781 8.203 QT
11.203 8.203 11.203 7.438 QT
cp
f
GR
GS
[0.75 0 0 0.75 0 -0.25] CT
0.149 GC
2 setlinecap
1 LJ
2.667 LW
N
601.5 857 M
601.5 72 L
S
GR
GS
[0.75 0 0 0.75 0 -0.25] CT
0.149 GC
2 setlinecap
1 LJ
2.667 LW
N
1386.5 857 M
1386.5 72 L
S
GR
GS
[0.75 0 0 0.75 0 -0.25] CT
0.149 GC
2 setlinecap
1 LJ
2.667 LW
N
601.5 857 M
609.35 857 L
S
GR
GS
[0.75 0 0 0.75 0 -0.25] CT
0.149 GC
2 setlinecap
1 LJ
2.667 LW
N
601.5 758.875 M
609.35 758.875 L
S
GR
GS
[0.75 0 0 0.75 0 -0.25] CT
0.149 GC
2 setlinecap
1 LJ
2.667 LW
N
601.5 660.75 M
609.35 660.75 L
S
GR
GS
[0.75 0 0 0.75 0 -0.25] CT
0.149 GC
2 setlinecap
1 LJ
2.667 LW
N
601.5 562.625 M
609.35 562.625 L
S
GR
GS
[0.75 0 0 0.75 0 -0.25] CT
0.149 GC
2 setlinecap
1 LJ
2.667 LW
N
601.5 464.5 M
609.35 464.5 L
S
GR
GS
[0.75 0 0 0.75 0 -0.25] CT
0.149 GC
2 setlinecap
1 LJ
2.667 LW
N
601.5 366.375 M
609.35 366.375 L
S
GR
GS
[0.75 0 0 0.75 0 -0.25] CT
0.149 GC
2 setlinecap
1 LJ
2.667 LW
N
601.5 268.25 M
609.35 268.25 L
S
GR
GS
[0.75 0 0 0.75 0 -0.25] CT
0.149 GC
2 setlinecap
1 LJ
2.667 LW
N
601.5 170.125 M
609.35 170.125 L
S
GR
GS
[0.75 0 0 0.75 0 -0.25] CT
0.149 GC
2 setlinecap
1 LJ
2.667 LW
N
601.5 72 M
609.35 72 L
S
GR
GS
[0.75 0 0 0.75 0 -0.25] CT
0.149 GC
2 setlinecap
1 LJ
2.667 LW
N
1386.5 857 M
1378.65 857 L
S
GR
GS
[0.75 0 0 0.75 0 -0.25] CT
0.149 GC
2 setlinecap
1 LJ
2.667 LW
N
1386.5 758.875 M
1378.65 758.875 L
S
GR
GS
[0.75 0 0 0.75 0 -0.25] CT
0.149 GC
2 setlinecap
1 LJ
2.667 LW
N
1386.5 660.75 M
1378.65 660.75 L
S
GR
GS
[0.75 0 0 0.75 0 -0.25] CT
0.149 GC
2 setlinecap
1 LJ
2.667 LW
N
1386.5 562.625 M
1378.65 562.625 L
S
GR
GS
[0.75 0 0 0.75 0 -0.25] CT
0.149 GC
2 setlinecap
1 LJ
2.667 LW
N
1386.5 464.5 M
1378.65 464.5 L
S
GR
GS
[0.75 0 0 0.75 0 -0.25] CT
0.149 GC
2 setlinecap
1 LJ
2.667 LW
N
1386.5 366.375 M
1378.65 366.375 L
S
GR
GS
[0.75 0 0 0.75 0 -0.25] CT
0.149 GC
2 setlinecap
1 LJ
2.667 LW
N
1386.5 268.25 M
1378.65 268.25 L
S
GR
GS
[0.75 0 0 0.75 0 -0.25] CT
0.149 GC
2 setlinecap
1 LJ
2.667 LW
N
1386.5 170.125 M
1378.65 170.125 L
S
GR
GS
[0.75 0 0 0.75 0 -0.25] CT
0.149 GC
2 setlinecap
1 LJ
2.667 LW
N
1386.5 72 M
1378.65 72 L
S
GR
GS
[0.75 0 0 0.75 443.92497 642.5] CT
0.149 GC
/Helvetica 34.667 F
GS
[1 0 0 1 0 0] CT
-31 13.5 moveto 
1 -1 scale
(-2) t 
GR
GR
GS
[0.75 0 0 0.75 443.92497 568.90625] CT
0.149 GC
/Helvetica 34.667 F
GS
[1 0 0 1 0 0] CT
-60 13.5 moveto 
1 -1 scale
(-1.5) t 
GR
GR
GS
[0.75 0 0 0.75 443.92497 495.3125] CT
0.149 GC
/Helvetica 34.667 F
GS
[1 0 0 1 0 0] CT
-31 13.5 moveto 
1 -1 scale
(-1) t 
GR
GR
GS
[0.75 0 0 0.75 443.92497 421.71875] CT
0.149 GC
/Helvetica 34.667 F
GS
[1 0 0 1 0 0] CT
-60 13.5 moveto 
1 -1 scale
(-0.5) t 
GR
GR
GS
[0.75 0 0 0.75 443.92497 348.125] CT
0.149 GC
/Helvetica 34.667 F
GS
[1 0 0 1 0 0] CT
-20 13.5 moveto 
1 -1 scale
(0) t 
GR
GR
GS
[0.75 0 0 0.75 443.92497 274.53125] CT
0.149 GC
/Helvetica 34.667 F
GS
[1 0 0 1 0 0] CT
-49 13.5 moveto 
1 -1 scale
(0.5) t 
GR
GR
GS
[0.75 0 0 0.75 443.92497 200.9375] CT
0.149 GC
/Helvetica 34.667 F
GS
[1 0 0 1 0 0] CT
-20 13.5 moveto 
1 -1 scale
(1) t 
GR
GR
GS
[0.75 0 0 0.75 443.92497 127.34375] CT
0.149 GC
/Helvetica 34.667 F
GS
[1 0 0 1 0 0] CT
-49 13.5 moveto 
1 -1 scale
(1.5) t 
GR
GR
GS
[0.75 0 0 0.75 443.92497 53.75] CT
0.149 GC
/Helvetica 34.667 F
GS
[1 0 0 1 0 0] CT
-20 13.5 moveto 
1 -1 scale
(2) t 
GR
GR
GS
[0 -0.75 0.75 0 395.92497 348.12473] CT
0.149 GC
/Helvetica 38.133 F
GS
[1 0 0 1 0 0] CT
-235.5 -9 moveto 
1 -1 scale
(NR accelerated alt Schwarz) t 
GR
GR
GS
[0.75 0 0 0.75 451.125 348.125] CT
1 0 0 RC
N
2.222 0 M
2.222 1.227 1.227 2.222 0 2.222 C
-1.227 2.222 -2.222 1.227 -2.222 0 C
-2.222 -1.227 -1.227 -2.222 0 -2.222 C
1.227 -2.222 2.222 -1.227 2.222 0 C
cp
f
GR
GS
[0.75 0 0 0.75 458.48438 348.125] CT
1 0 0 RC
N
/f-1759579234{2.222 0 M
2.222 1.227 1.227 2.222 0 2.222 C
-1.227 2.222 -2.222 1.227 -2.222 0 C
-2.222 -1.227 -1.227 -2.222 0 -2.222 C
1.227 -2.222 2.222 -1.227 2.222 0 C
cp}def
f-1759579234
f
GR
GS
[0.75 0 0 0.75 465.84375 348.125] CT
1 0 0 RC
N
f-1759579234
f
GR
GS
[0.75 0 0 0.75 473.20313 348.125] CT
1 0 0 RC
N
f-1759579234
f
GR
GS
[0.75 0 0 0.75 480.5625 348.125] CT
1 0 0 RC
N
f-1759579234
f
GR
GS
[0.75 0 0 0.75 487.92188 348.125] CT
1 0 0 RC
N
f-1759579234
f
GR
GS
[0.75 0 0 0.75 495.28125 588.44571] CT
1 0 0 RC
N
f-1759579234
f
GR
GS
[0.75 0 0 0.75 502.64063 588.44571] CT
1 0 0 RC
N
f-1759579234
f
GR
GS
[0.75 0 0 0.75 510 588.44571] CT
1 0 0 RC
N
f-1759579234
f
GR
GS
[0.75 0 0 0.75 517.35938 588.44571] CT
1 0 0 RC
N
f-1759579234
f
GR
GS
[0.75 0 0 0.75 524.71875 588.44571] CT
1 0 0 RC
N
f-1759579234
f
GR
GS
[0.75 0 0 0.75 532.07813 348.125] CT
1 0 0 RC
N
f-1759579234
f
GR
GS
[0.75 0 0 0.75 539.4375 348.125] CT
1 0 0 RC
N
f-1759579234
f
GR
GS
[0.75 0 0 0.75 546.79688 348.125] CT
1 0 0 RC
N
f-1759579234
f
GR
GS
[0.75 0 0 0.75 554.15625 348.125] CT
1 0 0 RC
N
f-1759579234
f
GR
GS
[0.75 0 0 0.75 561.51563 348.125] CT
1 0 0 RC
N
f-1759579234
f
GR
GS
[0.75 0 0 0.75 568.875 348.125] CT
1 0 0 RC
N
f-1759579234
f
GR
GS
[0.75 0 0 0.75 576.23438 348.125] CT
1 0 0 RC
N
f-1759579234
f
GR
GS
[0.75 0 0 0.75 583.59375 348.125] CT
1 0 0 RC
N
f-1759579234
f
GR
GS
[0.75 0 0 0.75 590.95313 348.125] CT
1 0 0 RC
N
f-1759579234
f
GR
GS
[0.75 0 0 0.75 598.3125 348.125] CT
1 0 0 RC
N
f-1759579234
f
GR
GS
[0.75 0 0 0.75 605.67188 348.125] CT
1 0 0 RC
N
f-1759579234
f
GR
GS
[0.75 0 0 0.75 613.03125 348.125] CT
1 0 0 RC
N
f-1759579234
f
GR
GS
[0.75 0 0 0.75 620.39063 348.125] CT
1 0 0 RC
N
f-1759579234
f
GR
GS
[0.75 0 0 0.75 627.75 348.125] CT
1 0 0 RC
N
f-1759579234
f
GR
GS
[0.75 0 0 0.75 635.10938 348.125] CT
1 0 0 RC
N
f-1759579234
f
GR
GS
[0.75 0 0 0.75 642.46875 348.125] CT
1 0 0 RC
N
f-1759579234
f
GR
GS
[0.75 0 0 0.75 649.82813 348.125] CT
1 0 0 RC
N
f-1759579234
f
GR
GS
[0.75 0 0 0.75 657.1875 348.125] CT
1 0 0 RC
N
f-1759579234
f
GR
GS
[0.75 0 0 0.75 664.54688 348.125] CT
1 0 0 RC
N
f-1759579234
f
GR
GS
[0.75 0 0 0.75 671.90625 348.125] CT
1 0 0 RC
N
f-1759579234
f
GR
GS
[0.75 0 0 0.75 679.26563 348.125] CT
1 0 0 RC
N
f-1759579234
f
GR
GS
[0.75 0 0 0.75 686.625 348.125] CT
1 0 0 RC
N
f-1759579234
f
GR
GS
[0.75 0 0 0.75 693.98438 348.125] CT
1 0 0 RC
N
f-1759579234
f
GR
GS
[0.75 0 0 0.75 701.34375 348.125] CT
1 0 0 RC
N
f-1759579234
f
GR
GS
[0.75 0 0 0.75 708.70313 348.125] CT
1 0 0 RC
N
f-1759579234
f
GR
GS
[0.75 0 0 0.75 716.0625 348.125] CT
1 0 0 RC
N
f-1759579234
f
GR
GS
[0.75 0 0 0.75 723.42188 348.125] CT
1 0 0 RC
N
f-1759579234
f
GR
GS
[0.75 0 0 0.75 730.78125 348.125] CT
1 0 0 RC
N
f-1759579234
f
GR
GS
[0.75 0 0 0.75 738.14063 348.125] CT
1 0 0 RC
N
f-1759579234
f
GR
GS
[0.75 0 0 0.75 745.5 348.125] CT
1 0 0 RC
N
f-1759579234
f
GR
GS
[0.75 0 0 0.75 752.85938 348.125] CT
1 0 0 RC
N
f-1759579234
f
GR
GS
[0.75 0 0 0.75 760.21875 348.125] CT
1 0 0 RC
N
f-1759579234
f
GR
GS
[0.75 0 0 0.75 767.57813 348.125] CT
1 0 0 RC
N
f-1759579234
f
GR
GS
[0.75 0 0 0.75 774.9375 348.125] CT
1 0 0 RC
N
f-1759579234
f
GR
GS
[0.75 0 0 0.75 782.29688 348.125] CT
1 0 0 RC
N
f-1759579234
f
GR
GS
[0.75 0 0 0.75 789.65625 348.125] CT
1 0 0 RC
N
f-1759579234
f
GR
GS
[0.75 0 0 0.75 797.01563 348.125] CT
1 0 0 RC
N
f-1759579234
f
GR
GS
[0.75 0 0 0.75 804.375 348.125] CT
1 0 0 RC
N
f-1759579234
f
GR
GS
[0.75 0 0 0.75 811.73438 348.125] CT
1 0 0 RC
N
f-1759579234
f
GR
GS
[0.75 0 0 0.75 819.09375 348.125] CT
1 0 0 RC
N
f-1759579234
f
GR
GS
[0.75 0 0 0.75 826.45313 348.125] CT
1 0 0 RC
N
f-1759579234
f
GR
GS
[0.75 0 0 0.75 833.8125 348.125] CT
1 0 0 RC
N
f-1759579234
f
GR
GS
[0.75 0 0 0.75 841.17188 348.125] CT
1 0 0 RC
N
f-1759579234
f
GR
GS
[0.75 0 0 0.75 848.53125 348.125] CT
1 0 0 RC
N
f-1759579234
f
GR
GS
[0.75 0 0 0.75 855.89063 348.125] CT
1 0 0 RC
N
f-1759579234
f
GR
GS
[0.75 0 0 0.75 863.25 348.125] CT
1 0 0 RC
N
f-1759579234
f
GR
GS
[0.75 0 0 0.75 870.60938 348.125] CT
1 0 0 RC
N
f-1759579234
f
GR
GS
[0.75 0 0 0.75 877.96875 348.125] CT
1 0 0 RC
N
f-1759579234
f
GR
GS
[0.75 0 0 0.75 885.32813 348.125] CT
1 0 0 RC
N
f-1759579234
f
GR
GS
[0.75 0 0 0.75 892.6875 348.125] CT
1 0 0 RC
N
f-1759579234
f
GR
GS
[0.75 0 0 0.75 900.04688 348.125] CT
1 0 0 RC
N
f-1759579234
f
GR
GS
[0.75 0 0 0.75 907.40625 348.125] CT
1 0 0 RC
N
f-1759579234
f
GR
GS
[0.75 0 0 0.75 914.76563 348.125] CT
1 0 0 RC
N
f-1759579234
f
GR
GS
[0.75 0 0 0.75 922.125 348.125] CT
1 0 0 RC
N
f-1759579234
f
GR
GS
[0.75 0 0 0.75 929.48438 348.125] CT
1 0 0 RC
N
f-1759579234
f
GR
GS
[0.75 0 0 0.75 936.84375 348.125] CT
1 0 0 RC
N
f-1759579234
f
GR
GS
[0.75 0 0 0.75 944.20313 348.125] CT
1 0 0 RC
N
f-1759579234
f
GR
GS
[0.75 0 0 0.75 951.5625 348.125] CT
1 0 0 RC
N
f-1759579234
f
GR
GS
[0.75 0 0 0.75 958.92188 348.125] CT
1 0 0 RC
N
f-1759579234
f
GR
GS
[0.75 0 0 0.75 966.28125 107.80427] CT
1 0 0 RC
N
f-1759579234
f
GR
GS
[0.75 0 0 0.75 973.64063 107.80427] CT
1 0 0 RC
N
f-1759579234
f
GR
GS
[0.75 0 0 0.75 981 107.80427] CT
1 0 0 RC
N
f-1759579234
f
GR
GS
[0.75 0 0 0.75 988.35938 107.80427] CT
1 0 0 RC
N
f-1759579234
f
GR
GS
[0.75 0 0 0.75 995.71875 107.80427] CT
1 0 0 RC
N
f-1759579234
f
GR
GS
[0.75 0 0 0.75 1003.07813 348.125] CT
1 0 0 RC
N
f-1759579234
f
GR
GS
[0.75 0 0 0.75 1010.4375 348.125] CT
1 0 0 RC
N
f-1759579234
f
GR
GS
[0.75 0 0 0.75 1017.79688 348.125] CT
1 0 0 RC
N
f-1759579234
f
GR
GS
[0.75 0 0 0.75 1025.15625 348.125] CT
1 0 0 RC
N
f-1759579234
f
GR
GS
[0.75 0 0 0.75 1032.51563 348.125] CT
1 0 0 RC
N
f-1759579234
f
GR
GS
[0.75 0 0 0.75 1039.875 348.125] CT
1 0 0 RC
N
f-1759579234
f
GR
GS
[0.75 0 0 0.75 0 -0.25] CT
[8 8] 0 setdash
2 LJ
2.667 LW
N
601.5 857 M
611.313 847.188 L
621.125 837.375 L
630.938 827.563 L
640.75 817.75 L
650.563 807.938 L
660.375 798.125 L
670.188 788.313 L
680 778.5 L
689.813 768.688 L
699.625 758.875 L
709.438 749.063 L
719.25 739.25 L
729.063 729.438 L
738.875 719.625 L
748.688 709.813 L
758.5 700 L
768.313 690.188 L
778.125 680.375 L
787.938 670.563 L
797.75 660.75 L
807.563 650.938 L
817.375 641.125 L
827.188 631.313 L
837 621.5 L
846.813 611.688 L
856.625 601.875 L
866.438 592.063 L
876.25 582.25 L
886.063 572.438 L
895.875 562.625 L
905.688 552.813 L
915.5 543 L
925.313 533.188 L
935.125 523.375 L
944.938 513.563 L
954.75 503.75 L
964.563 493.938 L
974.375 484.125 L
984.188 474.313 L
994 464.5 L
1003.813 454.688 L
1013.625 444.875 L
1023.438 435.063 L
1033.25 425.25 L
1043.063 415.438 L
1052.875 405.625 L
1062.688 395.813 L
1072.5 386 L
1082.313 376.188 L
1092.125 366.375 L
1101.938 356.563 L
1111.75 346.75 L
1121.563 336.938 L
1131.375 327.125 L
1141.188 317.313 L
1151 307.5 L
1160.813 297.688 L
1170.625 287.875 L
1180.438 278.063 L
1190.25 268.25 L
1200.063 258.438 L
1209.875 248.625 L
1219.688 238.813 L
1229.5 229 L
1239.313 219.188 L
1249.125 209.375 L
1258.938 199.563 L
1268.75 189.75 L
1278.563 179.937 L
1288.375 170.125 L
1298.188 160.313 L
1308 150.5 L
1317.813 140.688 L
1327.625 130.875 L
1337.438 121.063 L
1347.25 111.25 L
1357.063 101.437 L
1366.875 91.625 L
1376.688 81.812 L
1386.5 72 L
S
GR
GS
[0.75 0 0 0.75 0 -0.25] CT
[8 8] 0 setdash
2 LJ
2.667 LW
N
601.5 72 M
611.313 81.812 L
621.125 91.625 L
630.938 101.437 L
640.75 111.25 L
650.563 121.063 L
660.375 130.875 L
670.188 140.688 L
680 150.5 L
689.813 160.313 L
699.625 170.125 L
709.438 179.937 L
719.25 189.75 L
729.063 199.563 L
738.875 209.375 L
748.688 219.188 L
758.5 229 L
768.313 238.813 L
778.125 248.625 L
787.938 258.438 L
797.75 268.25 L
807.563 278.063 L
817.375 287.875 L
827.188 297.688 L
837 307.5 L
846.813 317.313 L
856.625 327.125 L
866.438 336.938 L
876.25 346.75 L
886.063 356.563 L
895.875 366.375 L
905.688 376.188 L
915.5 386 L
925.313 395.813 L
935.125 405.625 L
944.938 415.438 L
954.75 425.25 L
964.563 435.063 L
974.375 444.875 L
984.188 454.688 L
994 464.5 L
1003.813 474.313 L
1013.625 484.125 L
1023.438 493.938 L
1033.25 503.75 L
1043.063 513.563 L
1052.875 523.375 L
1062.688 533.188 L
1072.5 543 L
1082.313 552.813 L
1092.125 562.625 L
1101.938 572.438 L
1111.75 582.25 L
1121.563 592.063 L
1131.375 601.875 L
1141.188 611.688 L
1151 621.5 L
1160.813 631.313 L
1170.625 641.125 L
1180.438 650.938 L
1190.25 660.75 L
1200.063 670.563 L
1209.875 680.375 L
1219.688 690.188 L
1229.5 700 L
1239.313 709.813 L
1249.125 719.625 L
1258.938 729.438 L
1268.75 739.25 L
1278.563 749.063 L
1288.375 758.875 L
1298.188 768.688 L
1308 778.5 L
1317.813 788.313 L
1327.625 798.125 L
1337.438 807.938 L
1347.25 817.75 L
1357.063 827.563 L
1366.875 837.375 L
1376.688 847.188 L
1386.5 857 L
S
GR
%%Trailer
%%Pages: 1
%%EOF
