%!PS-Adobe-3.0 EPSF-3.0
%%Creator: (MATLAB, The Mathworks, Inc. Version 9.3.0.713579 \(R2017b\). Operating System: Mac OS X)
%%Title: (/Users/Giancarlo/Dropbox/Ginevra/Research pseudospectrum/Codes/Analyse Numerique/TP3/Fig7.eps)
%%CreationDate: 2019-10-09T12:54:49
%%Pages: (atend)
%%BoundingBox: 0 0 880 572
%%LanguageLevel: 3
%%EndComments
%%BeginProlog
%%BeginResource: procset (Apache XML Graphics Std ProcSet) 1.2 0
%%Version: 1.2 0
%%Copyright: (Copyright 2001-2003,2010 The Apache Software Foundation. License terms: http://www.apache.org/licenses/LICENSE-2.0)
/bd{bind def}bind def
/ld{load def}bd
/GR/grestore ld
/GS/gsave ld
/RM/rmoveto ld
/C/curveto ld
/t/show ld
/L/lineto ld
/ML/setmiterlimit ld
/CT/concat ld
/f/fill ld
/N/newpath ld
/S/stroke ld
/CC/setcmykcolor ld
/A/ashow ld
/cp/closepath ld
/RC/setrgbcolor ld
/LJ/setlinejoin ld
/GC/setgray ld
/LW/setlinewidth ld
/M/moveto ld
/re {4 2 roll M
1 index 0 rlineto
0 exch rlineto
neg 0 rlineto
cp } bd
/_ctm matrix def
/_tm matrix def
/BT { _ctm currentmatrix pop matrix _tm copy pop 0 0 moveto } bd
/ET { _ctm setmatrix } bd
/iTm { _ctm setmatrix _tm concat } bd
/Tm { _tm astore pop iTm 0 0 moveto } bd
/ux 0.0 def
/uy 0.0 def
/F {
  /Tp exch def
  /Tf exch def
  Tf findfont Tp scalefont setfont
  /cf Tf def  /cs Tp def
} bd
/ULS {currentpoint /uy exch def /ux exch def} bd
/ULE {
  /Tcx currentpoint pop def
  gsave
  newpath
  cf findfont cs scalefont dup
  /FontMatrix get 0 get /Ts exch def /FontInfo get dup
  /UnderlinePosition get Ts mul /To exch def
  /UnderlineThickness get Ts mul /Tt exch def
  ux uy To add moveto  Tcx uy To add lineto
  Tt setlinewidth stroke
  grestore
} bd
/OLE {
  /Tcx currentpoint pop def
  gsave
  newpath
  cf findfont cs scalefont dup
  /FontMatrix get 0 get /Ts exch def /FontInfo get dup
  /UnderlinePosition get Ts mul /To exch def
  /UnderlineThickness get Ts mul /Tt exch def
  ux uy To add cs add moveto Tcx uy To add cs add lineto
  Tt setlinewidth stroke
  grestore
} bd
/SOE {
  /Tcx currentpoint pop def
  gsave
  newpath
  cf findfont cs scalefont dup
  /FontMatrix get 0 get /Ts exch def /FontInfo get dup
  /UnderlinePosition get Ts mul /To exch def
  /UnderlineThickness get Ts mul /Tt exch def
  ux uy To add cs 10 mul 26 idiv add moveto Tcx uy To add cs 10 mul 26 idiv add lineto
  Tt setlinewidth stroke
  grestore
} bd
/QT {
/Y22 exch store
/X22 exch store
/Y21 exch store
/X21 exch store
currentpoint
/Y21 load 2 mul add 3 div exch
/X21 load 2 mul add 3 div exch
/X21 load 2 mul /X22 load add 3 div
/Y21 load 2 mul /Y22 load add 3 div
/X22 load /Y22 load curveto
} bd
/SSPD {
dup length /d exch dict def
{
/v exch def
/k exch def
currentpagedevice k known {
/cpdv currentpagedevice k get def
v cpdv ne {
/upd false def
/nullv v type /nulltype eq def
/nullcpdv cpdv type /nulltype eq def
nullv nullcpdv or
{
/upd true def
} {
/sametype v type cpdv type eq def
sametype {
v type /arraytype eq {
/vlen v length def
/cpdvlen cpdv length def
vlen cpdvlen eq {
0 1 vlen 1 sub {
/i exch def
/obj v i get def
/cpdobj cpdv i get def
obj cpdobj ne {
/upd true def
exit
} if
} for
} {
/upd true def
} ifelse
} {
v type /dicttype eq {
v {
/dv exch def
/dk exch def
/cpddv cpdv dk get def
dv cpddv ne {
/upd true def
exit
} if
} forall
} {
/upd true def
} ifelse
} ifelse
} if
} ifelse
upd true eq {
d k v put
} if
} if
} if
} forall
d length 0 gt {
d setpagedevice
} if
} bd
/RE { % /NewFontName [NewEncodingArray] /FontName RE -
  findfont dup length dict begin
  {
    1 index /FID ne
    {def} {pop pop} ifelse
  } forall
  /Encoding exch def
  /FontName 1 index def
  currentdict definefont pop
  end
} bind def
%%EndResource
%%BeginResource: procset (Apache XML Graphics EPS ProcSet) 1.0 0
%%Version: 1.0 0
%%Copyright: (Copyright 2002-2003 The Apache Software Foundation. License terms: http://www.apache.org/licenses/LICENSE-2.0)
/BeginEPSF { %def
/b4_Inc_state save def         % Save state for cleanup
/dict_count countdictstack def % Count objects on dict stack
/op_count count 1 sub def      % Count objects on operand stack
userdict begin                 % Push userdict on dict stack
/showpage { } def              % Redefine showpage, { } = null proc
0 setgray 0 setlinecap         % Prepare graphics state
1 setlinewidth 0 setlinejoin
10 setmiterlimit [ ] 0 setdash newpath
/languagelevel where           % If level not equal to 1 then
{pop languagelevel             % set strokeadjust and
1 ne                           % overprint to their defaults.
{false setstrokeadjust false setoverprint
} if
} if
} bd
/EndEPSF { %def
count op_count sub {pop} repeat            % Clean up stacks
countdictstack dict_count sub {end} repeat
b4_Inc_state restore
} bd
%%EndResource
%FOPBeginFontDict
%%IncludeResource: font Courier-Oblique
%%IncludeResource: font Courier-BoldOblique
%%IncludeResource: font Courier-Bold
%%IncludeResource: font ZapfDingbats
%%IncludeResource: font Symbol
%%IncludeResource: font Helvetica
%%IncludeResource: font Helvetica-Oblique
%%IncludeResource: font Helvetica-Bold
%%IncludeResource: font Helvetica-BoldOblique
%%IncludeResource: font Times-Roman
%%IncludeResource: font Times-Italic
%%IncludeResource: font Times-Bold
%%IncludeResource: font Times-BoldItalic
%%IncludeResource: font Courier
%FOPEndFontDict
%%BeginResource: encoding WinAnsiEncoding
/WinAnsiEncoding [
/.notdef /.notdef /.notdef /.notdef /.notdef
/.notdef /.notdef /.notdef /.notdef /.notdef
/.notdef /.notdef /.notdef /.notdef /.notdef
/.notdef /.notdef /.notdef /.notdef /.notdef
/.notdef /.notdef /.notdef /.notdef /.notdef
/.notdef /.notdef /.notdef /.notdef /.notdef
/.notdef /.notdef /space /exclam /quotedbl
/numbersign /dollar /percent /ampersand /quotesingle
/parenleft /parenright /asterisk /plus /comma
/hyphen /period /slash /zero /one
/two /three /four /five /six
/seven /eight /nine /colon /semicolon
/less /equal /greater /question /at
/A /B /C /D /E
/F /G /H /I /J
/K /L /M /N /O
/P /Q /R /S /T
/U /V /W /X /Y
/Z /bracketleft /backslash /bracketright /asciicircum
/underscore /quoteleft /a /b /c
/d /e /f /g /h
/i /j /k /l /m
/n /o /p /q /r
/s /t /u /v /w
/x /y /z /braceleft /bar
/braceright /asciitilde /bullet /Euro /bullet
/quotesinglbase /florin /quotedblbase /ellipsis /dagger
/daggerdbl /circumflex /perthousand /Scaron /guilsinglleft
/OE /bullet /Zcaron /bullet /bullet
/quoteleft /quoteright /quotedblleft /quotedblright /bullet
/endash /emdash /asciitilde /trademark /scaron
/guilsinglright /oe /bullet /zcaron /Ydieresis
/space /exclamdown /cent /sterling /currency
/yen /brokenbar /section /dieresis /copyright
/ordfeminine /guillemotleft /logicalnot /sfthyphen /registered
/macron /degree /plusminus /twosuperior /threesuperior
/acute /mu /paragraph /middot /cedilla
/onesuperior /ordmasculine /guillemotright /onequarter /onehalf
/threequarters /questiondown /Agrave /Aacute /Acircumflex
/Atilde /Adieresis /Aring /AE /Ccedilla
/Egrave /Eacute /Ecircumflex /Edieresis /Igrave
/Iacute /Icircumflex /Idieresis /Eth /Ntilde
/Ograve /Oacute /Ocircumflex /Otilde /Odieresis
/multiply /Oslash /Ugrave /Uacute /Ucircumflex
/Udieresis /Yacute /Thorn /germandbls /agrave
/aacute /acircumflex /atilde /adieresis /aring
/ae /ccedilla /egrave /eacute /ecircumflex
/edieresis /igrave /iacute /icircumflex /idieresis
/eth /ntilde /ograve /oacute /ocircumflex
/otilde /odieresis /divide /oslash /ugrave
/uacute /ucircumflex /udieresis /yacute /thorn
/ydieresis
] def
%%EndResource
%FOPBeginFontReencode
/Courier-Oblique findfont
dup length dict begin
  {1 index /FID ne {def} {pop pop} ifelse} forall
  /Encoding WinAnsiEncoding def
  currentdict
end
/Courier-Oblique exch definefont pop
/Courier-BoldOblique findfont
dup length dict begin
  {1 index /FID ne {def} {pop pop} ifelse} forall
  /Encoding WinAnsiEncoding def
  currentdict
end
/Courier-BoldOblique exch definefont pop
/Courier-Bold findfont
dup length dict begin
  {1 index /FID ne {def} {pop pop} ifelse} forall
  /Encoding WinAnsiEncoding def
  currentdict
end
/Courier-Bold exch definefont pop
/Helvetica findfont
dup length dict begin
  {1 index /FID ne {def} {pop pop} ifelse} forall
  /Encoding WinAnsiEncoding def
  currentdict
end
/Helvetica exch definefont pop
/Helvetica-Oblique findfont
dup length dict begin
  {1 index /FID ne {def} {pop pop} ifelse} forall
  /Encoding WinAnsiEncoding def
  currentdict
end
/Helvetica-Oblique exch definefont pop
/Helvetica-Bold findfont
dup length dict begin
  {1 index /FID ne {def} {pop pop} ifelse} forall
  /Encoding WinAnsiEncoding def
  currentdict
end
/Helvetica-Bold exch definefont pop
/Helvetica-BoldOblique findfont
dup length dict begin
  {1 index /FID ne {def} {pop pop} ifelse} forall
  /Encoding WinAnsiEncoding def
  currentdict
end
/Helvetica-BoldOblique exch definefont pop
/Times-Roman findfont
dup length dict begin
  {1 index /FID ne {def} {pop pop} ifelse} forall
  /Encoding WinAnsiEncoding def
  currentdict
end
/Times-Roman exch definefont pop
/Times-Italic findfont
dup length dict begin
  {1 index /FID ne {def} {pop pop} ifelse} forall
  /Encoding WinAnsiEncoding def
  currentdict
end
/Times-Italic exch definefont pop
/Times-Bold findfont
dup length dict begin
  {1 index /FID ne {def} {pop pop} ifelse} forall
  /Encoding WinAnsiEncoding def
  currentdict
end
/Times-Bold exch definefont pop
/Times-BoldItalic findfont
dup length dict begin
  {1 index /FID ne {def} {pop pop} ifelse} forall
  /Encoding WinAnsiEncoding def
  currentdict
end
/Times-BoldItalic exch definefont pop
/Courier findfont
dup length dict begin
  {1 index /FID ne {def} {pop pop} ifelse} forall
  /Encoding WinAnsiEncoding def
  currentdict
end
/Courier exch definefont pop
%FOPEndFontReencode
%%EndProlog
%%Page: 1 1
%%PageBoundingBox: 0 0 880 572
%%BeginPageSetup
[1 0 0 -1 0 572] CT
%%EndPageSetup
GS
1 GC
N
0 0 880 572 re
f
GR
GS
1 GC
N
0 0 880 572 re
f
GR
GS
1 GC
N
114.5 519.5 M
796.5 519.5 L
796.5 43 L
114.5 43 L
cp
f
GR
GS
0.149 GC
2 setlinecap
1 LJ
0.5 LW
N
114.5 519.5 M
796.5 519.5 L
S
GR
GS
0.149 GC
2 setlinecap
1 LJ
0.5 LW
N
114.5 43 M
796.5 43 L
S
GR
GS
0.149 GC
2 setlinecap
1 LJ
0.5 LW
N
162.468 519.5 M
162.468 512.68 L
S
GR
GS
0.149 GC
2 setlinecap
1 LJ
0.5 LW
N
221.359 519.5 M
221.359 512.68 L
S
GR
GS
0.149 GC
2 setlinecap
1 LJ
0.5 LW
N
280.251 519.5 M
280.251 512.68 L
S
GR
GS
0.149 GC
2 setlinecap
1 LJ
0.5 LW
N
339.142 519.5 M
339.142 512.68 L
S
GR
GS
0.149 GC
2 setlinecap
1 LJ
0.5 LW
N
398.033 519.5 M
398.033 512.68 L
S
GR
GS
0.149 GC
2 setlinecap
1 LJ
0.5 LW
N
456.925 519.5 M
456.925 512.68 L
S
GR
GS
0.149 GC
2 setlinecap
1 LJ
0.5 LW
N
515.816 519.5 M
515.816 512.68 L
S
GR
GS
0.149 GC
2 setlinecap
1 LJ
0.5 LW
N
574.708 519.5 M
574.708 512.68 L
S
GR
GS
0.149 GC
2 setlinecap
1 LJ
0.5 LW
N
633.599 519.5 M
633.599 512.68 L
S
GR
GS
0.149 GC
2 setlinecap
1 LJ
0.5 LW
N
692.49 519.5 M
692.49 512.68 L
S
GR
GS
0.149 GC
2 setlinecap
1 LJ
0.5 LW
N
751.382 519.5 M
751.382 512.68 L
S
GR
GS
0.149 GC
2 setlinecap
1 LJ
0.5 LW
N
162.468 43 M
162.468 49.82 L
S
GR
GS
0.149 GC
2 setlinecap
1 LJ
0.5 LW
N
221.359 43 M
221.359 49.82 L
S
GR
GS
0.149 GC
2 setlinecap
1 LJ
0.5 LW
N
280.251 43 M
280.251 49.82 L
S
GR
GS
0.149 GC
2 setlinecap
1 LJ
0.5 LW
N
339.142 43 M
339.142 49.82 L
S
GR
GS
0.149 GC
2 setlinecap
1 LJ
0.5 LW
N
398.033 43 M
398.033 49.82 L
S
GR
GS
0.149 GC
2 setlinecap
1 LJ
0.5 LW
N
456.925 43 M
456.925 49.82 L
S
GR
GS
0.149 GC
2 setlinecap
1 LJ
0.5 LW
N
515.816 43 M
515.816 49.82 L
S
GR
GS
0.149 GC
2 setlinecap
1 LJ
0.5 LW
N
574.708 43 M
574.708 49.82 L
S
GR
GS
0.149 GC
2 setlinecap
1 LJ
0.5 LW
N
633.599 43 M
633.599 49.82 L
S
GR
GS
0.149 GC
2 setlinecap
1 LJ
0.5 LW
N
692.49 43 M
692.49 49.82 L
S
GR
GS
0.149 GC
2 setlinecap
1 LJ
0.5 LW
N
751.382 43 M
751.382 49.82 L
S
GR
GS
[1 0 0 1 162.46797 525.5] CT
0.149 GC
/Helvetica 20 F
GS
[1 0 0 1 0 0] CT
-6 20 moveto 
1 -1 scale
(0) t 
GR
GR
GS
[1 0 0 1 221.35933 525.5] CT
0.149 GC
/Helvetica 20 F
GS
[1 0 0 1 0 0] CT
-14 20 moveto 
1 -1 scale
(0.1) t 
GR
GR
GS
[1 0 0 1 280.2507 525.5] CT
0.149 GC
/Helvetica 20 F
GS
[1 0 0 1 0 0] CT
-14 20 moveto 
1 -1 scale
(0.2) t 
GR
GR
GS
[1 0 0 1 339.14206 525.5] CT
0.149 GC
/Helvetica 20 F
GS
[1 0 0 1 0 0] CT
-14 20 moveto 
1 -1 scale
(0.3) t 
GR
GR
GS
[1 0 0 1 398.03342 525.5] CT
0.149 GC
/Helvetica 20 F
GS
[1 0 0 1 0 0] CT
-14 20 moveto 
1 -1 scale
(0.4) t 
GR
GR
GS
[1 0 0 1 456.9248 525.5] CT
0.149 GC
/Helvetica 20 F
GS
[1 0 0 1 0 0] CT
-14 20 moveto 
1 -1 scale
(0.5) t 
GR
GR
GS
[1 0 0 1 515.81616 525.5] CT
0.149 GC
/Helvetica 20 F
GS
[1 0 0 1 0 0] CT
-14 20 moveto 
1 -1 scale
(0.6) t 
GR
GR
GS
[1 0 0 1 574.70752 525.5] CT
0.149 GC
/Helvetica 20 F
GS
[1 0 0 1 0 0] CT
-14 20 moveto 
1 -1 scale
(0.7) t 
GR
GR
GS
[1 0 0 1 633.59888 525.5] CT
0.149 GC
/Helvetica 20 F
GS
[1 0 0 1 0 0] CT
-14 20 moveto 
1 -1 scale
(0.8) t 
GR
GR
GS
[1 0 0 1 692.49023 525.5] CT
0.149 GC
/Helvetica 20 F
GS
[1 0 0 1 0 0] CT
-14 20 moveto 
1 -1 scale
(0.9) t 
GR
GR
GS
[1 0 0 1 751.38159 525.5] CT
0.149 GC
/Helvetica 20 F
GS
[1 0 0 1 0 0] CT
-6 20 moveto 
1 -1 scale
(1) t 
GR
GR
GS
0.149 GC
2 setlinecap
1 LJ
0.5 LW
N
114.5 519.5 M
114.5 43 L
S
GR
GS
0.149 GC
2 setlinecap
1 LJ
0.5 LW
N
796.5 519.5 M
796.5 43 L
S
GR
GS
0.149 GC
2 setlinecap
1 LJ
0.5 LW
N
114.5 482.445 M
121.32 482.445 L
S
GR
GS
0.149 GC
2 setlinecap
1 LJ
0.5 LW
N
114.5 415.118 M
121.32 415.118 L
S
GR
GS
0.149 GC
2 setlinecap
1 LJ
0.5 LW
N
114.5 347.791 M
121.32 347.791 L
S
GR
GS
0.149 GC
2 setlinecap
1 LJ
0.5 LW
N
114.5 280.464 M
121.32 280.464 L
S
GR
GS
0.149 GC
2 setlinecap
1 LJ
0.5 LW
N
114.5 213.136 M
121.32 213.136 L
S
GR
GS
0.149 GC
2 setlinecap
1 LJ
0.5 LW
N
114.5 145.809 M
121.32 145.809 L
S
GR
GS
0.149 GC
2 setlinecap
1 LJ
0.5 LW
N
114.5 78.482 M
121.32 78.482 L
S
GR
GS
0.149 GC
2 setlinecap
1 LJ
0.5 LW
N
796.5 482.445 M
789.68 482.445 L
S
GR
GS
0.149 GC
2 setlinecap
1 LJ
0.5 LW
N
796.5 415.118 M
789.68 415.118 L
S
GR
GS
0.149 GC
2 setlinecap
1 LJ
0.5 LW
N
796.5 347.791 M
789.68 347.791 L
S
GR
GS
0.149 GC
2 setlinecap
1 LJ
0.5 LW
N
796.5 280.464 M
789.68 280.464 L
S
GR
GS
0.149 GC
2 setlinecap
1 LJ
0.5 LW
N
796.5 213.136 M
789.68 213.136 L
S
GR
GS
0.149 GC
2 setlinecap
1 LJ
0.5 LW
N
796.5 145.809 M
789.68 145.809 L
S
GR
GS
0.149 GC
2 setlinecap
1 LJ
0.5 LW
N
796.5 78.482 M
789.68 78.482 L
S
GR
GS
[1 0 0 1 108.5 482.44543] CT
0.149 GC
/Helvetica 20 F
GS
[1 0 0 1 0 0] CT
-19 7.5 moveto 
1 -1 scale
(-4) t 
GR
GR
GS
[1 0 0 1 108.5 415.11819] CT
0.149 GC
/Helvetica 20 F
GS
[1 0 0 1 0 0] CT
-36 7.5 moveto 
1 -1 scale
(-3.5) t 
GR
GR
GS
[1 0 0 1 108.5 347.79095] CT
0.149 GC
/Helvetica 20 F
GS
[1 0 0 1 0 0] CT
-19 7.5 moveto 
1 -1 scale
(-3) t 
GR
GR
GS
[1 0 0 1 108.5 280.46368] CT
0.149 GC
/Helvetica 20 F
GS
[1 0 0 1 0 0] CT
-36 7.5 moveto 
1 -1 scale
(-2.5) t 
GR
GR
GS
[1 0 0 1 108.5 213.13644] CT
0.149 GC
/Helvetica 20 F
GS
[1 0 0 1 0 0] CT
-19 7.5 moveto 
1 -1 scale
(-2) t 
GR
GR
GS
[1 0 0 1 108.5 145.8092] CT
0.149 GC
/Helvetica 20 F
GS
[1 0 0 1 0 0] CT
-36 7.5 moveto 
1 -1 scale
(-1.5) t 
GR
GR
GS
[1 0 0 1 108.5 78.48195] CT
0.149 GC
/Helvetica 20 F
GS
[1 0 0 1 0 0] CT
-19 7.5 moveto 
1 -1 scale
(-1) t 
GR
GR
GS
0 0.447 0.741 RC
1 LJ
2 LW
N
162.468 482.445 M
163.648 482.049 L
164.828 481.413 L
166.009 480.56 L
167.189 479.512 L
168.369 478.287 L
169.549 476.904 L
170.729 475.382 L
171.909 473.738 L
173.09 471.986 L
174.27 470.144 L
175.45 468.223 L
176.63 466.239 L
177.81 464.204 L
178.991 462.13 L
180.171 460.028 L
181.351 457.908 L
182.531 455.781 L
183.711 453.655 L
184.892 451.539 L
186.072 449.441 L
187.252 447.369 L
188.432 445.329 L
189.612 443.327 L
190.792 441.369 L
191.973 439.46 L
193.153 437.605 L
194.333 435.809 L
195.513 434.075 L
196.693 432.407 L
197.874 430.808 L
199.054 429.28 L
200.234 427.826 L
201.414 426.447 L
202.594 425.146 L
203.775 423.924 L
204.955 422.782 L
206.135 421.72 L
207.315 420.739 L
208.495 419.839 L
209.675 419.021 L
210.856 418.284 L
212.036 417.627 L
213.216 417.051 L
214.396 416.553 L
215.576 416.134 L
216.757 415.792 L
217.937 415.525 L
219.117 415.333 L
220.297 415.213 L
221.477 415.164 L
222.658 415.184 L
223.838 415.272 L
225.018 415.424 L
226.198 415.64 L
227.378 415.916 L
228.558 416.251 L
229.739 416.643 L
230.919 417.088 L
232.099 417.585 L
233.279 418.131 L
234.459 418.723 L
235.64 419.36 L
236.82 420.038 L
238 420.755 L
239.18 421.509 L
240.36 422.297 L
241.541 423.116 L
242.721 423.963 L
243.901 424.837 L
245.081 425.735 L
246.261 426.654 L
247.441 427.592 L
248.622 428.546 L
249.802 429.514 L
250.982 430.493 L
252.162 431.482 L
253.342 432.477 L
254.523 433.477 L
255.703 434.479 L
256.883 435.482 L
258.063 436.482 L
259.243 437.479 L
260.424 438.469 L
261.604 439.452 L
262.784 440.424 L
263.964 441.385 L
265.144 442.332 L
266.324 443.264 L
267.505 444.179 L
268.685 445.076 L
269.865 445.952 L
271.045 446.807 L
272.225 447.639 L
273.406 448.447 L
274.586 449.229 L
275.766 449.984 L
276.946 450.711 L
278.126 451.41 L
279.307 452.078 L
280.487 452.716 L
281.667 453.321 L
282.847 453.894 L
284.027 454.434 L
285.207 454.94 L
286.388 455.41 L
287.568 455.846 L
288.748 456.246 L
289.928 456.61 L
291.108 456.937 L
292.289 457.228 L
293.469 457.481 L
294.649 457.697 L
295.829 457.876 L
297.009 458.018 L
298.19 458.121 L
299.37 458.188 L
300.55 458.217 L
301.73 458.208 L
302.91 458.163 L
304.09 458.081 L
305.271 457.962 L
306.451 457.807 L
307.631 457.617 L
308.811 457.39 L
309.991 457.129 L
311.172 456.834 L
312.352 456.504 L
313.532 456.141 L
314.712 455.745 L
315.892 455.317 L
317.073 454.858 L
318.253 454.368 L
319.433 453.848 L
320.613 453.299 L
321.793 452.721 L
322.974 452.115 L
324.154 451.483 L
325.334 450.825 L
326.514 450.142 L
327.694 449.434 L
328.874 448.703 L
330.055 447.95 L
331.235 447.176 L
332.415 446.381 L
333.595 445.566 L
334.775 444.733 L
335.956 443.883 L
337.136 443.016 L
338.316 442.133 L
339.496 441.236 L
340.676 440.325 L
341.856 439.402 L
343.037 438.467 L
344.217 437.521 L
345.397 436.566 L
346.577 435.603 L
347.757 434.632 L
348.938 433.654 L
350.118 432.67 L
351.298 431.682 L
352.478 430.69 L
353.658 429.696 L
354.839 428.699 L
356.019 427.702 L
357.199 426.704 L
358.379 425.708 L
359.559 424.713 L
360.74 423.72 L
361.92 422.731 L
363.1 421.746 L
364.28 420.766 L
365.46 419.792 L
366.64 418.825 L
367.821 417.864 L
369.001 416.912 L
370.181 415.968 L
371.361 415.033 L
372.541 414.108 L
373.722 413.194 L
374.902 412.291 L
376.082 411.399 L
377.262 410.52 L
378.442 409.653 L
379.622 408.8 L
380.803 407.96 L
381.983 407.134 L
383.163 406.322 L
384.343 405.525 L
385.523 404.743 L
386.704 403.977 L
387.884 403.226 L
389.064 402.491 L
390.244 401.772 L
391.424 401.069 L
392.605 400.383 L
393.785 399.713 L
394.965 399.06 L
396.145 398.424 L
397.325 397.804 L
398.505 397.202 L
399.686 396.615 L
400.866 396.046 L
402.046 395.493 L
403.226 394.957 L
404.406 394.437 L
405.587 393.933 L
406.767 393.445 L
407.947 392.973 L
409.127 392.516 L
410.307 392.075 L
411.488 391.648 L
412.668 391.237 L
413.848 390.839 L
415.028 390.456 L
416.208 390.086 L
417.389 389.729 L
418.569 389.385 L
419.749 389.053 L
420.929 388.733 L
422.109 388.424 L
423.289 388.126 L
424.47 387.838 L
425.65 387.559 L
426.83 387.29 L
428.01 387.029 L
429.19 386.777 L
430.371 386.531 L
431.551 386.292 L
432.731 386.059 L
433.911 385.832 L
435.091 385.609 L
436.272 385.39 L
437.452 385.174 L
438.632 384.961 L
439.812 384.75 L
440.992 384.54 L
442.172 384.331 L
443.353 384.121 L
444.533 383.911 L
445.713 383.698 L
446.893 383.483 L
448.073 383.265 L
449.254 383.043 L
450.434 382.817 L
451.614 382.585 L
452.794 382.347 L
453.974 382.102 L
455.155 381.849 L
456.335 381.588 L
457.515 381.318 L
458.695 381.039 L
459.875 380.749 L
461.055 380.448 L
462.236 380.135 L
463.416 379.809 L
464.596 379.471 L
465.776 379.118 L
466.956 378.752 L
468.137 378.37 L
469.317 377.973 L
470.497 377.559 L
471.677 377.128 L
472.857 376.681 L
474.038 376.215 L
475.218 375.731 L
476.398 375.228 L
477.578 374.705 L
478.758 374.163 L
479.938 373.6 L
481.119 373.017 L
482.299 372.413 L
483.479 371.787 L
484.659 371.139 L
485.839 370.469 L
487.02 369.777 L
488.2 369.062 L
489.38 368.324 L
490.56 367.563 L
491.74 366.778 L
492.921 365.971 L
494.101 365.139 L
495.281 364.284 L
496.461 363.405 L
497.641 362.502 L
498.821 361.575 L
500.002 360.625 L
501.182 359.651 L
502.362 358.653 L
503.542 357.631 L
504.722 356.586 L
505.903 355.518 L
507.083 354.427 L
508.263 353.313 L
509.443 352.176 L
510.623 351.017 L
511.804 349.836 L
512.984 348.633 L
514.164 347.41 L
515.344 346.165 L
516.524 344.901 L
517.704 343.616 L
518.885 342.312 L
520.065 340.99 L
521.245 339.649 L
522.425 338.291 L
523.605 336.915 L
524.786 335.524 L
525.966 334.117 L
527.146 332.695 L
528.326 331.259 L
529.506 329.809 L
530.687 328.347 L
531.867 326.873 L
533.047 325.389 L
534.227 323.894 L
535.407 322.39 L
536.587 320.878 L
537.768 319.359 L
538.948 317.833 L
540.128 316.303 L
541.308 314.767 L
542.488 313.229 L
543.669 311.688 L
544.849 310.146 L
546.029 308.604 L
547.209 307.063 L
548.389 305.524 L
549.57 303.988 L
550.75 302.456 L
551.93 300.929 L
553.11 299.409 L
554.29 297.897 L
555.47 296.393 L
556.651 294.9 L
557.831 293.417 L
559.011 291.947 L
560.191 290.49 L
561.371 289.047 L
562.552 287.62 L
563.732 286.21 L
564.912 284.818 L
566.092 283.445 L
567.272 282.092 L
568.453 280.76 L
569.633 279.451 L
570.813 278.165 L
571.993 276.903 L
573.173 275.668 L
574.353 274.458 L
575.534 273.277 L
576.714 272.124 L
577.894 271 L
579.074 269.907 L
580.254 268.845 L
581.435 267.816 L
582.615 266.82 L
583.795 265.857 L
584.975 264.93 L
586.155 264.037 L
587.336 263.181 L
588.516 262.362 L
589.696 261.58 L
590.876 260.837 L
592.056 260.131 L
593.237 259.465 L
594.417 258.839 L
595.597 258.252 L
596.777 257.705 L
597.957 257.2 L
599.137 256.734 L
600.318 256.31 L
601.498 255.927 L
602.678 255.585 L
603.858 255.285 L
605.038 255.025 L
606.219 254.807 L
607.399 254.629 L
608.579 254.492 L
609.759 254.395 L
610.939 254.338 L
612.119 254.32 L
613.3 254.341 L
614.48 254.401 L
615.66 254.498 L
616.84 254.632 L
618.02 254.802 L
619.201 255.008 L
620.381 255.248 L
621.561 255.521 L
622.741 255.826 L
623.921 256.161 L
625.102 256.527 L
626.282 256.921 L
627.462 257.342 L
628.642 257.788 L
629.822 258.258 L
631.002 258.75 L
632.183 259.262 L
633.363 259.793 L
634.543 260.341 L
635.723 260.903 L
636.903 261.478 L
638.084 262.064 L
639.264 262.658 L
640.444 263.258 L
641.624 263.862 L
642.804 264.467 L
643.985 265.071 L
645.165 265.671 L
646.345 266.266 L
647.525 266.851 L
648.705 267.424 L
649.885 267.983 L
651.066 268.525 L
652.246 269.047 L
653.426 269.545 L
654.606 270.018 L
655.786 270.461 L
656.967 270.872 L
658.147 271.247 L
659.327 271.584 L
660.507 271.879 L
661.687 272.129 L
662.868 272.332 L
664.048 272.482 L
665.228 272.578 L
666.408 272.616 L
667.588 272.593 L
668.768 272.505 L
669.949 272.35 L
671.129 272.124 L
672.309 271.824 L
673.489 271.446 L
674.669 270.988 L
675.85 270.447 L
677.03 269.819 L
678.21 269.101 L
679.39 268.291 L
680.57 267.386 L
681.751 266.383 L
682.931 265.28 L
684.111 264.074 L
685.291 262.762 L
686.471 261.342 L
687.651 259.813 L
688.832 258.171 L
690.012 256.416 L
691.192 254.546 L
692.372 252.559 L
693.552 250.454 L
694.733 248.23 L
695.913 245.886 L
697.093 243.421 L
698.273 240.835 L
699.453 238.129 L
700.634 235.302 L
701.814 232.355 L
702.994 229.288 L
704.174 226.103 L
705.354 222.802 L
706.534 219.385 L
707.715 215.857 L
708.895 212.218 L
710.075 208.472 L
711.255 204.624 L
712.435 200.676 L
713.616 196.633 L
714.796 192.5 L
715.976 188.283 L
717.156 183.988 L
718.336 179.622 L
719.517 175.19 L
720.697 170.703 L
721.877 166.167 L
723.057 161.592 L
724.237 156.989 L
725.417 152.366 L
726.598 147.737 L
727.778 143.113 L
728.958 138.506 L
730.138 133.931 L
731.318 129.402 L
732.499 124.935 L
733.679 120.546 L
734.859 116.252 L
736.039 112.073 L
737.219 108.026 L
738.4 104.133 L
739.58 100.416 L
740.76 96.897 L
741.94 93.599 L
743.12 90.548 L
744.3 87.771 L
745.481 85.294 L
746.661 83.147 L
747.841 81.36 L
749.021 79.964 L
750.201 78.993 L
751.382 78.482 L
S
GR
GS
0.851 0.325 0.098 RC
1 LJ
2 LW
N
162.468 482.445 M
163.648 482.444 L
164.828 482.439 L
166.009 482.431 L
167.189 482.419 L
168.369 482.405 L
169.549 482.387 L
170.729 482.366 L
171.909 482.342 L
173.09 482.314 L
174.27 482.283 L
175.45 482.249 L
176.63 482.212 L
177.81 482.171 L
178.991 482.127 L
180.171 482.08 L
181.351 482.03 L
182.531 481.977 L
183.711 481.92 L
184.892 481.86 L
186.072 481.797 L
187.252 481.73 L
188.432 481.66 L
189.612 481.587 L
190.792 481.511 L
191.973 481.431 L
193.153 481.349 L
194.333 481.263 L
195.513 481.174 L
196.693 481.081 L
197.874 480.985 L
199.054 480.886 L
200.234 480.784 L
201.414 480.679 L
202.594 480.57 L
203.775 480.458 L
204.955 480.343 L
206.135 480.224 L
207.315 480.103 L
208.495 479.978 L
209.675 479.85 L
210.856 479.718 L
212.036 479.584 L
213.216 479.446 L
214.396 479.305 L
215.576 479.16 L
216.757 479.013 L
217.937 478.862 L
219.117 478.708 L
220.297 478.55 L
221.477 478.39 L
222.658 478.226 L
223.838 478.059 L
225.018 477.888 L
226.198 477.715 L
227.378 477.538 L
228.558 477.358 L
229.739 477.174 L
230.919 476.988 L
232.099 476.798 L
233.279 476.605 L
234.459 476.409 L
235.64 476.209 L
236.82 476.006 L
238 475.8 L
239.18 475.591 L
240.36 475.379 L
241.541 475.163 L
242.721 474.944 L
243.901 474.721 L
245.081 474.496 L
246.261 474.267 L
247.441 474.035 L
248.622 473.8 L
249.802 473.562 L
250.982 473.32 L
252.162 473.075 L
253.342 472.827 L
254.523 472.575 L
255.703 472.32 L
256.883 472.062 L
258.063 471.801 L
259.243 471.537 L
260.424 471.269 L
261.604 470.998 L
262.784 470.724 L
263.964 470.447 L
265.144 470.166 L
266.324 469.882 L
267.505 469.595 L
268.685 469.305 L
269.865 469.011 L
271.045 468.714 L
272.225 468.414 L
273.406 468.11 L
274.586 467.804 L
275.766 467.494 L
276.946 467.181 L
278.126 466.865 L
279.307 466.545 L
280.487 466.222 L
281.667 465.896 L
282.847 465.567 L
284.027 465.234 L
285.207 464.898 L
286.388 464.559 L
287.568 464.217 L
288.748 463.871 L
289.928 463.522 L
291.108 463.17 L
292.289 462.815 L
293.469 462.457 L
294.649 462.095 L
295.829 461.73 L
297.009 461.362 L
298.19 460.99 L
299.37 460.615 L
300.55 460.237 L
301.73 459.856 L
302.91 459.472 L
304.09 459.084 L
305.271 458.693 L
306.451 458.299 L
307.631 457.901 L
308.811 457.5 L
309.991 457.096 L
311.172 456.689 L
312.352 456.279 L
313.532 455.865 L
314.712 455.448 L
315.892 455.028 L
317.073 454.605 L
318.253 454.178 L
319.433 453.748 L
320.613 453.315 L
321.793 452.878 L
322.974 452.439 L
324.154 451.996 L
325.334 451.55 L
326.514 451.1 L
327.694 450.648 L
328.874 450.192 L
330.055 449.733 L
331.235 449.27 L
332.415 448.805 L
333.595 448.336 L
334.775 447.864 L
335.956 447.388 L
337.136 446.91 L
338.316 446.428 L
339.496 445.943 L
340.676 445.455 L
341.856 444.963 L
343.037 444.468 L
344.217 443.97 L
345.397 443.469 L
346.577 442.964 L
347.757 442.456 L
348.938 441.945 L
350.118 441.431 L
351.298 440.914 L
352.478 440.393 L
353.658 439.869 L
354.839 439.342 L
356.019 438.811 L
357.199 438.277 L
358.379 437.74 L
359.559 437.2 L
360.74 436.657 L
361.92 436.11 L
363.1 435.56 L
364.28 435.007 L
365.46 434.45 L
366.64 433.891 L
367.821 433.328 L
369.001 432.761 L
370.181 432.192 L
371.361 431.619 L
372.541 431.043 L
373.722 430.464 L
374.902 429.882 L
376.082 429.296 L
377.262 428.707 L
378.442 428.115 L
379.622 427.52 L
380.803 426.921 L
381.983 426.319 L
383.163 425.714 L
384.343 425.106 L
385.523 424.494 L
386.704 423.879 L
387.884 423.261 L
389.064 422.64 L
390.244 422.015 L
391.424 421.387 L
392.605 420.756 L
393.785 420.122 L
394.965 419.484 L
396.145 418.843 L
397.325 418.199 L
398.505 417.552 L
399.686 416.901 L
400.866 416.248 L
402.046 415.591 L
403.226 414.93 L
404.406 414.267 L
405.587 413.6 L
406.767 412.93 L
407.947 412.257 L
409.127 411.58 L
410.307 410.9 L
411.488 410.217 L
412.668 409.531 L
413.848 408.842 L
415.028 408.149 L
416.208 407.453 L
417.389 406.754 L
418.569 406.051 L
419.749 405.345 L
420.929 404.637 L
422.109 403.924 L
423.289 403.209 L
424.47 402.49 L
425.65 401.768 L
426.83 401.043 L
428.01 400.315 L
429.19 399.583 L
430.371 398.848 L
431.551 398.11 L
432.731 397.368 L
433.911 396.624 L
435.091 395.876 L
436.272 395.125 L
437.452 394.37 L
438.632 393.613 L
439.812 392.852 L
440.992 392.088 L
442.172 391.32 L
443.353 390.55 L
444.533 389.776 L
445.713 388.999 L
446.893 388.219 L
448.073 387.435 L
449.254 386.648 L
450.434 385.858 L
451.614 385.065 L
452.794 384.268 L
453.974 383.468 L
455.155 382.665 L
456.335 381.859 L
457.515 381.049 L
458.695 380.237 L
459.875 379.421 L
461.055 378.601 L
462.236 377.779 L
463.416 376.953 L
464.596 376.124 L
465.776 375.292 L
466.956 374.456 L
468.137 373.617 L
469.317 372.775 L
470.497 371.93 L
471.677 371.082 L
472.857 370.23 L
474.038 369.375 L
475.218 368.517 L
476.398 367.655 L
477.578 366.791 L
478.758 365.923 L
479.938 365.052 L
481.119 364.177 L
482.299 363.299 L
483.479 362.418 L
484.659 361.534 L
485.839 360.647 L
487.02 359.756 L
488.2 358.862 L
489.38 357.965 L
490.56 357.065 L
491.74 356.161 L
492.921 355.254 L
494.101 354.344 L
495.281 353.431 L
496.461 352.514 L
497.641 351.594 L
498.821 350.671 L
500.002 349.745 L
501.182 348.815 L
502.362 347.882 L
503.542 346.946 L
504.722 346.007 L
505.903 345.064 L
507.083 344.119 L
508.263 343.169 L
509.443 342.217 L
510.623 341.262 L
511.804 340.303 L
512.984 339.341 L
514.164 338.375 L
515.344 337.407 L
516.524 336.435 L
517.704 335.46 L
518.885 334.482 L
520.065 333.5 L
521.245 332.516 L
522.425 331.528 L
523.605 330.536 L
524.786 329.542 L
525.966 328.544 L
527.146 327.543 L
528.326 326.539 L
529.506 325.531 L
530.687 324.521 L
531.867 323.507 L
533.047 322.49 L
534.227 321.469 L
535.407 320.445 L
536.587 319.418 L
537.768 318.388 L
538.948 317.355 L
540.128 316.318 L
541.308 315.278 L
542.488 314.235 L
543.669 313.189 L
544.849 312.139 L
546.029 311.086 L
547.209 310.03 L
548.389 308.971 L
549.57 307.908 L
550.75 306.842 L
551.93 305.773 L
553.11 304.701 L
554.29 303.625 L
555.47 302.546 L
556.651 301.464 L
557.831 300.379 L
559.011 299.29 L
560.191 298.198 L
561.371 297.103 L
562.552 296.005 L
563.732 294.903 L
564.912 293.798 L
566.092 292.69 L
567.272 291.579 L
568.453 290.465 L
569.633 289.347 L
570.813 288.226 L
571.993 287.101 L
573.173 285.974 L
574.353 284.843 L
575.534 283.709 L
576.714 282.572 L
577.894 281.431 L
579.074 280.288 L
580.254 279.141 L
581.435 277.99 L
582.615 276.837 L
583.795 275.68 L
584.975 274.52 L
586.155 273.357 L
587.336 272.191 L
588.516 271.021 L
589.696 269.848 L
590.876 268.672 L
592.056 267.492 L
593.237 266.31 L
594.417 265.124 L
595.597 263.935 L
596.777 262.742 L
597.957 261.546 L
599.137 260.348 L
600.318 259.145 L
601.498 257.94 L
602.678 256.731 L
603.858 255.519 L
605.038 254.304 L
606.219 253.086 L
607.399 251.864 L
608.579 250.639 L
609.759 249.411 L
610.939 248.18 L
612.119 246.945 L
613.3 245.708 L
614.48 244.466 L
615.66 243.222 L
616.84 241.975 L
618.02 240.724 L
619.201 239.47 L
620.381 238.212 L
621.561 236.952 L
622.741 235.688 L
623.921 234.421 L
625.102 233.151 L
626.282 231.877 L
627.462 230.6 L
628.642 229.32 L
629.822 228.037 L
631.002 226.751 L
632.183 225.461 L
633.363 224.168 L
634.543 222.872 L
635.723 221.572 L
636.903 220.269 L
638.084 218.963 L
639.264 217.654 L
640.444 216.342 L
641.624 215.026 L
642.804 213.707 L
643.985 212.385 L
645.165 211.059 L
646.345 209.731 L
647.525 208.399 L
648.705 207.064 L
649.885 205.725 L
651.066 204.383 L
652.246 203.038 L
653.426 201.69 L
654.606 200.339 L
655.786 198.984 L
656.967 197.626 L
658.147 196.265 L
659.327 194.901 L
660.507 193.533 L
661.687 192.162 L
662.868 190.788 L
664.048 189.411 L
665.228 188.03 L
666.408 186.646 L
667.588 185.259 L
668.768 183.869 L
669.949 182.475 L
671.129 181.079 L
672.309 179.678 L
673.489 178.275 L
674.669 176.869 L
675.85 175.459 L
677.03 174.046 L
678.21 172.629 L
679.39 171.21 L
680.57 169.787 L
681.751 168.361 L
682.931 166.932 L
684.111 165.499 L
685.291 164.063 L
686.471 162.624 L
687.651 161.182 L
688.832 159.737 L
690.012 158.288 L
691.192 156.836 L
692.372 155.381 L
693.552 153.922 L
694.733 152.461 L
695.913 150.996 L
697.093 149.527 L
698.273 148.056 L
699.453 146.581 L
700.634 145.103 L
701.814 143.622 L
702.994 142.138 L
704.174 140.65 L
705.354 139.159 L
706.534 137.665 L
707.715 136.167 L
708.895 134.667 L
710.075 133.163 L
711.255 131.656 L
712.435 130.145 L
713.616 128.632 L
714.796 127.115 L
715.976 125.595 L
717.156 124.071 L
718.336 122.545 L
719.517 121.015 L
720.697 119.482 L
721.877 117.945 L
723.057 116.406 L
724.237 114.863 L
725.417 113.317 L
726.598 111.767 L
727.778 110.215 L
728.958 108.659 L
730.138 107.1 L
731.318 105.538 L
732.499 103.972 L
733.679 102.403 L
734.859 100.831 L
736.039 99.256 L
737.219 97.677 L
738.4 96.096 L
739.58 94.511 L
740.76 92.922 L
741.94 91.331 L
743.12 89.736 L
744.3 88.138 L
745.481 86.537 L
746.661 84.932 L
747.841 83.325 L
749.021 81.714 L
750.201 80.099 L
751.382 78.482 L
S
GR
GS
1 LJ
2 LW
N
133.022 489.178 M
139.566 487.682 L
146.109 486.186 L
152.653 484.69 L
159.196 483.194 L
165.74 481.697 L
172.283 480.201 L
178.827 478.705 L
185.37 477.209 L
191.914 475.713 L
S
GR
GS
1 LJ
2 LW
N
280.251 463.93 M
286.794 462.434 L
293.338 460.938 L
299.881 459.442 L
306.425 457.946 L
312.968 456.45 L
319.512 454.953 L
326.055 453.457 L
332.599 451.961 L
339.142 450.465 L
S
GR
GS
1 LJ
2 LW
N
427.479 388.187 M
434.023 386.691 L
440.566 385.195 L
447.11 383.699 L
453.653 382.203 L
460.197 380.706 L
466.74 379.21 L
473.284 377.714 L
479.827 376.218 L
486.37 374.722 L
S
GR
GS
1 LJ
2 LW
N
574.708 261.949 M
581.251 260.453 L
587.794 258.956 L
594.338 257.46 L
600.881 255.964 L
607.425 254.468 L
613.968 252.972 L
620.512 251.476 L
627.055 249.979 L
633.599 248.483 L
S
GR
GS
1 LJ
2 LW
N
721.936 85.215 M
728.479 83.719 L
735.023 82.222 L
741.566 80.726 L
748.11 79.23 L
754.653 77.734 L
761.197 76.238 L
767.74 74.742 L
774.284 73.245 L
780.827 71.749 L
S
GR
GS
[1 0 0 1 162.46797 482.44543] CT
1 0 0 RC
10.0 ML
2 LW
N
-3.536 -3.536 M
3.536 3.536 L
-3.536 3.536 M
3.536 -3.536 L
S
GR
GS
[1 0 0 1 309.69638 457.19772] CT
1 0 0 RC
10.0 ML
2 LW
N
-3.536 -3.536 M
3.536 3.536 L
-3.536 3.536 M
3.536 -3.536 L
S
GR
GS
[1 0 0 1 456.9248 381.45456] CT
1 0 0 RC
10.0 ML
2 LW
N
-3.536 -3.536 M
3.536 3.536 L
-3.536 3.536 M
3.536 -3.536 L
S
GR
GS
[1 0 0 1 604.1532 255.21597] CT
1 0 0 RC
10.0 ML
2 LW
N
-3.536 -3.536 M
3.536 3.536 L
-3.536 3.536 M
3.536 -3.536 L
S
GR
GS
[1 0 0 1 751.38159 78.48195] CT
1 0 0 RC
10.0 ML
2 LW
N
-3.536 -3.536 M
3.536 3.536 L
-3.536 3.536 M
3.536 -3.536 L
S
GR
GS
1 GC
N
267 143.5 M
267 74 L
133.5 74 L
133.5 143.5 L
cp
f
GR
GS
[1 0 0 1 170.5 86.75] CT
/Helvetica 18 F
GS
[1 0 0 1 0 0] CT
0 7 moveto 
1 -1 scale
(Hermite) t 
GR
GR
GS
0 0.447 0.741 RC
1 LJ
2 LW
N
137.5 86.75 M
167.5 86.75 L
S
GR
GS
[1 0 0 1 170.5 108.75] CT
/Helvetica 18 F
GS
[1 0 0 1 0 0] CT
0 7 moveto 
1 -1 scale
(Lagrange) t 
GR
GR
GS
0.851 0.325 0.098 RC
1 LJ
2 LW
N
137.5 108.75 M
167.5 108.75 L
S
GR
GS
[1 0 0 1 170.5 130.75] CT
/Helvetica 18 F
GS
[1 0 0 1 0 0] CT
0 7 moveto 
1 -1 scale
(Interp. data) t 
GR
GR
GS
[1 0 0 1 152.5 130.75] CT
1 0 0 RC
10.0 ML
2 LW
N
-3.536 -3.536 M
3.536 3.536 L
-3.536 3.536 M
3.536 -3.536 L
S
GR
GS
0.149 GC
10.0 ML
0.5 LW
N
133.5 143.5 M
133.5 74 L
267 74 L
267 143.5 L
cp
S
GR
%%Trailer
%%Pages: 1
%%EOF
