%!PS-Adobe-3.0 EPSF-3.0
%%Creator: (MATLAB, The Mathworks, Inc. Version 9.8.0.1359463 \(R2020a\) Update 1. Operating System: Windows 10)
%%Title: (C:/Users/Conor/Desktop/UNIGE/Research/PhD thesis/FIG_Triangles/PLOT_exampleAccuracy_example_20220510.eps)
%%CreationDate: 2022-05-10T17:38:47
%%Pages: (atend)
%%BoundingBox:     0     0  1440   722
%%LanguageLevel: 3
%%EndComments
%%BeginProlog
%%BeginResource: procset (Apache XML Graphics Std ProcSet) 1.2 0
%%Version: 1.2 0
%%Copyright: (Copyright 2001-2003,2010 The Apache Software Foundation. License terms: http://www.apache.org/licenses/LICENSE-2.0)
/bd{bind def}bind def
/ld{load def}bd
/GR/grestore ld
/GS/gsave ld
/RM/rmoveto ld
/C/curveto ld
/t/show ld
/L/lineto ld
/ML/setmiterlimit ld
/CT/concat ld
/f/fill ld
/N/newpath ld
/S/stroke ld
/CC/setcmykcolor ld
/A/ashow ld
/cp/closepath ld
/RC/setrgbcolor ld
/LJ/setlinejoin ld
/GC/setgray ld
/LW/setlinewidth ld
/M/moveto ld
/re {4 2 roll M
1 index 0 rlineto
0 exch rlineto
neg 0 rlineto
cp } bd
/_ctm matrix def
/_tm matrix def
/BT { _ctm currentmatrix pop matrix _tm copy pop 0 0 moveto } bd
/ET { _ctm setmatrix } bd
/iTm { _ctm setmatrix _tm concat } bd
/Tm { _tm astore pop iTm 0 0 moveto } bd
/ux 0.0 def
/uy 0.0 def
/F {
  /Tp exch def
  /Tf exch def
  Tf findfont Tp scalefont setfont
  /cf Tf def  /cs Tp def
} bd
/ULS {currentpoint /uy exch def /ux exch def} bd
/ULE {
  /Tcx currentpoint pop def
  gsave
  newpath
  cf findfont cs scalefont dup
  /FontMatrix get 0 get /Ts exch def /FontInfo get dup
  /UnderlinePosition get Ts mul /To exch def
  /UnderlineThickness get Ts mul /Tt exch def
  ux uy To add moveto  Tcx uy To add lineto
  Tt setlinewidth stroke
  grestore
} bd
/OLE {
  /Tcx currentpoint pop def
  gsave
  newpath
  cf findfont cs scalefont dup
  /FontMatrix get 0 get /Ts exch def /FontInfo get dup
  /UnderlinePosition get Ts mul /To exch def
  /UnderlineThickness get Ts mul /Tt exch def
  ux uy To add cs add moveto Tcx uy To add cs add lineto
  Tt setlinewidth stroke
  grestore
} bd
/SOE {
  /Tcx currentpoint pop def
  gsave
  newpath
  cf findfont cs scalefont dup
  /FontMatrix get 0 get /Ts exch def /FontInfo get dup
  /UnderlinePosition get Ts mul /To exch def
  /UnderlineThickness get Ts mul /Tt exch def
  ux uy To add cs 10 mul 26 idiv add moveto Tcx uy To add cs 10 mul 26 idiv add lineto
  Tt setlinewidth stroke
  grestore
} bd
/QT {
/Y22 exch store
/X22 exch store
/Y21 exch store
/X21 exch store
currentpoint
/Y21 load 2 mul add 3 div exch
/X21 load 2 mul add 3 div exch
/X21 load 2 mul /X22 load add 3 div
/Y21 load 2 mul /Y22 load add 3 div
/X22 load /Y22 load curveto
} bd
/SSPD {
dup length /d exch dict def
{
/v exch def
/k exch def
currentpagedevice k known {
/cpdv currentpagedevice k get def
v cpdv ne {
/upd false def
/nullv v type /nulltype eq def
/nullcpdv cpdv type /nulltype eq def
nullv nullcpdv or
{
/upd true def
} {
/sametype v type cpdv type eq def
sametype {
v type /arraytype eq {
/vlen v length def
/cpdvlen cpdv length def
vlen cpdvlen eq {
0 1 vlen 1 sub {
/i exch def
/obj v i get def
/cpdobj cpdv i get def
obj cpdobj ne {
/upd true def
exit
} if
} for
} {
/upd true def
} ifelse
} {
v type /dicttype eq {
v {
/dv exch def
/dk exch def
/cpddv cpdv dk get def
dv cpddv ne {
/upd true def
exit
} if
} forall
} {
/upd true def
} ifelse
} ifelse
} if
} ifelse
upd true eq {
d k v put
} if
} if
} if
} forall
d length 0 gt {
d setpagedevice
} if
} bd
/RE { % /NewFontName [NewEncodingArray] /FontName RE -
  findfont dup length dict begin
  {
    1 index /FID ne
    {def} {pop pop} ifelse
  } forall
  /Encoding exch def
  /FontName 1 index def
  currentdict definefont pop
  end
} bind def
%%EndResource
%%BeginResource: procset (Apache XML Graphics EPS ProcSet) 1.0 0
%%Version: 1.0 0
%%Copyright: (Copyright 2002-2003 The Apache Software Foundation. License terms: http://www.apache.org/licenses/LICENSE-2.0)
/BeginEPSF { %def
/b4_Inc_state save def         % Save state for cleanup
/dict_count countdictstack def % Count objects on dict stack
/op_count count 1 sub def      % Count objects on operand stack
userdict begin                 % Push userdict on dict stack
/showpage { } def              % Redefine showpage, { } = null proc
0 setgray 0 setlinecap         % Prepare graphics state
1 setlinewidth 0 setlinejoin
10 setmiterlimit [ ] 0 setdash newpath
/languagelevel where           % If level not equal to 1 then
{pop languagelevel             % set strokeadjust and
1 ne                           % overprint to their defaults.
{false setstrokeadjust false setoverprint
} if
} if
} bd
/EndEPSF { %def
count op_count sub {pop} repeat            % Clean up stacks
countdictstack dict_count sub {end} repeat
b4_Inc_state restore
} bd
%%EndResource
%FOPBeginFontDict
%%IncludeResource: font Courier-Oblique
%%IncludeResource: font Courier-BoldOblique
%%IncludeResource: font Courier-Bold
%%IncludeResource: font ZapfDingbats
%%IncludeResource: font Symbol
%%IncludeResource: font Helvetica
%%IncludeResource: font Helvetica-Oblique
%%IncludeResource: font Helvetica-Bold
%%IncludeResource: font Helvetica-BoldOblique
%%IncludeResource: font Times-Roman
%%IncludeResource: font Times-Italic
%%IncludeResource: font Times-Bold
%%IncludeResource: font Times-BoldItalic
%%IncludeResource: font Courier
%FOPEndFontDict
%%BeginResource: encoding WinAnsiEncoding
/WinAnsiEncoding [
/.notdef /.notdef /.notdef /.notdef /.notdef
/.notdef /.notdef /.notdef /.notdef /.notdef
/.notdef /.notdef /.notdef /.notdef /.notdef
/.notdef /.notdef /.notdef /.notdef /.notdef
/.notdef /.notdef /.notdef /.notdef /.notdef
/.notdef /.notdef /.notdef /.notdef /.notdef
/.notdef /.notdef /space /exclam /quotedbl
/numbersign /dollar /percent /ampersand /quotesingle
/parenleft /parenright /asterisk /plus /comma
/hyphen /period /slash /zero /one
/two /three /four /five /six
/seven /eight /nine /colon /semicolon
/less /equal /greater /question /at
/A /B /C /D /E
/F /G /H /I /J
/K /L /M /N /O
/P /Q /R /S /T
/U /V /W /X /Y
/Z /bracketleft /backslash /bracketright /asciicircum
/underscore /quoteleft /a /b /c
/d /e /f /g /h
/i /j /k /l /m
/n /o /p /q /r
/s /t /u /v /w
/x /y /z /braceleft /bar
/braceright /asciitilde /bullet /Euro /bullet
/quotesinglbase /florin /quotedblbase /ellipsis /dagger
/daggerdbl /circumflex /perthousand /Scaron /guilsinglleft
/OE /bullet /Zcaron /bullet /bullet
/quoteleft /quoteright /quotedblleft /quotedblright /bullet
/endash /emdash /asciitilde /trademark /scaron
/guilsinglright /oe /bullet /zcaron /Ydieresis
/space /exclamdown /cent /sterling /currency
/yen /brokenbar /section /dieresis /copyright
/ordfeminine /guillemotleft /logicalnot /sfthyphen /registered
/macron /degree /plusminus /twosuperior /threesuperior
/acute /mu /paragraph /middot /cedilla
/onesuperior /ordmasculine /guillemotright /onequarter /onehalf
/threequarters /questiondown /Agrave /Aacute /Acircumflex
/Atilde /Adieresis /Aring /AE /Ccedilla
/Egrave /Eacute /Ecircumflex /Edieresis /Igrave
/Iacute /Icircumflex /Idieresis /Eth /Ntilde
/Ograve /Oacute /Ocircumflex /Otilde /Odieresis
/multiply /Oslash /Ugrave /Uacute /Ucircumflex
/Udieresis /Yacute /Thorn /germandbls /agrave
/aacute /acircumflex /atilde /adieresis /aring
/ae /ccedilla /egrave /eacute /ecircumflex
/edieresis /igrave /iacute /icircumflex /idieresis
/eth /ntilde /ograve /oacute /ocircumflex
/otilde /odieresis /divide /oslash /ugrave
/uacute /ucircumflex /udieresis /yacute /thorn
/ydieresis
] def
%%EndResource
%FOPBeginFontReencode
/Courier-Oblique findfont
dup length dict begin
  {1 index /FID ne {def} {pop pop} ifelse} forall
  /Encoding WinAnsiEncoding def
  currentdict
end
/Courier-Oblique exch definefont pop
/Courier-BoldOblique findfont
dup length dict begin
  {1 index /FID ne {def} {pop pop} ifelse} forall
  /Encoding WinAnsiEncoding def
  currentdict
end
/Courier-BoldOblique exch definefont pop
/Courier-Bold findfont
dup length dict begin
  {1 index /FID ne {def} {pop pop} ifelse} forall
  /Encoding WinAnsiEncoding def
  currentdict
end
/Courier-Bold exch definefont pop
/Helvetica findfont
dup length dict begin
  {1 index /FID ne {def} {pop pop} ifelse} forall
  /Encoding WinAnsiEncoding def
  currentdict
end
/Helvetica exch definefont pop
/Helvetica-Oblique findfont
dup length dict begin
  {1 index /FID ne {def} {pop pop} ifelse} forall
  /Encoding WinAnsiEncoding def
  currentdict
end
/Helvetica-Oblique exch definefont pop
/Helvetica-Bold findfont
dup length dict begin
  {1 index /FID ne {def} {pop pop} ifelse} forall
  /Encoding WinAnsiEncoding def
  currentdict
end
/Helvetica-Bold exch definefont pop
/Helvetica-BoldOblique findfont
dup length dict begin
  {1 index /FID ne {def} {pop pop} ifelse} forall
  /Encoding WinAnsiEncoding def
  currentdict
end
/Helvetica-BoldOblique exch definefont pop
/Times-Roman findfont
dup length dict begin
  {1 index /FID ne {def} {pop pop} ifelse} forall
  /Encoding WinAnsiEncoding def
  currentdict
end
/Times-Roman exch definefont pop
/Times-Italic findfont
dup length dict begin
  {1 index /FID ne {def} {pop pop} ifelse} forall
  /Encoding WinAnsiEncoding def
  currentdict
end
/Times-Italic exch definefont pop
/Times-Bold findfont
dup length dict begin
  {1 index /FID ne {def} {pop pop} ifelse} forall
  /Encoding WinAnsiEncoding def
  currentdict
end
/Times-Bold exch definefont pop
/Times-BoldItalic findfont
dup length dict begin
  {1 index /FID ne {def} {pop pop} ifelse} forall
  /Encoding WinAnsiEncoding def
  currentdict
end
/Times-BoldItalic exch definefont pop
/Courier findfont
dup length dict begin
  {1 index /FID ne {def} {pop pop} ifelse} forall
  /Encoding WinAnsiEncoding def
  currentdict
end
/Courier exch definefont pop
%FOPEndFontReencode
%%EndProlog
%%Page: 1 1
%%PageBoundingBox: 0 0 1440 722
%%BeginPageSetup
[1 0 0 -1 0 722] CT
%%EndPageSetup
GS
[0.75 0 0 0.75 0 -0.25] CT
1 GC
N
0 0 1920 963 re
f
GR
GS
[0.75 0 0 0.75 0 -0.25] CT
1 GC
N
0 0 1920 963 re
f
GR
GS
[0.75 0 0 0.75 0 -0.25] CT
1 GC
N
250 856.589 M
892 856.589 L
892 72.411 L
250 72.411 L
cp
f
GR
GS
[0.75 0 0 0.75 0 -0.25] CT
0.149 GC
2 setlinecap
1 LJ
0.667 LW
N
250 856.589 M
892 856.589 L
S
GR
GS
[0.75 0 0 0.75 0 -0.25] CT
0.149 GC
2 setlinecap
1 LJ
0.667 LW
N
264.675 856.589 M
264.675 848.748 L
S
GR
GS
[0.75 0 0 0.75 0 -0.25] CT
0.149 GC
2 setlinecap
1 LJ
0.667 LW
N
354.293 856.589 M
354.293 848.748 L
S
GR
GS
[0.75 0 0 0.75 0 -0.25] CT
0.149 GC
2 setlinecap
1 LJ
0.667 LW
N
443.911 856.589 M
443.911 848.748 L
S
GR
GS
[0.75 0 0 0.75 0 -0.25] CT
0.149 GC
2 setlinecap
1 LJ
0.667 LW
N
533.529 856.589 M
533.529 848.748 L
S
GR
GS
[0.75 0 0 0.75 0 -0.25] CT
0.149 GC
2 setlinecap
1 LJ
0.667 LW
N
623.147 856.589 M
623.147 848.748 L
S
GR
GS
[0.75 0 0 0.75 0 -0.25] CT
0.149 GC
2 setlinecap
1 LJ
0.667 LW
N
712.764 856.589 M
712.764 848.748 L
S
GR
GS
[0.75 0 0 0.75 0 -0.25] CT
0.149 GC
2 setlinecap
1 LJ
0.667 LW
N
802.382 856.589 M
802.382 848.748 L
S
GR
GS
[0.75 0 0 0.75 0 -0.25] CT
0.149 GC
2 setlinecap
1 LJ
0.667 LW
N
892 856.589 M
892 848.748 L
S
GR
GS
[0.75 0 0 0.75 198.50649 646.19205] CT
0.149 GC
/Helvetica 13.333 F
GS
[1 0 0 1 0 0] CT
-11.5 14 moveto 
1 -1 scale
(-0.4) t 
GR
GR
GS
[0.75 0 0 0.75 265.71986 646.19205] CT
0.149 GC
/Helvetica 13.333 F
GS
[1 0 0 1 0 0] CT
-11.5 14 moveto 
1 -1 scale
(-0.2) t 
GR
GR
GS
[0.75 0 0 0.75 332.93321 646.19205] CT
0.149 GC
/Helvetica 13.333 F
GS
[1 0 0 1 0 0] CT
-4 14 moveto 
1 -1 scale
(0) t 
GR
GR
GS
[0.75 0 0 0.75 400.14656 646.19205] CT
0.149 GC
/Helvetica 13.333 F
GS
[1 0 0 1 0 0] CT
-9.5 14 moveto 
1 -1 scale
(0.2) t 
GR
GR
GS
[0.75 0 0 0.75 467.35991 646.19205] CT
0.149 GC
/Helvetica 13.333 F
GS
[1 0 0 1 0 0] CT
-9.5 14 moveto 
1 -1 scale
(0.4) t 
GR
GR
GS
[0.75 0 0 0.75 534.5733 646.19205] CT
0.149 GC
/Helvetica 13.333 F
GS
[1 0 0 1 0 0] CT
-9.5 14 moveto 
1 -1 scale
(0.6) t 
GR
GR
GS
[0.75 0 0 0.75 601.78665 646.19205] CT
0.149 GC
/Helvetica 13.333 F
GS
[1 0 0 1 0 0] CT
-9.5 14 moveto 
1 -1 scale
(0.8) t 
GR
GR
GS
[0.75 0 0 0.75 669 646.19205] CT
0.149 GC
/Helvetica 13.333 F
GS
[1 0 0 1 0 0] CT
-4 14 moveto 
1 -1 scale
(1) t 
GR
GR
GS
[0.75 0 0 0.75 0 -0.25] CT
0.149 GC
2 setlinecap
1 LJ
0.667 LW
N
250 856.589 M
250 72.411 L
S
GR
GS
[0.75 0 0 0.75 0 -0.25] CT
0.149 GC
2 setlinecap
1 LJ
0.667 LW
N
250 815.125 M
257.842 815.125 L
S
GR
GS
[0.75 0 0 0.75 0 -0.25] CT
0.149 GC
2 setlinecap
1 LJ
0.667 LW
N
250 725.507 M
257.842 725.507 L
S
GR
GS
[0.75 0 0 0.75 0 -0.25] CT
0.149 GC
2 setlinecap
1 LJ
0.667 LW
N
250 635.889 M
257.842 635.889 L
S
GR
GS
[0.75 0 0 0.75 0 -0.25] CT
0.149 GC
2 setlinecap
1 LJ
0.667 LW
N
250 546.271 M
257.842 546.271 L
S
GR
GS
[0.75 0 0 0.75 0 -0.25] CT
0.149 GC
2 setlinecap
1 LJ
0.667 LW
N
250 456.653 M
257.842 456.653 L
S
GR
GS
[0.75 0 0 0.75 0 -0.25] CT
0.149 GC
2 setlinecap
1 LJ
0.667 LW
N
250 367.036 M
257.842 367.036 L
S
GR
GS
[0.75 0 0 0.75 0 -0.25] CT
0.149 GC
2 setlinecap
1 LJ
0.667 LW
N
250 277.418 M
257.842 277.418 L
S
GR
GS
[0.75 0 0 0.75 0 -0.25] CT
0.149 GC
2 setlinecap
1 LJ
0.667 LW
N
250 187.8 M
257.842 187.8 L
S
GR
GS
[0.75 0 0 0.75 0 -0.25] CT
0.149 GC
2 setlinecap
1 LJ
0.667 LW
N
250 98.182 M
257.842 98.182 L
S
GR
GS
[0.75 0 0 0.75 183.49999 611.09352] CT
0.149 GC
/Helvetica 13.333 F
GS
[1 0 0 1 0 0] CT
-23 5.5 moveto 
1 -1 scale
(-0.6) t 
GR
GR
GS
[0.75 0 0 0.75 183.49999 543.88013] CT
0.149 GC
/Helvetica 13.333 F
GS
[1 0 0 1 0 0] CT
-23 5.5 moveto 
1 -1 scale
(-0.4) t 
GR
GR
GS
[0.75 0 0 0.75 183.49999 476.66678] CT
0.149 GC
/Helvetica 13.333 F
GS
[1 0 0 1 0 0] CT
-23 5.5 moveto 
1 -1 scale
(-0.2) t 
GR
GR
GS
[0.75 0 0 0.75 183.49999 409.45343] CT
0.149 GC
/Helvetica 13.333 F
GS
[1 0 0 1 0 0] CT
-8 5.5 moveto 
1 -1 scale
(0) t 
GR
GR
GS
[0.75 0 0 0.75 183.49999 342.24008] CT
0.149 GC
/Helvetica 13.333 F
GS
[1 0 0 1 0 0] CT
-19 5.5 moveto 
1 -1 scale
(0.2) t 
GR
GR
GS
[0.75 0 0 0.75 183.49999 275.02671] CT
0.149 GC
/Helvetica 13.333 F
GS
[1 0 0 1 0 0] CT
-19 5.5 moveto 
1 -1 scale
(0.4) t 
GR
GR
GS
[0.75 0 0 0.75 183.49999 207.81334] CT
0.149 GC
/Helvetica 13.333 F
GS
[1 0 0 1 0 0] CT
-19 5.5 moveto 
1 -1 scale
(0.6) t 
GR
GR
GS
[0.75 0 0 0.75 183.49999 140.6] CT
0.149 GC
/Helvetica 13.333 F
GS
[1 0 0 1 0 0] CT
-19 5.5 moveto 
1 -1 scale
(0.8) t 
GR
GR
GS
[0.75 0 0 0.75 183.49999 73.38664] CT
0.149 GC
/Helvetica 13.333 F
GS
[1 0 0 1 0 0] CT
-8 5.5 moveto 
1 -1 scale
(1) t 
GR
GR
GS
[0.75 0 0 0.75 0 -0.25] CT
1 0 0 RC
1 LJ
0.667 LW
N
443.911 546.271 M
892 546.271 L
S
GR
GS
[0.75 0 0 0.75 0 -0.25] CT
1 0 0 RC
1 LJ
0.667 LW
N
892 546.271 M
668.767 158.684 L
S
GR
GS
[0.75 0 0 0.75 0 -0.25] CT
1 0 0 RC
1 LJ
0.667 LW
N
668.767 158.684 M
443.911 546.271 L
S
GR
GS
[0.75 0 0 0.75 0 -0.25] CT
0 0 1 RC
1 LJ
0.667 LW
N
638.056 434.452 M
250 434.046 L
S
GR
GS
[0.75 0 0 0.75 0 -0.25] CT
0 0 1 RC
1 LJ
0.667 LW
N
250 434.046 M
443.677 770.316 L
S
GR
GS
[0.75 0 0 0.75 0 -0.25] CT
0 0 1 RC
1 LJ
0.667 LW
N
443.677 770.316 M
638.056 434.452 L
S
GR
GS
[0.75 0 0 0.75 0 -0.25] CT
1 0 1 RC
N
443.911 546.271 M
573.341 546.271 L
638.056 434.452 L
508.861 434.317 L
cp
f
GR
GS
[0.75 0 0 0.75 0 -0.25] CT
2 setlinecap
10.0 ML
0.667 LW
N
443.911 546.271 M
573.341 546.271 L
638.056 434.452 L
508.861 434.317 L
443.911 546.271 L
S
GR
GS
[0.75 0 0 0.75 0 -0.25] CT
1 LJ
0.667 LW
N
533.529 546.271 M
533.524 545.323 L
533.509 544.375 L
533.484 543.428 L
533.449 542.481 L
533.403 541.534 L
533.348 540.587 L
533.283 539.642 L
533.208 538.697 L
533.123 537.753 L
533.028 536.809 L
532.923 535.867 L
532.808 534.926 L
532.683 533.987 L
532.548 533.048 L
532.403 532.112 L
532.248 531.176 L
532.084 530.243 L
531.909 529.311 L
531.725 528.381 L
531.531 527.453 L
531.327 526.527 L
531.113 525.604 L
530.89 524.683 L
530.656 523.764 L
530.413 522.848 L
530.161 521.934 L
529.899 521.023 L
529.627 520.115 L
529.345 519.21 L
529.054 518.307 L
528.754 517.408 L
528.444 516.513 L
528.124 515.62 L
527.795 514.731 L
527.457 513.846 L
527.109 512.964 L
526.752 512.086 L
526.386 511.211 L
526.011 510.341 L
525.626 509.474 L
525.232 508.612 L
524.829 507.754 L
524.417 506.9 L
523.996 506.051 L
523.566 505.206 L
523.128 504.366 L
522.68 503.53 L
522.223 502.699 L
521.758 501.873 L
521.284 501.052 L
520.802 500.237 L
520.31 499.426 L
519.811 498.62 L
519.302 497.82 L
518.786 497.025 L
518.26 496.236 L
517.727 495.453 L
517.185 494.675 L
516.635 493.902 L
516.078 493.136 L
515.511 492.376 L
514.937 491.621 L
514.355 490.873 L
513.765 490.131 L
513.168 489.395 L
512.562 488.666 L
511.949 487.943 L
511.328 487.227 L
510.7 486.517 L
510.064 485.814 L
509.421 485.117 L
508.77 484.428 L
508.113 483.745 L
507.448 483.07 L
506.776 482.401 L
506.096 481.74 L
505.41 481.086 L
504.717 480.439 L
504.018 479.799 L
503.311 479.167 L
502.598 478.543 L
501.878 477.926 L
501.152 477.316 L
500.42 476.715 L
499.681 476.121 L
498.936 475.535 L
498.184 474.957 L
497.427 474.387 L
496.664 473.825 L
495.894 473.271 L
495.119 472.725 L
494.339 472.187 L
493.552 471.658 L
492.76 471.137 L
491.963 470.625 L
491.16 470.121 L
490.352 469.625 L
489.538 469.138 L
488.72 468.66 L
S
GR
GS
[0.75 0 0 0.75 358.5 383.75] CT
N
5.438 0.297 M
4.156 0.297 3.156 -0.305 QT
2.156 -0.906 1.617 -1.938 QT
1.078 -2.969 1.078 -4.266 QT
1.078 -6.109 2.102 -7.898 QT
3.125 -9.688 4.82 -10.813 QT
6.516 -11.938 8.375 -11.938 QT
9.75 -11.938 10.789 -11.219 QT
11.828 -10.5 12.367 -9.305 QT
12.906 -8.109 12.906 -6.75 QT
12.938 -4.938 L
13.859 -6.219 14.5 -7.602 QT
15.141 -8.984 15.484 -10.453 QT
15.531 -10.609 15.688 -10.609 QT
16 -10.609 L
16.25 -10.609 16.25 -10.359 QT
16.25 -10.344 16.234 -10.281 QT
15.906 -9.047 15.438 -7.906 QT
14.969 -6.766 14.328 -5.695 QT
13.688 -4.625 12.938 -3.75 QT
12.938 -0.406 13.719 -0.406 QT
14.219 -0.406 14.539 -0.703 QT
14.859 -1 15.102 -1.438 QT
15.344 -1.875 15.406 -1.891 QT
15.734 -1.891 L
15.953 -1.891 15.953 -1.625 QT
15.953 -0.953 15.18 -0.328 QT
14.406 0.297 13.656 0.297 QT
12.688 0.297 12.039 -0.336 QT
11.391 -0.969 11.156 -1.984 QT
9.891 -0.891 8.414 -0.297 QT
6.938 0.297 5.438 0.297 QT
cp
5.484 -0.406 M
8.375 -0.406 11.016 -2.781 QT
11.016 -2.938 10.984 -3.172 QT
10.953 -3.406 10.953 -3.422 QT
10.953 -6.344 L
10.953 -11.234 8.313 -11.234 QT
6.734 -11.234 5.547 -9.883 QT
4.359 -8.531 3.766 -6.648 QT
3.172 -4.766 3.172 -3.219 QT
3.172 -2.047 3.766 -1.227 QT
4.359 -0.406 5.484 -0.406 QT
cp
f
GR
GS
[0.75 0 0 0.75 0 -0.25] CT
1 0 0 RC
1 LJ
0.667 LW
N
443.911 546.271 M
892 546.271 L
S
GR
GS
[0.75 0 0 0.75 0 -0.25] CT
1 0 0 RC
1 LJ
0.667 LW
N
892 546.271 M
668.767 158.684 L
S
GR
GS
[0.75 0 0 0.75 0 -0.25] CT
1 0 0 RC
1 LJ
0.667 LW
N
668.767 158.684 M
443.911 546.271 L
S
GR
GS
[0.75 0 0 0.75 0 -0.25] CT
0 0 1 RC
1 LJ
0.667 LW
N
638.056 434.452 M
250 434.046 L
S
GR
GS
[0.75 0 0 0.75 0 -0.25] CT
0 0 1 RC
1 LJ
0.667 LW
N
250 434.046 M
443.677 770.316 L
S
GR
GS
[0.75 0 0 0.75 0 -0.25] CT
0 0 1 RC
1 LJ
0.667 LW
N
443.677 770.316 M
638.056 434.452 L
S
GR
GS
[0.75 0 0 0.75 0 -0.25] CT
1 0 1 RC
N
/f740057233{443.911 546.271 M
573.341 546.271 L
638.056 434.452 L
508.861 434.317 L
cp}def
f740057233
f
GR
GS
[0.75 0 0 0.75 0 -0.25] CT
2 setlinecap
10.0 ML
0.667 LW
N
443.911 546.271 M
573.341 546.271 L
638.056 434.452 L
508.861 434.317 L
443.911 546.271 L
S
GR
GS
[0.75 0 0 0.75 0 -0.25] CT
1 LJ
0.667 LW
N
533.529 546.271 M
533.524 545.323 L
533.509 544.375 L
533.484 543.428 L
533.449 542.481 L
533.403 541.534 L
533.348 540.587 L
533.283 539.642 L
533.208 538.697 L
533.123 537.753 L
533.028 536.809 L
532.923 535.867 L
532.808 534.926 L
532.683 533.987 L
532.548 533.048 L
532.403 532.112 L
532.248 531.176 L
532.084 530.243 L
531.909 529.311 L
531.725 528.381 L
531.531 527.453 L
531.327 526.527 L
531.113 525.604 L
530.89 524.683 L
530.656 523.764 L
530.413 522.848 L
530.161 521.934 L
529.899 521.023 L
529.627 520.115 L
529.345 519.21 L
529.054 518.307 L
528.754 517.408 L
528.444 516.513 L
528.124 515.62 L
527.795 514.731 L
527.457 513.846 L
527.109 512.964 L
526.752 512.086 L
526.386 511.211 L
526.011 510.341 L
525.626 509.474 L
525.232 508.612 L
524.829 507.754 L
524.417 506.9 L
523.996 506.051 L
523.566 505.206 L
523.128 504.366 L
522.68 503.53 L
522.223 502.699 L
521.758 501.873 L
521.284 501.052 L
520.802 500.237 L
520.31 499.426 L
519.811 498.62 L
519.302 497.82 L
518.786 497.025 L
518.26 496.236 L
517.727 495.453 L
517.185 494.675 L
516.635 493.902 L
516.078 493.136 L
515.511 492.376 L
514.937 491.621 L
514.355 490.873 L
513.765 490.131 L
513.168 489.395 L
512.562 488.666 L
511.949 487.943 L
511.328 487.227 L
510.7 486.517 L
510.064 485.814 L
509.421 485.117 L
508.77 484.428 L
508.113 483.745 L
507.448 483.07 L
506.776 482.401 L
506.096 481.74 L
505.41 481.086 L
504.717 480.439 L
504.018 479.799 L
503.311 479.167 L
502.598 478.543 L
501.878 477.926 L
501.152 477.316 L
500.42 476.715 L
499.681 476.121 L
498.936 475.535 L
498.184 474.957 L
497.427 474.387 L
496.664 473.825 L
495.894 473.271 L
495.119 472.725 L
494.339 472.187 L
493.552 471.658 L
492.76 471.137 L
491.963 470.625 L
491.16 470.121 L
490.352 469.625 L
489.538 469.138 L
488.72 468.66 L
S
GR
GS
[0.75 0 0 0.75 358.5 383.75] CT
N
/f-684232328{5.438 0.297 M
4.156 0.297 3.156 -0.305 QT
2.156 -0.906 1.617 -1.938 QT
1.078 -2.969 1.078 -4.266 QT
1.078 -6.109 2.102 -7.898 QT
3.125 -9.688 4.82 -10.813 QT
6.516 -11.938 8.375 -11.938 QT
9.75 -11.938 10.789 -11.219 QT
11.828 -10.5 12.367 -9.305 QT
12.906 -8.109 12.906 -6.75 QT
12.938 -4.938 L
13.859 -6.219 14.5 -7.602 QT
15.141 -8.984 15.484 -10.453 QT
15.531 -10.609 15.688 -10.609 QT
16 -10.609 L
16.25 -10.609 16.25 -10.359 QT
16.25 -10.344 16.234 -10.281 QT
15.906 -9.047 15.438 -7.906 QT
14.969 -6.766 14.328 -5.695 QT
13.688 -4.625 12.938 -3.75 QT
12.938 -0.406 13.719 -0.406 QT
14.219 -0.406 14.539 -0.703 QT
14.859 -1 15.102 -1.438 QT
15.344 -1.875 15.406 -1.891 QT
15.734 -1.891 L
15.953 -1.891 15.953 -1.625 QT
15.953 -0.953 15.18 -0.328 QT
14.406 0.297 13.656 0.297 QT
12.688 0.297 12.039 -0.336 QT
11.391 -0.969 11.156 -1.984 QT
9.891 -0.891 8.414 -0.297 QT
6.938 0.297 5.438 0.297 QT
cp
5.484 -0.406 M
8.375 -0.406 11.016 -2.781 QT
11.016 -2.938 10.984 -3.172 QT
10.953 -3.406 10.953 -3.422 QT
10.953 -6.344 L
10.953 -11.234 8.313 -11.234 QT
6.734 -11.234 5.547 -9.883 QT
4.359 -8.531 3.766 -6.648 QT
3.172 -4.766 3.172 -3.219 QT
3.172 -2.047 3.766 -1.227 QT
4.359 -0.406 5.484 -0.406 QT
cp}def
f-684232328
f
GR
GS
[0.75 0 0 0.75 0 -0.25] CT
1 GC
N
/f932226316{1095.164 857 M
1737.836 857 L
1737.836 72 L
1095.164 72 L
cp}def
f932226316
f
GR
GS
[0.75 0 0 0.75 0 -0.25] CT
0.149 GC
2 setlinecap
1 LJ
0.667 LW
N
1095.164 857 M
1737.836 857 L
S
GR
GS
[0.75 0 0 0.75 0 -0.25] CT
0.149 GC
2 setlinecap
1 LJ
0.667 LW
N
1138.009 857 M
1138.009 849.15 L
S
GR
GS
[0.75 0 0 0.75 0 -0.25] CT
0.149 GC
2 setlinecap
1 LJ
0.667 LW
N
1223.698 857 M
1223.698 849.15 L
S
GR
GS
[0.75 0 0 0.75 0 -0.25] CT
0.149 GC
2 setlinecap
1 LJ
0.667 LW
N
1309.388 857 M
1309.388 849.15 L
S
GR
GS
[0.75 0 0 0.75 0 -0.25] CT
0.149 GC
2 setlinecap
1 LJ
0.667 LW
N
1395.078 857 M
1395.078 849.15 L
S
GR
GS
[0.75 0 0 0.75 0 -0.25] CT
0.149 GC
2 setlinecap
1 LJ
0.667 LW
N
1480.767 857 M
1480.767 849.15 L
S
GR
GS
[0.75 0 0 0.75 0 -0.25] CT
0.149 GC
2 setlinecap
1 LJ
0.667 LW
N
1566.457 857 M
1566.457 849.15 L
S
GR
GS
[0.75 0 0 0.75 0 -0.25] CT
0.149 GC
2 setlinecap
1 LJ
0.667 LW
N
1652.146 857 M
1652.146 849.15 L
S
GR
GS
[0.75 0 0 0.75 0 -0.25] CT
0.149 GC
2 setlinecap
1 LJ
0.667 LW
N
1737.836 857 M
1737.836 849.15 L
S
GR
GS
[0.75 0 0 0.75 853.5065 646.49998] CT
0.149 GC
/Helvetica 13.333 F
GS
[1 0 0 1 0 0] CT
-11.5 14 moveto 
1 -1 scale
(-0.4) t 
GR
GR
GS
[0.75 0 0 0.75 917.77368 646.49998] CT
0.149 GC
/Helvetica 13.333 F
GS
[1 0 0 1 0 0] CT
-11.5 14 moveto 
1 -1 scale
(-0.2) t 
GR
GR
GS
[0.75 0 0 0.75 982.04095 646.49998] CT
0.149 GC
/Helvetica 13.333 F
GS
[1 0 0 1 0 0] CT
-4 14 moveto 
1 -1 scale
(0) t 
GR
GR
GS
[0.75 0 0 0.75 1046.30814 646.49998] CT
0.149 GC
/Helvetica 13.333 F
GS
[1 0 0 1 0 0] CT
-9.5 14 moveto 
1 -1 scale
(0.2) t 
GR
GR
GS
[0.75 0 0 0.75 1110.57541 646.49998] CT
0.149 GC
/Helvetica 13.333 F
GS
[1 0 0 1 0 0] CT
-9.5 14 moveto 
1 -1 scale
(0.4) t 
GR
GR
GS
[0.75 0 0 0.75 1174.84268 646.49998] CT
0.149 GC
/Helvetica 13.333 F
GS
[1 0 0 1 0 0] CT
-9.5 14 moveto 
1 -1 scale
(0.6) t 
GR
GR
GS
[0.75 0 0 0.75 1239.10986 646.49998] CT
0.149 GC
/Helvetica 13.333 F
GS
[1 0 0 1 0 0] CT
-9.5 14 moveto 
1 -1 scale
(0.8) t 
GR
GR
GS
[0.75 0 0 0.75 1303.37714 646.49998] CT
0.149 GC
/Helvetica 13.333 F
GS
[1 0 0 1 0 0] CT
-4 14 moveto 
1 -1 scale
(1) t 
GR
GR
GS
[0.75 0 0 0.75 0 -0.25] CT
0.149 GC
2 setlinecap
1 LJ
0.667 LW
N
1095.164 857 M
1095.164 72 L
S
GR
GS
[0.75 0 0 0.75 0 -0.25] CT
0.149 GC
2 setlinecap
1 LJ
0.667 LW
N
1095.164 814.415 M
1103.014 814.415 L
S
GR
GS
[0.75 0 0 0.75 0 -0.25] CT
0.149 GC
2 setlinecap
1 LJ
0.667 LW
N
1095.164 728.725 M
1103.014 728.725 L
S
GR
GS
[0.75 0 0 0.75 0 -0.25] CT
0.149 GC
2 setlinecap
1 LJ
0.667 LW
N
1095.164 643.035 M
1103.014 643.035 L
S
GR
GS
[0.75 0 0 0.75 0 -0.25] CT
0.149 GC
2 setlinecap
1 LJ
0.667 LW
N
1095.164 557.346 M
1103.014 557.346 L
S
GR
GS
[0.75 0 0 0.75 0 -0.25] CT
0.149 GC
2 setlinecap
1 LJ
0.667 LW
N
1095.164 471.656 M
1103.014 471.656 L
S
GR
GS
[0.75 0 0 0.75 0 -0.25] CT
0.149 GC
2 setlinecap
1 LJ
0.667 LW
N
1095.164 385.966 M
1103.014 385.966 L
S
GR
GS
[0.75 0 0 0.75 0 -0.25] CT
0.149 GC
2 setlinecap
1 LJ
0.667 LW
N
1095.164 300.277 M
1103.014 300.277 L
S
GR
GS
[0.75 0 0 0.75 0 -0.25] CT
0.149 GC
2 setlinecap
1 LJ
0.667 LW
N
1095.164 214.587 M
1103.014 214.587 L
S
GR
GS
[0.75 0 0 0.75 0 -0.25] CT
0.149 GC
2 setlinecap
1 LJ
0.667 LW
N
1095.164 128.897 M
1103.014 128.897 L
S
GR
GS
[0.75 0 0 0.75 817.37283 610.561] CT
0.149 GC
/Helvetica 13.333 F
GS
[1 0 0 1 0 0] CT
-23 5.5 moveto 
1 -1 scale
(-0.6) t 
GR
GR
GS
[0.75 0 0 0.75 817.37283 546.29378] CT
0.149 GC
/Helvetica 13.333 F
GS
[1 0 0 1 0 0] CT
-23 5.5 moveto 
1 -1 scale
(-0.4) t 
GR
GR
GS
[0.75 0 0 0.75 817.37283 482.02655] CT
0.149 GC
/Helvetica 13.333 F
GS
[1 0 0 1 0 0] CT
-23 5.5 moveto 
1 -1 scale
(-0.2) t 
GR
GR
GS
[0.75 0 0 0.75 817.37283 417.75928] CT
0.149 GC
/Helvetica 13.333 F
GS
[1 0 0 1 0 0] CT
-8 5.5 moveto 
1 -1 scale
(0) t 
GR
GR
GS
[0.75 0 0 0.75 817.37283 353.49205] CT
0.149 GC
/Helvetica 13.333 F
GS
[1 0 0 1 0 0] CT
-19 5.5 moveto 
1 -1 scale
(0.2) t 
GR
GR
GS
[0.75 0 0 0.75 817.37283 289.22482] CT
0.149 GC
/Helvetica 13.333 F
GS
[1 0 0 1 0 0] CT
-19 5.5 moveto 
1 -1 scale
(0.4) t 
GR
GR
GS
[0.75 0 0 0.75 817.37283 224.95757] CT
0.149 GC
/Helvetica 13.333 F
GS
[1 0 0 1 0 0] CT
-19 5.5 moveto 
1 -1 scale
(0.6) t 
GR
GR
GS
[0.75 0 0 0.75 817.37283 160.69033] CT
0.149 GC
/Helvetica 13.333 F
GS
[1 0 0 1 0 0] CT
-19 5.5 moveto 
1 -1 scale
(0.8) t 
GR
GR
GS
[0.75 0 0 0.75 817.37283 96.4231] CT
0.149 GC
/Helvetica 13.333 F
GS
[1 0 0 1 0 0] CT
-8 5.5 moveto 
1 -1 scale
(1) t 
GR
GR
GS
[0.75 0 0 0.75 0 -0.25] CT
1 0 0 RC
1 LJ
0.667 LW
N
1309.388 557.346 M
1737.836 557.346 L
S
GR
GS
[0.75 0 0 0.75 0 -0.25] CT
1 0 0 RC
1 LJ
0.667 LW
N
1737.836 557.346 M
1095.552 186.075 L
S
GR
GS
[0.75 0 0 0.75 0 -0.25] CT
1 0 0 RC
1 LJ
0.667 LW
N
1095.552 186.075 M
1309.388 557.346 L
S
GR
GS
[0.75 0 0 0.75 0 -0.25] CT
0 0 1 RC
1 LJ
0.667 LW
N
1416.597 371.878 M
1095.164 557.234 L
S
GR
GS
[0.75 0 0 0.75 0 -0.25] CT
0 0 1 RC
1 LJ
0.667 LW
N
1095.164 557.234 M
1416.403 742.925 L
S
GR
GS
[0.75 0 0 0.75 0 -0.25] CT
0 0 1 RC
1 LJ
0.667 LW
N
1416.403 742.925 M
1416.597 371.878 L
S
GR
GS
[0.75 0 0 0.75 0 -0.25] CT
1 0 1 RC
N
/f1150712002{1309.388 557.346 M
1416.5 557.346 L
1416.597 371.878 L
1255.929 464.528 L
cp}def
f1150712002
f
GR
GS
[0.75 0 0 0.75 0 -0.25] CT
2 setlinecap
10.0 ML
0.667 LW
N
1309.388 557.346 M
1416.5 557.346 L
1416.597 371.878 L
1255.929 464.528 L
1309.388 557.346 L
S
GR
GS
[0.75 0 0 0.75 0 -0.25] CT
1 LJ
0.667 LW
N
1395.078 557.346 M
1395.073 556.439 L
1395.058 555.533 L
1395.034 554.627 L
1395.001 553.721 L
1394.958 552.816 L
1394.905 551.911 L
1394.843 551.007 L
1394.771 550.103 L
1394.69 549.2 L
1394.599 548.299 L
1394.498 547.398 L
1394.388 546.498 L
1394.269 545.6 L
1394.14 544.702 L
1394.001 543.807 L
1393.853 542.912 L
1393.696 542.02 L
1393.529 541.129 L
1393.353 540.24 L
1393.167 539.353 L
1392.972 538.467 L
1392.768 537.584 L
1392.554 536.703 L
1392.331 535.825 L
1392.099 534.949 L
1391.857 534.075 L
1391.607 533.204 L
1391.347 532.336 L
1391.078 531.47 L
1390.799 530.608 L
1390.512 529.748 L
1390.215 528.891 L
1389.91 528.038 L
1389.595 527.188 L
1389.272 526.341 L
1388.939 525.498 L
1388.598 524.658 L
1388.248 523.822 L
1387.889 522.99 L
1387.521 522.162 L
1387.145 521.337 L
1386.759 520.517 L
1386.365 519.7 L
1385.963 518.888 L
1385.552 518.08 L
1385.132 517.277 L
1384.704 516.478 L
1384.268 515.684 L
1383.823 514.894 L
1383.37 514.109 L
1382.908 513.329 L
1382.438 512.554 L
1381.961 511.783 L
1381.475 511.018 L
1380.981 510.258 L
1380.479 509.504 L
1379.969 508.755 L
1379.451 508.011 L
1378.925 507.272 L
1378.391 506.54 L
1377.85 505.813 L
1377.301 505.091 L
1376.745 504.376 L
1376.18 503.666 L
1375.609 502.963 L
1375.03 502.265 L
1374.444 501.574 L
1373.85 500.889 L
1373.249 500.211 L
1372.641 499.538 L
1372.026 498.872 L
1371.404 498.213 L
1370.776 497.56 L
1370.14 496.914 L
1369.497 496.275 L
1368.848 495.643 L
1368.192 495.017 L
1367.529 494.399 L
1366.86 493.787 L
1366.185 493.183 L
1365.503 492.586 L
1364.815 491.996 L
1364.12 491.413 L
1363.42 490.838 L
1362.713 490.27 L
1362.001 489.71 L
1361.282 489.157 L
1360.558 488.612 L
1359.828 488.075 L
1359.093 487.545 L
1358.352 487.023 L
1357.605 486.509 L
1356.853 486.003 L
1356.096 485.505 L
1355.333 485.015 L
1354.566 484.533 L
1353.793 484.059 L
1353.015 483.594 L
1352.233 483.136 L
S
GR
GS
[0.75 0 0 0.75 1006.5 394.25] CT
N
f-684232328
f
GR
GS
[0.75 0 0 0.75 0 -0.25] CT
1 0 0 RC
1 LJ
0.667 LW
N
1309.388 557.346 M
1737.836 557.346 L
S
GR
GS
[0.75 0 0 0.75 0 -0.25] CT
1 0 0 RC
1 LJ
0.667 LW
N
1737.836 557.346 M
1095.552 186.075 L
S
GR
GS
[0.75 0 0 0.75 0 -0.25] CT
1 0 0 RC
1 LJ
0.667 LW
N
1095.552 186.075 M
1309.388 557.346 L
S
GR
GS
[0.75 0 0 0.75 0 -0.25] CT
0 0 1 RC
1 LJ
0.667 LW
N
1416.597 371.878 M
1095.164 557.234 L
S
GR
GS
[0.75 0 0 0.75 0 -0.25] CT
0 0 1 RC
1 LJ
0.667 LW
N
1095.164 557.234 M
1416.403 742.925 L
S
GR
GS
[0.75 0 0 0.75 0 -0.25] CT
0 0 1 RC
1 LJ
0.667 LW
N
1416.403 742.925 M
1416.597 371.878 L
S
GR
GS
[0.75 0 0 0.75 0 -0.25] CT
1 0 1 RC
N
f1150712002
f
GR
GS
[0.75 0 0 0.75 0 -0.25] CT
2 setlinecap
10.0 ML
0.667 LW
N
1309.388 557.346 M
1416.5 557.346 L
1416.597 371.878 L
1255.929 464.528 L
1309.388 557.346 L
S
GR
GS
[0.75 0 0 0.75 0 -0.25] CT
1 LJ
0.667 LW
N
1395.078 557.346 M
1395.058 555.533 L
1395.001 553.721 L
1394.905 551.911 L
1394.771 550.103 L
1394.599 548.299 L
1394.388 546.498 L
1394.14 544.702 L
1393.853 542.912 L
1393.529 541.129 L
1393.167 539.353 L
1392.768 537.584 L
1392.331 535.825 L
1391.857 534.075 L
1391.347 532.336 L
1390.799 530.608 L
1390.215 528.891 L
1389.595 527.188 L
1388.939 525.498 L
1388.248 523.822 L
1387.521 522.162 L
1386.759 520.517 L
1385.963 518.888 L
1385.132 517.277 L
1384.268 515.684 L
1383.37 514.109 L
1382.438 512.554 L
1381.475 511.018 L
1380.479 509.504 L
1379.451 508.011 L
1378.391 506.54 L
1377.301 505.091 L
1376.18 503.666 L
1375.03 502.265 L
1373.85 500.889 L
1372.641 499.538 L
1371.404 498.213 L
1370.14 496.914 L
1368.848 495.643 L
1367.529 494.399 L
1366.185 493.183 L
1364.815 491.996 L
1363.42 490.838 L
1362.001 489.71 L
1360.558 488.612 L
1359.093 487.545 L
1357.605 486.509 L
1356.096 485.505 L
1354.566 484.533 L
1353.015 483.594 L
1351.445 482.687 L
1349.857 481.814 L
1348.25 480.975 L
1346.626 480.17 L
1344.985 479.4 L
1343.328 478.664 L
1341.656 477.964 L
1339.969 477.299 L
1338.269 476.67 L
1336.556 476.077 L
1334.831 475.52 L
1333.094 475.001 L
1331.347 474.518 L
1329.59 474.072 L
1327.824 473.663 L
1326.05 473.292 L
1324.268 472.958 L
1322.479 472.662 L
1320.685 472.404 L
1318.886 472.184 L
1317.082 472.002 L
1315.275 471.859 L
1313.465 471.753 L
1311.654 471.686 L
1309.841 471.657 L
1308.028 471.667 L
1306.216 471.715 L
1304.406 471.801 L
1302.597 471.926 L
1300.792 472.088 L
1298.99 472.289 L
1297.193 472.528 L
1295.401 472.805 L
1293.616 473.12 L
1291.838 473.472 L
1290.068 473.862 L
1288.306 474.29 L
1286.554 474.754 L
1284.812 475.256 L
1283.081 475.794 L
1281.362 476.369 L
1279.655 476.98 L
1277.961 477.627 L
1276.282 478.31 L
1274.618 479.027 L
1272.969 479.781 L
1271.336 480.568 L
1269.72 481.39 L
1268.123 482.247 L
1266.543 483.136 L
S
GR
GS
[0.75 0 0 0.75 1006.5 394.25] CT
N
f-684232328
f
GR
%%Trailer
%%Pages: 1
%%EOF
