%!PS-Adobe-3.0 EPSF-3.0
%%Creator: (MATLAB, The Mathworks, Inc. Version 9.7.0.1190202 \(R2019b\). Operating System: Mac OS X)
%%Title: /Users/ibrahimalmuslimani/Desktop/09/Ex1.eps
%%CreationDate: 2020-03-27T13:10:36
%%Pages: (atend)
%%BoundingBox: 0 0 560 420
%%LanguageLevel: 3
%%EndComments
%%BeginProlog
%%BeginResource: procset (Apache XML Graphics Std ProcSet) 1.2 0
%%Version: 1.2 0
%%Copyright: (Copyright 2001-2003,2010 The Apache Software Foundation. License terms: http://www.apache.org/licenses/LICENSE-2.0)
/bd{bind def}bind def
/ld{load def}bd
/GR/grestore ld
/GS/gsave ld
/RM/rmoveto ld
/C/curveto ld
/t/show ld
/L/lineto ld
/ML/setmiterlimit ld
/CT/concat ld
/f/fill ld
/N/newpath ld
/S/stroke ld
/CC/setcmykcolor ld
/A/ashow ld
/cp/closepath ld
/RC/setrgbcolor ld
/LJ/setlinejoin ld
/GC/setgray ld
/LW/setlinewidth ld
/M/moveto ld
/re {4 2 roll M
1 index 0 rlineto
0 exch rlineto
neg 0 rlineto
cp } bd
/_ctm matrix def
/_tm matrix def
/BT { _ctm currentmatrix pop matrix _tm copy pop 0 0 moveto } bd
/ET { _ctm setmatrix } bd
/iTm { _ctm setmatrix _tm concat } bd
/Tm { _tm astore pop iTm 0 0 moveto } bd
/ux 0.0 def
/uy 0.0 def
/F {
  /Tp exch def
  /Tf exch def
  Tf findfont Tp scalefont setfont
  /cf Tf def  /cs Tp def
} bd
/ULS {currentpoint /uy exch def /ux exch def} bd
/ULE {
  /Tcx currentpoint pop def
  gsave
  newpath
  cf findfont cs scalefont dup
  /FontMatrix get 0 get /Ts exch def /FontInfo get dup
  /UnderlinePosition get Ts mul /To exch def
  /UnderlineThickness get Ts mul /Tt exch def
  ux uy To add moveto  Tcx uy To add lineto
  Tt setlinewidth stroke
  grestore
} bd
/OLE {
  /Tcx currentpoint pop def
  gsave
  newpath
  cf findfont cs scalefont dup
  /FontMatrix get 0 get /Ts exch def /FontInfo get dup
  /UnderlinePosition get Ts mul /To exch def
  /UnderlineThickness get Ts mul /Tt exch def
  ux uy To add cs add moveto Tcx uy To add cs add lineto
  Tt setlinewidth stroke
  grestore
} bd
/SOE {
  /Tcx currentpoint pop def
  gsave
  newpath
  cf findfont cs scalefont dup
  /FontMatrix get 0 get /Ts exch def /FontInfo get dup
  /UnderlinePosition get Ts mul /To exch def
  /UnderlineThickness get Ts mul /Tt exch def
  ux uy To add cs 10 mul 26 idiv add moveto Tcx uy To add cs 10 mul 26 idiv add lineto
  Tt setlinewidth stroke
  grestore
} bd
/QT {
/Y22 exch store
/X22 exch store
/Y21 exch store
/X21 exch store
currentpoint
/Y21 load 2 mul add 3 div exch
/X21 load 2 mul add 3 div exch
/X21 load 2 mul /X22 load add 3 div
/Y21 load 2 mul /Y22 load add 3 div
/X22 load /Y22 load curveto
} bd
/SSPD {
dup length /d exch dict def
{
/v exch def
/k exch def
currentpagedevice k known {
/cpdv currentpagedevice k get def
v cpdv ne {
/upd false def
/nullv v type /nulltype eq def
/nullcpdv cpdv type /nulltype eq def
nullv nullcpdv or
{
/upd true def
} {
/sametype v type cpdv type eq def
sametype {
v type /arraytype eq {
/vlen v length def
/cpdvlen cpdv length def
vlen cpdvlen eq {
0 1 vlen 1 sub {
/i exch def
/obj v i get def
/cpdobj cpdv i get def
obj cpdobj ne {
/upd true def
exit
} if
} for
} {
/upd true def
} ifelse
} {
v type /dicttype eq {
v {
/dv exch def
/dk exch def
/cpddv cpdv dk get def
dv cpddv ne {
/upd true def
exit
} if
} forall
} {
/upd true def
} ifelse
} ifelse
} if
} ifelse
upd true eq {
d k v put
} if
} if
} if
} forall
d length 0 gt {
d setpagedevice
} if
} bd
/RE { % /NewFontName [NewEncodingArray] /FontName RE -
  findfont dup length dict begin
  {
    1 index /FID ne
    {def} {pop pop} ifelse
  } forall
  /Encoding exch def
  /FontName 1 index def
  currentdict definefont pop
  end
} bind def
%%EndResource
%%BeginResource: procset (Apache XML Graphics EPS ProcSet) 1.0 0
%%Version: 1.0 0
%%Copyright: (Copyright 2002-2003 The Apache Software Foundation. License terms: http://www.apache.org/licenses/LICENSE-2.0)
/BeginEPSF { %def
/b4_Inc_state save def         % Save state for cleanup
/dict_count countdictstack def % Count objects on dict stack
/op_count count 1 sub def      % Count objects on operand stack
userdict begin                 % Push userdict on dict stack
/showpage { } def              % Redefine showpage, { } = null proc
0 setgray 0 setlinecap         % Prepare graphics state
1 setlinewidth 0 setlinejoin
10 setmiterlimit [ ] 0 setdash newpath
/languagelevel where           % If level not equal to 1 then
{pop languagelevel             % set strokeadjust and
1 ne                           % overprint to their defaults.
{false setstrokeadjust false setoverprint
} if
} if
} bd
/EndEPSF { %def
count op_count sub {pop} repeat            % Clean up stacks
countdictstack dict_count sub {end} repeat
b4_Inc_state restore
} bd
%%EndResource
%FOPBeginFontDict
%%IncludeResource: font Courier-Oblique
%%IncludeResource: font Courier-BoldOblique
%%IncludeResource: font Courier-Bold
%%IncludeResource: font ZapfDingbats
%%IncludeResource: font Symbol
%%IncludeResource: font Helvetica
%%IncludeResource: font Helvetica-Oblique
%%IncludeResource: font Helvetica-Bold
%%IncludeResource: font Helvetica-BoldOblique
%%IncludeResource: font Times-Roman
%%IncludeResource: font Times-Italic
%%IncludeResource: font Times-Bold
%%IncludeResource: font Times-BoldItalic
%%IncludeResource: font Courier
%FOPEndFontDict
%%BeginResource: encoding WinAnsiEncoding
/WinAnsiEncoding [
/.notdef /.notdef /.notdef /.notdef /.notdef
/.notdef /.notdef /.notdef /.notdef /.notdef
/.notdef /.notdef /.notdef /.notdef /.notdef
/.notdef /.notdef /.notdef /.notdef /.notdef
/.notdef /.notdef /.notdef /.notdef /.notdef
/.notdef /.notdef /.notdef /.notdef /.notdef
/.notdef /.notdef /space /exclam /quotedbl
/numbersign /dollar /percent /ampersand /quotesingle
/parenleft /parenright /asterisk /plus /comma
/hyphen /period /slash /zero /one
/two /three /four /five /six
/seven /eight /nine /colon /semicolon
/less /equal /greater /question /at
/A /B /C /D /E
/F /G /H /I /J
/K /L /M /N /O
/P /Q /R /S /T
/U /V /W /X /Y
/Z /bracketleft /backslash /bracketright /asciicircum
/underscore /quoteleft /a /b /c
/d /e /f /g /h
/i /j /k /l /m
/n /o /p /q /r
/s /t /u /v /w
/x /y /z /braceleft /bar
/braceright /asciitilde /bullet /Euro /bullet
/quotesinglbase /florin /quotedblbase /ellipsis /dagger
/daggerdbl /circumflex /perthousand /Scaron /guilsinglleft
/OE /bullet /Zcaron /bullet /bullet
/quoteleft /quoteright /quotedblleft /quotedblright /bullet
/endash /emdash /asciitilde /trademark /scaron
/guilsinglright /oe /bullet /zcaron /Ydieresis
/space /exclamdown /cent /sterling /currency
/yen /brokenbar /section /dieresis /copyright
/ordfeminine /guillemotleft /logicalnot /sfthyphen /registered
/macron /degree /plusminus /twosuperior /threesuperior
/acute /mu /paragraph /middot /cedilla
/onesuperior /ordmasculine /guillemotright /onequarter /onehalf
/threequarters /questiondown /Agrave /Aacute /Acircumflex
/Atilde /Adieresis /Aring /AE /Ccedilla
/Egrave /Eacute /Ecircumflex /Edieresis /Igrave
/Iacute /Icircumflex /Idieresis /Eth /Ntilde
/Ograve /Oacute /Ocircumflex /Otilde /Odieresis
/multiply /Oslash /Ugrave /Uacute /Ucircumflex
/Udieresis /Yacute /Thorn /germandbls /agrave
/aacute /acircumflex /atilde /adieresis /aring
/ae /ccedilla /egrave /eacute /ecircumflex
/edieresis /igrave /iacute /icircumflex /idieresis
/eth /ntilde /ograve /oacute /ocircumflex
/otilde /odieresis /divide /oslash /ugrave
/uacute /ucircumflex /udieresis /yacute /thorn
/ydieresis
] def
%%EndResource
%FOPBeginFontReencode
/Courier-Oblique findfont
dup length dict begin
  {1 index /FID ne {def} {pop pop} ifelse} forall
  /Encoding WinAnsiEncoding def
  currentdict
end
/Courier-Oblique exch definefont pop
/Courier-BoldOblique findfont
dup length dict begin
  {1 index /FID ne {def} {pop pop} ifelse} forall
  /Encoding WinAnsiEncoding def
  currentdict
end
/Courier-BoldOblique exch definefont pop
/Courier-Bold findfont
dup length dict begin
  {1 index /FID ne {def} {pop pop} ifelse} forall
  /Encoding WinAnsiEncoding def
  currentdict
end
/Courier-Bold exch definefont pop
/Helvetica findfont
dup length dict begin
  {1 index /FID ne {def} {pop pop} ifelse} forall
  /Encoding WinAnsiEncoding def
  currentdict
end
/Helvetica exch definefont pop
/Helvetica-Oblique findfont
dup length dict begin
  {1 index /FID ne {def} {pop pop} ifelse} forall
  /Encoding WinAnsiEncoding def
  currentdict
end
/Helvetica-Oblique exch definefont pop
/Helvetica-Bold findfont
dup length dict begin
  {1 index /FID ne {def} {pop pop} ifelse} forall
  /Encoding WinAnsiEncoding def
  currentdict
end
/Helvetica-Bold exch definefont pop
/Helvetica-BoldOblique findfont
dup length dict begin
  {1 index /FID ne {def} {pop pop} ifelse} forall
  /Encoding WinAnsiEncoding def
  currentdict
end
/Helvetica-BoldOblique exch definefont pop
/Times-Roman findfont
dup length dict begin
  {1 index /FID ne {def} {pop pop} ifelse} forall
  /Encoding WinAnsiEncoding def
  currentdict
end
/Times-Roman exch definefont pop
/Times-Italic findfont
dup length dict begin
  {1 index /FID ne {def} {pop pop} ifelse} forall
  /Encoding WinAnsiEncoding def
  currentdict
end
/Times-Italic exch definefont pop
/Times-Bold findfont
dup length dict begin
  {1 index /FID ne {def} {pop pop} ifelse} forall
  /Encoding WinAnsiEncoding def
  currentdict
end
/Times-Bold exch definefont pop
/Times-BoldItalic findfont
dup length dict begin
  {1 index /FID ne {def} {pop pop} ifelse} forall
  /Encoding WinAnsiEncoding def
  currentdict
end
/Times-BoldItalic exch definefont pop
/Courier findfont
dup length dict begin
  {1 index /FID ne {def} {pop pop} ifelse} forall
  /Encoding WinAnsiEncoding def
  currentdict
end
/Courier exch definefont pop
%FOPEndFontReencode
%%EndProlog
%%Page: 1 1
%%PageBoundingBox: 0 0 560 420
%%BeginPageSetup
[1 0 0 -1 0 420] CT
%%EndPageSetup
GS
1 GC
N
0 0 560 420 re
f
GR
GS
1 GC
N
0 0 560 420 re
f
GR
GS
1 GC
N
73 374 M
507 374 L
507 31.5 L
73 31.5 L
cp
f
GR
GS
0.149 GC
2 setlinecap
1 LJ
1.3 LW
N
73 374 M
507 374 L
S
GR
GS
0.149 GC
2 setlinecap
1 LJ
1.3 LW
N
73 31.5 M
507 31.5 L
S
GR
GS
0.149 GC
2 setlinecap
1 LJ
1.3 LW
N
73 374 M
73 369.66 L
S
GR
GS
0.149 GC
2 setlinecap
1 LJ
1.3 LW
N
159.8 374 M
159.8 369.66 L
S
GR
GS
0.149 GC
2 setlinecap
1 LJ
1.3 LW
N
246.6 374 M
246.6 369.66 L
S
GR
GS
0.149 GC
2 setlinecap
1 LJ
1.3 LW
N
333.4 374 M
333.4 369.66 L
S
GR
GS
0.149 GC
2 setlinecap
1 LJ
1.3 LW
N
420.2 374 M
420.2 369.66 L
S
GR
GS
0.149 GC
2 setlinecap
1 LJ
1.3 LW
N
507 374 M
507 369.66 L
S
GR
GS
0.149 GC
2 setlinecap
1 LJ
1.3 LW
N
73 31.5 M
73 35.84 L
S
GR
GS
0.149 GC
2 setlinecap
1 LJ
1.3 LW
N
159.8 31.5 M
159.8 35.84 L
S
GR
GS
0.149 GC
2 setlinecap
1 LJ
1.3 LW
N
246.6 31.5 M
246.6 35.84 L
S
GR
GS
0.149 GC
2 setlinecap
1 LJ
1.3 LW
N
333.4 31.5 M
333.4 35.84 L
S
GR
GS
0.149 GC
2 setlinecap
1 LJ
1.3 LW
N
420.2 31.5 M
420.2 35.84 L
S
GR
GS
0.149 GC
2 setlinecap
1 LJ
1.3 LW
N
507 31.5 M
507 35.84 L
S
GR
GS
[1 0 0 1 73 380] CT
0.149 GC
/Helvetica 20 F
GS
[1 0 0 1 0 0] CT
-6 20 moveto 
1 -1 scale
(0) t 
GR
GR
GS
[1 0 0 1 159.8 380] CT
0.149 GC
/Helvetica 20 F
GS
[1 0 0 1 0 0] CT
-14 20 moveto 
1 -1 scale
(0.2) t 
GR
GR
GS
[1 0 0 1 246.60001 380] CT
0.149 GC
/Helvetica 20 F
GS
[1 0 0 1 0 0] CT
-14 20 moveto 
1 -1 scale
(0.4) t 
GR
GR
GS
[1 0 0 1 333.40002 380] CT
0.149 GC
/Helvetica 20 F
GS
[1 0 0 1 0 0] CT
-14 20 moveto 
1 -1 scale
(0.6) t 
GR
GR
GS
[1 0 0 1 420.20001 380] CT
0.149 GC
/Helvetica 20 F
GS
[1 0 0 1 0 0] CT
-14 20 moveto 
1 -1 scale
(0.8) t 
GR
GR
GS
[1 0 0 1 507 380] CT
0.149 GC
/Helvetica 20 F
GS
[1 0 0 1 0 0] CT
-6 20 moveto 
1 -1 scale
(1) t 
GR
GR
GS
0.149 GC
2 setlinecap
1 LJ
1.3 LW
N
73 374 M
73 31.5 L
S
GR
GS
0.149 GC
2 setlinecap
1 LJ
1.3 LW
N
507 374 M
507 31.5 L
S
GR
GS
0.149 GC
2 setlinecap
1 LJ
1.3 LW
N
73 374 M
77.34 374 L
S
GR
GS
0.149 GC
2 setlinecap
1 LJ
1.3 LW
N
73 305.5 M
77.34 305.5 L
S
GR
GS
0.149 GC
2 setlinecap
1 LJ
1.3 LW
N
73 237 M
77.34 237 L
S
GR
GS
0.149 GC
2 setlinecap
1 LJ
1.3 LW
N
73 168.5 M
77.34 168.5 L
S
GR
GS
0.149 GC
2 setlinecap
1 LJ
1.3 LW
N
73 100 M
77.34 100 L
S
GR
GS
0.149 GC
2 setlinecap
1 LJ
1.3 LW
N
73 31.5 M
77.34 31.5 L
S
GR
GS
0.149 GC
2 setlinecap
1 LJ
1.3 LW
N
507 374 M
502.66 374 L
S
GR
GS
0.149 GC
2 setlinecap
1 LJ
1.3 LW
N
507 305.5 M
502.66 305.5 L
S
GR
GS
0.149 GC
2 setlinecap
1 LJ
1.3 LW
N
507 237 M
502.66 237 L
S
GR
GS
0.149 GC
2 setlinecap
1 LJ
1.3 LW
N
507 168.5 M
502.66 168.5 L
S
GR
GS
0.149 GC
2 setlinecap
1 LJ
1.3 LW
N
507 100 M
502.66 100 L
S
GR
GS
0.149 GC
2 setlinecap
1 LJ
1.3 LW
N
507 31.5 M
502.66 31.5 L
S
GR
GS
[1 0 0 1 67 374] CT
0.149 GC
/Helvetica 20 F
GS
[1 0 0 1 0 0] CT
-19 7.5 moveto 
1 -1 scale
(-1) t 
GR
GR
GS
[1 0 0 1 67 305.5] CT
0.149 GC
/Helvetica 20 F
GS
[1 0 0 1 0 0] CT
-36 7.5 moveto 
1 -1 scale
(-0.5) t 
GR
GR
GS
[1 0 0 1 67 237] CT
0.149 GC
/Helvetica 20 F
GS
[1 0 0 1 0 0] CT
-12 7.5 moveto 
1 -1 scale
(0) t 
GR
GR
GS
[1 0 0 1 67 168.5] CT
0.149 GC
/Helvetica 20 F
GS
[1 0 0 1 0 0] CT
-28 7.5 moveto 
1 -1 scale
(0.5) t 
GR
GR
GS
[1 0 0 1 67 100] CT
0.149 GC
/Helvetica 20 F
GS
[1 0 0 1 0 0] CT
-12 7.5 moveto 
1 -1 scale
(1) t 
GR
GR
GS
[1 0 0 1 67 31.5] CT
0.149 GC
/Helvetica 20 F
GS
[1 0 0 1 0 0] CT
-28 7.5 moveto 
1 -1 scale
(1.5) t 
GR
GR
GS
0 0.447 0.741 RC
1 LJ
1.3 LW
N
73 100 M
81.68 115.762 L
90.36 148.89 L
99.04 192.971 L
107.72 240.409 L
116.4 283.678 L
125.08 316.467 L
133.76 334.56 L
142.44 336.313 L
151.12 322.714 L
159.8 297.027 L
168.48 264.117 L
177.16 229.582 L
185.84 198.84 L
194.52 176.308 L
203.2 164.807 L
211.88 165.253 L
220.56 176.658 L
229.24 196.432 L
237.92 220.902 L
246.6 245.957 L
255.28 267.713 L
263.96 283.091 L
272.64 290.224 L
281.32 288.653 L
290 279.289 L
298.68 264.165 L
307.36 246.041 L
316.04 227.926 L
324.72 212.593 L
333.4 202.18 L
342.08 197.902 L
350.76 199.944 L
359.44 207.507 L
368.12 219.007 L
376.8 232.38 L
385.48 245.433 L
394.16 256.191 L
402.84 263.18 L
411.52 265.621 L
420.2 263.489 L
428.88 257.462 L
437.56 248.763 L
446.24 238.93 L
454.92 229.558 L
463.6 222.047 L
472.28 217.404 L
480.96 216.121 L
489.64 218.136 L
498.32 222.886 L
507 229.434 L
S
GR
GS
[1 0 0 1 73 108.18015] CT
0 1 0 RC
N
0 -2.35 M
1.298 -2.35 2.35 -1.298 2.35 0 C
2.35 0 L
2.35 1.298 1.298 2.35 0 2.35 C
-1.298 2.35 -2.35 1.298 -2.35 0 C
-2.35 -1.298 -1.298 -2.35 0 -2.35 C
cp
0 -3.65 M
-2.016 -3.65 -3.65 -2.016 -3.65 0 C
-3.65 2.016 -2.016 3.65 0 3.65 C
2.016 3.65 3.65 2.016 3.65 0 C
3.65 0 L
3.65 -2.016 2.016 -3.65 0 -3.65 C
cp
f
GR
GS
[1 0 0 1 81.68 91.70516] CT
0 1 0 RC
N
/f1928756966{0 -2.35 M
1.298 -2.35 2.35 -1.298 2.35 0 C
2.35 0 L
2.35 1.298 1.298 2.35 0 2.35 C
-1.298 2.35 -2.35 1.298 -2.35 0 C
-2.35 -1.298 -1.298 -2.35 0 -2.35 C
cp
0 -3.65 M
-2.016 -3.65 -3.65 -2.016 -3.65 0 C
-3.65 2.016 -2.016 3.65 0 3.65 C
2.016 3.65 3.65 2.016 3.65 0 C
3.65 0 L
3.65 -2.016 2.016 -3.65 0 -3.65 C
cp}def
f1928756966
f
GR
GS
[1 0 0 1 90.36 128.28796] CT
0 1 0 RC
N
f1928756966
f
GR
GS
[1 0 0 1 99.04 190.22203] CT
0 1 0 RC
N
f1928756966
f
GR
GS
[1 0 0 1 107.72 233.69722] CT
0 1 0 RC
N
f1928756966
f
GR
GS
[1 0 0 1 116.4 278.90753] CT
0 1 0 RC
N
f1928756966
f
GR
GS
[1 0 0 1 125.08 332.48318] CT
0 1 0 RC
N
f1928756966
f
GR
GS
[1 0 0 1 133.75999 345.45163] CT
0 1 0 RC
N
f1928756966
f
GR
GS
[1 0 0 1 142.44 337.90619] CT
0 1 0 RC
N
f1928756966
f
GR
GS
[1 0 0 1 151.12001 337.48291] CT
0 1 0 RC
N
f1928756966
f
GR
GS
[1 0 0 1 159.8 278.15848] CT
0 1 0 RC
N
f1928756966
f
GR
GS
[1 0 0 1 168.48 280.84381] CT
0 1 0 RC
N
f1928756966
f
GR
GS
[1 0 0 1 177.16 244.60191] CT
0 1 0 RC
N
f1928756966
f
GR
GS
[1 0 0 1 185.84 216.88484] CT
0 1 0 RC
N
f1928756966
f
GR
GS
[1 0 0 1 194.52 191.23158] CT
0 1 0 RC
N
f1928756966
f
GR
GS
[1 0 0 1 203.20001 168.33121] CT
0 1 0 RC
N
f1928756966
f
GR
GS
[1 0 0 1 211.87999 175.60484] CT
0 1 0 RC
N
f1928756966
f
GR
GS
[1 0 0 1 220.56 153.45694] CT
0 1 0 RC
N
f1928756966
f
GR
GS
[1 0 0 1 229.24001 200.2567] CT
0 1 0 RC
N
f1928756966
f
GR
GS
[1 0 0 1 237.92 238.17377] CT
0 1 0 RC
N
f1928756966
f
GR
GS
[1 0 0 1 246.60001 223.76923] CT
0 1 0 RC
N
f1928756966
f
GR
GS
[1 0 0 1 255.28 241.42278] CT
0 1 0 RC
N
f1928756966
f
GR
GS
[1 0 0 1 263.95999 286.44049] CT
0 1 0 RC
N
f1928756966
f
GR
GS
[1 0 0 1 272.64001 311.5343] CT
0 1 0 RC
N
f1928756966
f
GR
GS
[1 0 0 1 281.32001 301.91116] CT
0 1 0 RC
N
f1928756966
f
GR
GS
[1 0 0 1 290 284.29092] CT
0 1 0 RC
N
f1928756966
f
GR
GS
[1 0 0 1 298.67999 258.96439] CT
0 1 0 RC
N
f1928756966
f
GR
GS
[1 0 0 1 307.36002 259.07193] CT
0 1 0 RC
N
f1928756966
f
GR
GS
[1 0 0 1 316.04001 222.28981] CT
0 1 0 RC
N
f1928756966
f
GR
GS
[1 0 0 1 324.72 201.01869] CT
0 1 0 RC
N
f1928756966
f
GR
GS
[1 0 0 1 333.40002 217.42783] CT
0 1 0 RC
N
f1928756966
f
GR
GS
[1 0 0 1 342.08002 218.86729] CT
0 1 0 RC
N
f1928756966
f
GR
GS
[1 0 0 1 350.75998 211.08589] CT
0 1 0 RC
N
f1928756966
f
GR
GS
[1 0 0 1 359.44 217.43758] CT
0 1 0 RC
N
f1928756966
f
GR
GS
[1 0 0 1 368.12 223.16286] CT
0 1 0 RC
N
f1928756966
f
GR
GS
[1 0 0 1 376.79999 231.94986] CT
0 1 0 RC
N
f1928756966
f
GR
GS
[1 0 0 1 385.48001 268.14719] CT
0 1 0 RC
N
f1928756966
f
GR
GS
[1 0 0 1 394.16 269.20657] CT
0 1 0 RC
N
f1928756966
f
GR
GS
[1 0 0 1 402.84 246.68465] CT
0 1 0 RC
N
f1928756966
f
GR
GS
[1 0 0 1 411.51999 291.41974] CT
0 1 0 RC
N
f1928756966
f
GR
GS
[1 0 0 1 420.20001 239.98749] CT
0 1 0 RC
N
f1928756966
f
GR
GS
[1 0 0 1 428.88 244.83945] CT
0 1 0 RC
N
f1928756966
f
GR
GS
[1 0 0 1 437.56 249.38684] CT
0 1 0 RC
N
f1928756966
f
GR
GS
[1 0 0 1 446.24002 234.62697] CT
0 1 0 RC
N
f1928756966
f
GR
GS
[1 0 0 1 454.91998 243.95473] CT
0 1 0 RC
N
f1928756966
f
GR
GS
[1 0 0 1 463.59998 224.30159] CT
0 1 0 RC
N
f1928756966
f
GR
GS
[1 0 0 1 472.28 192.02663] CT
0 1 0 RC
N
f1928756966
f
GR
GS
[1 0 0 1 480.95999 213.55586] CT
0 1 0 RC
N
f1928756966
f
GR
GS
[1 0 0 1 489.63998 216.97737] CT
0 1 0 RC
N
f1928756966
f
GR
GS
[1 0 0 1 498.32001 237.59464] CT
0 1 0 RC
N
f1928756966
f
GR
GS
[1 0 0 1 507 230.04218] CT
0 1 0 RC
N
f1928756966
f
GR
GS
[1 0 0 1 73 88.28967] CT
1 0 0 RC
10.0 ML
1.3 LW
N
0 -3 M
0 3 L
-3 0 M
3 0 L
-2.121 -2.121 M
2.121 2.121 L
-2.121 2.121 M
2.121 -2.121 L
S
GR
GS
[1 0 0 1 81.68 105.94025] CT
1 0 0 RC
10.0 ML
1.3 LW
N
0 -3 M
0 3 L
-3 0 M
3 0 L
-2.121 -2.121 M
2.121 2.121 L
-2.121 2.121 M
2.121 -2.121 L
S
GR
GS
[1 0 0 1 90.36 141.97212] CT
1 0 0 RC
10.0 ML
1.3 LW
N
0 -3 M
0 3 L
-3 0 M
3 0 L
-2.121 -2.121 M
2.121 2.121 L
-2.121 2.121 M
2.121 -2.121 L
S
GR
GS
[1 0 0 1 99.04 189.34286] CT
1 0 0 RC
10.0 ML
1.3 LW
N
0 -3 M
0 3 L
-3 0 M
3 0 L
-2.121 -2.121 M
2.121 2.121 L
-2.121 2.121 M
2.121 -2.121 L
S
GR
GS
[1 0 0 1 107.72 239.89195] CT
1 0 0 RC
10.0 ML
1.3 LW
N
0 -3 M
0 3 L
-3 0 M
3 0 L
-2.121 -2.121 M
2.121 2.121 L
-2.121 2.121 M
2.121 -2.121 L
S
GR
GS
[1 0 0 1 116.4 285.67499] CT
1 0 0 RC
10.0 ML
1.3 LW
N
0 -3 M
0 3 L
-3 0 M
3 0 L
-2.121 -2.121 M
2.121 2.121 L
-2.121 2.121 M
2.121 -2.121 L
S
GR
GS
[1 0 0 1 125.08 320.151] CT
1 0 0 RC
10.0 ML
1.3 LW
N
0 -3 M
0 3 L
-3 0 M
3 0 L
-2.121 -2.121 M
2.121 2.121 L
-2.121 2.121 M
2.121 -2.121 L
S
GR
GS
[1 0 0 1 133.75999 339.05515] CT
1 0 0 RC
10.0 ML
1.3 LW
N
0 -3 M
0 3 L
-3 0 M
3 0 L
-2.121 -2.121 M
2.121 2.121 L
-2.121 2.121 M
2.121 -2.121 L
S
GR
GS
[1 0 0 1 142.44 340.85117] CT
1 0 0 RC
10.0 ML
1.3 LW
N
0 -3 M
0 3 L
-3 0 M
3 0 L
-2.121 -2.121 M
2.121 2.121 L
-2.121 2.121 M
2.121 -2.121 L
S
GR
GS
[1 0 0 1 151.12001 326.73093] CT
1 0 0 RC
10.0 ML
1.3 LW
N
0 -3 M
0 3 L
-3 0 M
3 0 L
-2.121 -2.121 M
2.121 2.121 L
-2.121 2.121 M
2.121 -2.121 L
S
GR
GS
[1 0 0 1 159.8 300.2001] CT
1 0 0 RC
10.0 ML
1.3 LW
N
0 -3 M
0 3 L
-3 0 M
3 0 L
-2.121 -2.121 M
2.121 2.121 L
-2.121 2.121 M
2.121 -2.121 L
S
GR
GS
[1 0 0 1 168.48 266.34787] CT
1 0 0 RC
10.0 ML
1.3 LW
N
0 -3 M
0 3 L
-3 0 M
3 0 L
-2.121 -2.121 M
2.121 2.121 L
-2.121 2.121 M
2.121 -2.121 L
S
GR
GS
[1 0 0 1 177.16 230.93906] CT
1 0 0 RC
10.0 ML
1.3 LW
N
0 -3 M
0 3 L
-3 0 M
3 0 L
-2.121 -2.121 M
2.121 2.121 L
-2.121 2.121 M
2.121 -2.121 L
S
GR
GS
[1 0 0 1 185.84 199.48125] CT
1 0 0 RC
10.0 ML
1.3 LW
N
0 -3 M
0 3 L
-3 0 M
3 0 L
-2.121 -2.121 M
2.121 2.121 L
-2.121 2.121 M
2.121 -2.121 L
S
GR
GS
[1 0 0 1 194.52 176.41089] CT
1 0 0 RC
10.0 ML
1.3 LW
N
0 -3 M
0 3 L
-3 0 M
3 0 L
-2.121 -2.121 M
2.121 2.121 L
-2.121 2.121 M
2.121 -2.121 L
S
GR
GS
[1 0 0 1 203.20001 164.51161] CT
1 0 0 RC
10.0 ML
1.3 LW
N
0 -3 M
0 3 L
-3 0 M
3 0 L
-2.121 -2.121 M
2.121 2.121 L
-2.121 2.121 M
2.121 -2.121 L
S
GR
GS
[1 0 0 1 211.87999 164.63319] CT
1 0 0 RC
10.0 ML
1.3 LW
N
0 -3 M
0 3 L
-3 0 M
3 0 L
-2.121 -2.121 M
2.121 2.121 L
-2.121 2.121 M
2.121 -2.121 L
S
GR
GS
[1 0 0 1 220.56 175.7282] CT
1 0 0 RC
10.0 ML
1.3 LW
N
0 -3 M
0 3 L
-3 0 M
3 0 L
-2.121 -2.121 M
2.121 2.121 L
-2.121 2.121 M
2.121 -2.121 L
S
GR
GS
[1 0 0 1 229.24001 195.17325] CT
1 0 0 RC
10.0 ML
1.3 LW
N
0 -3 M
0 3 L
-3 0 M
3 0 L
-2.121 -2.121 M
2.121 2.121 L
-2.121 2.121 M
2.121 -2.121 L
S
GR
GS
[1 0 0 1 237.92 219.3022] CT
1 0 0 RC
10.0 ML
1.3 LW
N
0 -3 M
0 3 L
-3 0 M
3 0 L
-2.121 -2.121 M
2.121 2.121 L
-2.121 2.121 M
2.121 -2.121 L
S
GR
GS
[1 0 0 1 246.60001 244.05183] CT
1 0 0 RC
10.0 ML
1.3 LW
N
0 -3 M
0 3 L
-3 0 M
3 0 L
-2.121 -2.121 M
2.121 2.121 L
-2.121 2.121 M
2.121 -2.121 L
S
GR
GS
[1 0 0 1 255.28 265.61252] CT
1 0 0 RC
10.0 ML
1.3 LW
N
0 -3 M
0 3 L
-3 0 M
3 0 L
-2.121 -2.121 M
2.121 2.121 L
-2.121 2.121 M
2.121 -2.121 L
S
GR
GS
[1 0 0 1 263.95999 280.98474] CT
1 0 0 RC
10.0 ML
1.3 LW
N
0 -3 M
0 3 L
-3 0 M
3 0 L
-2.121 -2.121 M
2.121 2.121 L
-2.121 2.121 M
2.121 -2.121 L
S
GR
GS
[1 0 0 1 272.64001 288.36508] CT
1 0 0 RC
10.0 ML
1.3 LW
N
0 -3 M
0 3 L
-3 0 M
3 0 L
-2.121 -2.121 M
2.121 2.121 L
-2.121 2.121 M
2.121 -2.121 L
S
GR
GS
[1 0 0 1 281.32001 287.31747] CT
1 0 0 RC
10.0 ML
1.3 LW
N
0 -3 M
0 3 L
-3 0 M
3 0 L
-2.121 -2.121 M
2.121 2.121 L
-2.121 2.121 M
2.121 -2.121 L
S
GR
GS
[1 0 0 1 290 278.72238] CT
1 0 0 RC
10.0 ML
1.3 LW
N
0 -3 M
0 3 L
-3 0 M
3 0 L
-2.121 -2.121 M
2.121 2.121 L
-2.121 2.121 M
2.121 -2.121 L
S
GR
GS
[1 0 0 1 298.67999 264.53043] CT
1 0 0 RC
10.0 ML
1.3 LW
N
0 -3 M
0 3 L
-3 0 M
3 0 L
-2.121 -2.121 M
2.121 2.121 L
-2.121 2.121 M
2.121 -2.121 L
S
GR
GS
[1 0 0 1 307.36002 247.37477] CT
1 0 0 RC
10.0 ML
1.3 LW
N
0 -3 M
0 3 L
-3 0 M
3 0 L
-2.121 -2.121 M
2.121 2.121 L
-2.121 2.121 M
2.121 -2.121 L
S
GR
GS
[1 0 0 1 316.04001 230.11301] CT
1 0 0 RC
10.0 ML
1.3 LW
N
0 -3 M
0 3 L
-3 0 M
3 0 L
-2.121 -2.121 M
2.121 2.121 L
-2.121 2.121 M
2.121 -2.121 L
S
GR
GS
[1 0 0 1 324.72 215.37419] CT
1 0 0 RC
10.0 ML
1.3 LW
N
0 -3 M
0 3 L
-3 0 M
3 0 L
-2.121 -2.121 M
2.121 2.121 L
-2.121 2.121 M
2.121 -2.121 L
S
GR
GS
[1 0 0 1 333.40002 205.17941] CT
1 0 0 RC
10.0 ML
1.3 LW
N
0 -3 M
0 3 L
-3 0 M
3 0 L
-2.121 -2.121 M
2.121 2.121 L
-2.121 2.121 M
2.121 -2.121 L
S
GR
GS
[1 0 0 1 342.08002 200.68706] CT
1 0 0 RC
10.0 ML
1.3 LW
N
0 -3 M
0 3 L
-3 0 M
3 0 L
-2.121 -2.121 M
2.121 2.121 L
-2.121 2.121 M
2.121 -2.121 L
S
GR
GS
[1 0 0 1 350.75998 202.09082] CT
1 0 0 RC
10.0 ML
1.3 LW
N
0 -3 M
0 3 L
-3 0 M
3 0 L
-2.121 -2.121 M
2.121 2.121 L
-2.121 2.121 M
2.121 -2.121 L
S
GR
GS
[1 0 0 1 359.44 208.67293] CT
1 0 0 RC
10.0 ML
1.3 LW
N
0 -3 M
0 3 L
-3 0 M
3 0 L
-2.121 -2.121 M
2.121 2.121 L
-2.121 2.121 M
2.121 -2.121 L
S
GR
GS
[1 0 0 1 368.12 218.99106] CT
1 0 0 RC
10.0 ML
1.3 LW
N
0 -3 M
0 3 L
-3 0 M
3 0 L
-2.121 -2.121 M
2.121 2.121 L
-2.121 2.121 M
2.121 -2.121 L
S
GR
GS
[1 0 0 1 376.79999 231.15933] CT
1 0 0 RC
10.0 ML
1.3 LW
N
0 -3 M
0 3 L
-3 0 M
3 0 L
-2.121 -2.121 M
2.121 2.121 L
-2.121 2.121 M
2.121 -2.121 L
S
GR
GS
[1 0 0 1 385.48001 243.17245] CT
1 0 0 RC
10.0 ML
1.3 LW
N
0 -3 M
0 3 L
-3 0 M
3 0 L
-2.121 -2.121 M
2.121 2.121 L
-2.121 2.121 M
2.121 -2.121 L
S
GR
GS
[1 0 0 1 394.16 253.22038] CT
1 0 0 RC
10.0 ML
1.3 LW
N
0 -3 M
0 3 L
-3 0 M
3 0 L
-2.121 -2.121 M
2.121 2.121 L
-2.121 2.121 M
2.121 -2.121 L
S
GR
GS
[1 0 0 1 402.84 259.94626] CT
1 0 0 RC
10.0 ML
1.3 LW
N
0 -3 M
0 3 L
-3 0 M
3 0 L
-2.121 -2.121 M
2.121 2.121 L
-2.121 2.121 M
2.121 -2.121 L
S
GR
GS
[1 0 0 1 411.51999 262.61362] CT
1 0 0 RC
10.0 ML
1.3 LW
N
0 -3 M
0 3 L
-3 0 M
3 0 L
-2.121 -2.121 M
2.121 2.121 L
-2.121 2.121 M
2.121 -2.121 L
S
GR
GS
[1 0 0 1 420.20001 261.16501] CT
1 0 0 RC
10.0 ML
1.3 LW
N
0 -3 M
0 3 L
-3 0 M
3 0 L
-2.121 -2.121 M
2.121 2.121 L
-2.121 2.121 M
2.121 -2.121 L
S
GR
GS
[1 0 0 1 428.88 256.17264] CT
1 0 0 RC
10.0 ML
1.3 LW
N
0 -3 M
0 3 L
-3 0 M
3 0 L
-2.121 -2.121 M
2.121 2.121 L
-2.121 2.121 M
2.121 -2.121 L
S
GR
GS
[1 0 0 1 437.56 248.69762] CT
1 0 0 RC
10.0 ML
1.3 LW
N
0 -3 M
0 3 L
-3 0 M
3 0 L
-2.121 -2.121 M
2.121 2.121 L
-2.121 2.121 M
2.121 -2.121 L
S
GR
GS
[1 0 0 1 446.24002 240.08701] CT
1 0 0 RC
10.0 ML
1.3 LW
N
0 -3 M
0 3 L
-3 0 M
3 0 L
-2.121 -2.121 M
2.121 2.121 L
-2.121 2.121 M
2.121 -2.121 L
S
GR
GS
[1 0 0 1 454.91998 231.74495] CT
1 0 0 RC
10.0 ML
1.3 LW
N
0 -3 M
0 3 L
-3 0 M
3 0 L
-2.121 -2.121 M
2.121 2.121 L
-2.121 2.121 M
2.121 -2.121 L
S
GR
GS
[1 0 0 1 463.59998 224.9146] CT
1 0 0 RC
10.0 ML
1.3 LW
N
0 -3 M
0 3 L
-3 0 M
3 0 L
-2.121 -2.121 M
2.121 2.121 L
-2.121 2.121 M
2.121 -2.121 L
S
GR
GS
[1 0 0 1 472.28 220.50327] CT
1 0 0 RC
10.0 ML
1.3 LW
N
0 -3 M
0 3 L
-3 0 M
3 0 L
-2.121 -2.121 M
2.121 2.121 L
-2.121 2.121 M
2.121 -2.121 L
S
GR
GS
[1 0 0 1 480.95999 218.97342] CT
1 0 0 RC
10.0 ML
1.3 LW
N
0 -3 M
0 3 L
-3 0 M
3 0 L
-2.121 -2.121 M
2.121 2.121 L
-2.121 2.121 M
2.121 -2.121 L
S
GR
GS
[1 0 0 1 489.63998 220.31059] CT
1 0 0 RC
10.0 ML
1.3 LW
N
0 -3 M
0 3 L
-3 0 M
3 0 L
-2.121 -2.121 M
2.121 2.121 L
-2.121 2.121 M
2.121 -2.121 L
S
GR
GS
[1 0 0 1 498.32001 224.06642] CT
1 0 0 RC
10.0 ML
1.3 LW
N
0 -3 M
0 3 L
-3 0 M
3 0 L
-2.121 -2.121 M
2.121 2.121 L
-2.121 2.121 M
2.121 -2.121 L
S
GR
GS
[1 0 0 1 507 229.46381] CT
1 0 0 RC
10.0 ML
1.3 LW
N
0 -3 M
0 3 L
-3 0 M
3 0 L
-2.121 -2.121 M
2.121 2.121 L
-2.121 2.121 M
2.121 -2.121 L
S
GR
GS
1 GC
N
499 109 M
499 39.5 L
339 39.5 L
339 109 L
cp
f
GR
GS
[1 0 0 1 376 52.25] CT
/Helvetica 18 F
GS
[1 0 0 1 0 0] CT
0 7 moveto 
1 -1 scale
(ground truth) t 
GR
GR
GS
0 0.447 0.741 RC
1 LJ
1.3 LW
N
343 52.25 M
373 52.25 L
S
GR
GS
[1 0 0 1 376 74.25] CT
/Helvetica 18 F
GS
[1 0 0 1 0 0] CT
0 7 moveto 
1 -1 scale
(observed data) t 
GR
GR
GS
[1 0 0 1 358 74.25] CT
0 1 0 RC
N
f1928756966
f
GR
GS
[1 0 0 1 376 96.25] CT
/Helvetica 18 F
GS
[1 0 0 1 0 0] CT
0 7 moveto 
1 -1 scale
(Gauss Newton) t 
GR
GR
GS
[1 0 0 1 358 96.25] CT
1 0 0 RC
10.0 ML
1.3 LW
N
0 -3 M
0 3 L
-3 0 M
3 0 L
-2.121 -2.121 M
2.121 2.121 L
-2.121 2.121 M
2.121 -2.121 L
S
GR
GS
0.149 GC
10.0 ML
1.3 LW
N
339 109 M
339 39.5 L
499 39.5 L
499 109 L
cp
S
GR
%%Trailer
%%Pages: 1
%%EOF
