%!PS-Adobe-3.0 EPSF-3.0
%%Creator: (MATLAB, The Mathworks, Inc. Version 9.1.0.441655 \(R2016b\). Operating System: Mac OS X)
%%Title: /Users/ibrahimmuslimani/Desktop/01/code/fig1.eps
%%CreationDate: 2017-09-26T16:11:29
%%Pages: (atend)
%%BoundingBox: 0 0 750 230
%%LanguageLevel: 3
%%EndComments
%%BeginProlog
%%BeginResource: procset (Apache XML Graphics Std ProcSet) 1.2 0
%%Version: 1.2 0
%%Copyright: (Copyright 2001-2003,2010 The Apache Software Foundation. License terms: http://www.apache.org/licenses/LICENSE-2.0)
/bd{bind def}bind def
/ld{load def}bd
/GR/grestore ld
/M/moveto ld
/LJ/setlinejoin ld
/C/curveto ld
/f/fill ld
/LW/setlinewidth ld
/GC/setgray ld
/t/show ld
/N/newpath ld
/CT/concat ld
/cp/closepath ld
/S/stroke ld
/L/lineto ld
/CC/setcmykcolor ld
/A/ashow ld
/GS/gsave ld
/RC/setrgbcolor ld
/RM/rmoveto ld
/ML/setmiterlimit ld
/re {4 2 roll M
1 index 0 rlineto
0 exch rlineto
neg 0 rlineto
cp } bd
/_ctm matrix def
/_tm matrix def
/BT { _ctm currentmatrix pop matrix _tm copy pop 0 0 moveto } bd
/ET { _ctm setmatrix } bd
/iTm { _ctm setmatrix _tm concat } bd
/Tm { _tm astore pop iTm 0 0 moveto } bd
/ux 0.0 def
/uy 0.0 def
/F {
  /Tp exch def
  /Tf exch def
  Tf findfont Tp scalefont setfont
  /cf Tf def  /cs Tp def
} bd
/ULS {currentpoint /uy exch def /ux exch def} bd
/ULE {
  /Tcx currentpoint pop def
  gsave
  newpath
  cf findfont cs scalefont dup
  /FontMatrix get 0 get /Ts exch def /FontInfo get dup
  /UnderlinePosition get Ts mul /To exch def
  /UnderlineThickness get Ts mul /Tt exch def
  ux uy To add moveto  Tcx uy To add lineto
  Tt setlinewidth stroke
  grestore
} bd
/OLE {
  /Tcx currentpoint pop def
  gsave
  newpath
  cf findfont cs scalefont dup
  /FontMatrix get 0 get /Ts exch def /FontInfo get dup
  /UnderlinePosition get Ts mul /To exch def
  /UnderlineThickness get Ts mul /Tt exch def
  ux uy To add cs add moveto Tcx uy To add cs add lineto
  Tt setlinewidth stroke
  grestore
} bd
/SOE {
  /Tcx currentpoint pop def
  gsave
  newpath
  cf findfont cs scalefont dup
  /FontMatrix get 0 get /Ts exch def /FontInfo get dup
  /UnderlinePosition get Ts mul /To exch def
  /UnderlineThickness get Ts mul /Tt exch def
  ux uy To add cs 10 mul 26 idiv add moveto Tcx uy To add cs 10 mul 26 idiv add lineto
  Tt setlinewidth stroke
  grestore
} bd
/QT {
/Y22 exch store
/X22 exch store
/Y21 exch store
/X21 exch store
currentpoint
/Y21 load 2 mul add 3 div exch
/X21 load 2 mul add 3 div exch
/X21 load 2 mul /X22 load add 3 div
/Y21 load 2 mul /Y22 load add 3 div
/X22 load /Y22 load curveto
} bd
/SSPD {
dup length /d exch dict def
{
/v exch def
/k exch def
currentpagedevice k known {
/cpdv currentpagedevice k get def
v cpdv ne {
/upd false def
/nullv v type /nulltype eq def
/nullcpdv cpdv type /nulltype eq def
nullv nullcpdv or
{
/upd true def
} {
/sametype v type cpdv type eq def
sametype {
v type /arraytype eq {
/vlen v length def
/cpdvlen cpdv length def
vlen cpdvlen eq {
0 1 vlen 1 sub {
/i exch def
/obj v i get def
/cpdobj cpdv i get def
obj cpdobj ne {
/upd true def
exit
} if
} for
} {
/upd true def
} ifelse
} {
v type /dicttype eq {
v {
/dv exch def
/dk exch def
/cpddv cpdv dk get def
dv cpddv ne {
/upd true def
exit
} if
} forall
} {
/upd true def
} ifelse
} ifelse
} if
} ifelse
upd true eq {
d k v put
} if
} if
} if
} forall
d length 0 gt {
d setpagedevice
} if
} bd
/RE { % /NewFontName [NewEncodingArray] /FontName RE -
  findfont dup length dict begin
  {
    1 index /FID ne
    {def} {pop pop} ifelse
  } forall
  /Encoding exch def
  /FontName 1 index def
  currentdict definefont pop
  end
} bind def
%%EndResource
%%BeginResource: procset (Apache XML Graphics EPS ProcSet) 1.0 0
%%Version: 1.0 0
%%Copyright: (Copyright 2002-2003 The Apache Software Foundation. License terms: http://www.apache.org/licenses/LICENSE-2.0)
/BeginEPSF { %def
/b4_Inc_state save def         % Save state for cleanup
/dict_count countdictstack def % Count objects on dict stack
/op_count count 1 sub def      % Count objects on operand stack
userdict begin                 % Push userdict on dict stack
/showpage { } def              % Redefine showpage, { } = null proc
0 setgray 0 setlinecap         % Prepare graphics state
1 setlinewidth 0 setlinejoin
10 setmiterlimit [ ] 0 setdash newpath
/languagelevel where           % If level not equal to 1 then
{pop languagelevel             % set strokeadjust and
1 ne                           % overprint to their defaults.
{false setstrokeadjust false setoverprint
} if
} if
} bd
/EndEPSF { %def
count op_count sub {pop} repeat            % Clean up stacks
countdictstack dict_count sub {end} repeat
b4_Inc_state restore
} bd
%%EndResource
%FOPBeginFontDict
%%IncludeResource: font Courier-Bold
%%IncludeResource: font Helvetica
%%IncludeResource: font Courier-BoldOblique
%%IncludeResource: font Courier-Oblique
%%IncludeResource: font Times-Roman
%%IncludeResource: font Helvetica-BoldOblique
%%IncludeResource: font Helvetica-Bold
%%IncludeResource: font Helvetica-Oblique
%%IncludeResource: font Times-BoldItalic
%%IncludeResource: font Courier
%%IncludeResource: font Times-Italic
%%IncludeResource: font Times-Bold
%%IncludeResource: font Symbol
%%IncludeResource: font ZapfDingbats
%FOPEndFontDict
%%BeginResource: encoding WinAnsiEncoding
/WinAnsiEncoding [
/.notdef /.notdef /.notdef /.notdef /.notdef
/.notdef /.notdef /.notdef /.notdef /.notdef
/.notdef /.notdef /.notdef /.notdef /.notdef
/.notdef /.notdef /.notdef /.notdef /.notdef
/.notdef /.notdef /.notdef /.notdef /.notdef
/.notdef /.notdef /.notdef /.notdef /.notdef
/.notdef /.notdef /space /exclam /quotedbl
/numbersign /dollar /percent /ampersand /quotesingle
/parenleft /parenright /asterisk /plus /comma
/hyphen /period /slash /zero /one
/two /three /four /five /six
/seven /eight /nine /colon /semicolon
/less /equal /greater /question /at
/A /B /C /D /E
/F /G /H /I /J
/K /L /M /N /O
/P /Q /R /S /T
/U /V /W /X /Y
/Z /bracketleft /backslash /bracketright /asciicircum
/underscore /quoteleft /a /b /c
/d /e /f /g /h
/i /j /k /l /m
/n /o /p /q /r
/s /t /u /v /w
/x /y /z /braceleft /bar
/braceright /asciitilde /bullet /Euro /bullet
/quotesinglbase /florin /quotedblbase /ellipsis /dagger
/daggerdbl /circumflex /perthousand /Scaron /guilsinglleft
/OE /bullet /Zcaron /bullet /bullet
/quoteleft /quoteright /quotedblleft /quotedblright /bullet
/endash /emdash /asciitilde /trademark /scaron
/guilsinglright /oe /bullet /zcaron /Ydieresis
/space /exclamdown /cent /sterling /currency
/yen /brokenbar /section /dieresis /copyright
/ordfeminine /guillemotleft /logicalnot /sfthyphen /registered
/macron /degree /plusminus /twosuperior /threesuperior
/acute /mu /paragraph /middot /cedilla
/onesuperior /ordmasculine /guillemotright /onequarter /onehalf
/threequarters /questiondown /Agrave /Aacute /Acircumflex
/Atilde /Adieresis /Aring /AE /Ccedilla
/Egrave /Eacute /Ecircumflex /Edieresis /Igrave
/Iacute /Icircumflex /Idieresis /Eth /Ntilde
/Ograve /Oacute /Ocircumflex /Otilde /Odieresis
/multiply /Oslash /Ugrave /Uacute /Ucircumflex
/Udieresis /Yacute /Thorn /germandbls /agrave
/aacute /acircumflex /atilde /adieresis /aring
/ae /ccedilla /egrave /eacute /ecircumflex
/edieresis /igrave /iacute /icircumflex /idieresis
/eth /ntilde /ograve /oacute /ocircumflex
/otilde /odieresis /divide /oslash /ugrave
/uacute /ucircumflex /udieresis /yacute /thorn
/ydieresis
] def
%%EndResource
%FOPBeginFontReencode
/Courier-Bold findfont
dup length dict begin
  {1 index /FID ne {def} {pop pop} ifelse} forall
  /Encoding WinAnsiEncoding def
  currentdict
end
/Courier-Bold exch definefont pop
/Helvetica findfont
dup length dict begin
  {1 index /FID ne {def} {pop pop} ifelse} forall
  /Encoding WinAnsiEncoding def
  currentdict
end
/Helvetica exch definefont pop
/Courier-BoldOblique findfont
dup length dict begin
  {1 index /FID ne {def} {pop pop} ifelse} forall
  /Encoding WinAnsiEncoding def
  currentdict
end
/Courier-BoldOblique exch definefont pop
/Courier-Oblique findfont
dup length dict begin
  {1 index /FID ne {def} {pop pop} ifelse} forall
  /Encoding WinAnsiEncoding def
  currentdict
end
/Courier-Oblique exch definefont pop
/Times-Roman findfont
dup length dict begin
  {1 index /FID ne {def} {pop pop} ifelse} forall
  /Encoding WinAnsiEncoding def
  currentdict
end
/Times-Roman exch definefont pop
/Helvetica-BoldOblique findfont
dup length dict begin
  {1 index /FID ne {def} {pop pop} ifelse} forall
  /Encoding WinAnsiEncoding def
  currentdict
end
/Helvetica-BoldOblique exch definefont pop
/Helvetica-Bold findfont
dup length dict begin
  {1 index /FID ne {def} {pop pop} ifelse} forall
  /Encoding WinAnsiEncoding def
  currentdict
end
/Helvetica-Bold exch definefont pop
/Helvetica-Oblique findfont
dup length dict begin
  {1 index /FID ne {def} {pop pop} ifelse} forall
  /Encoding WinAnsiEncoding def
  currentdict
end
/Helvetica-Oblique exch definefont pop
/Times-BoldItalic findfont
dup length dict begin
  {1 index /FID ne {def} {pop pop} ifelse} forall
  /Encoding WinAnsiEncoding def
  currentdict
end
/Times-BoldItalic exch definefont pop
/Courier findfont
dup length dict begin
  {1 index /FID ne {def} {pop pop} ifelse} forall
  /Encoding WinAnsiEncoding def
  currentdict
end
/Courier exch definefont pop
/Times-Italic findfont
dup length dict begin
  {1 index /FID ne {def} {pop pop} ifelse} forall
  /Encoding WinAnsiEncoding def
  currentdict
end
/Times-Italic exch definefont pop
/Times-Bold findfont
dup length dict begin
  {1 index /FID ne {def} {pop pop} ifelse} forall
  /Encoding WinAnsiEncoding def
  currentdict
end
/Times-Bold exch definefont pop
%FOPEndFontReencode
%%EndProlog
%%Page: 1 1
%%PageBoundingBox: 0 0 750 230
%%BeginPageSetup
[1 0 0 -1 0 230] CT
%%EndPageSetup
GS
1 GC
N
0 0 750 230 re
f
GR
GS
1 GC
N
0 0 750 230 re
f
GR
GS
1 GC
N
97.5 199.5 M
257.5 199.5 L
257.5 17.5 L
97.5 17.5 L
cp
f
GR
GS
0.149 GC
2 setlinecap
1 LJ
0.5 LW
N
97.5 199.5 M
257.5 199.5 L
S
GR
GS
0.149 GC
2 setlinecap
1 LJ
0.5 LW
N
97.5 17.5 M
257.5 17.5 L
S
GR
GS
0.149 GC
2 setlinecap
1 LJ
0.5 LW
N
126.57 199.5 M
126.57 197.68 L
S
GR
GS
0.149 GC
2 setlinecap
1 LJ
0.5 LW
N
177.5 199.5 M
177.5 197.68 L
S
GR
GS
0.149 GC
2 setlinecap
1 LJ
0.5 LW
N
228.43 199.5 M
228.43 197.68 L
S
GR
GS
0.149 GC
2 setlinecap
1 LJ
0.5 LW
N
126.57 17.5 M
126.57 19.32 L
S
GR
GS
0.149 GC
2 setlinecap
1 LJ
0.5 LW
N
177.5 17.5 M
177.5 19.32 L
S
GR
GS
0.149 GC
2 setlinecap
1 LJ
0.5 LW
N
228.43 17.5 M
228.43 19.32 L
S
GR
GS
[1 0 0 1 126.57042 203.5] CT
0.149 GC
/Helvetica 10 F
GS
[1 0 0 1 0 0] CT
-5 10 moveto 
1 -1 scale
(-2) t 
GR
GR
GS
[1 0 0 1 177.5 203.5] CT
0.149 GC
/Helvetica 10 F
GS
[1 0 0 1 0 0] CT
-3 10 moveto 
1 -1 scale
(0) t 
GR
GR
GS
[1 0 0 1 228.42958 203.5] CT
0.149 GC
/Helvetica 10 F
GS
[1 0 0 1 0 0] CT
-3 10 moveto 
1 -1 scale
(2) t 
GR
GR
GS
[1 0 0 1 177.50008 217] CT
0.149 GC
/Helvetica 11 F
GS
[1 0 0 1 0 0] CT
-3 11 moveto 
1 -1 scale
(x) t 
GR
GR
GS
0.149 GC
2 setlinecap
1 LJ
0.5 LW
N
97.5 199.5 M
97.5 17.5 L
S
GR
GS
0.149 GC
2 setlinecap
1 LJ
0.5 LW
N
257.5 199.5 M
257.5 17.5 L
S
GR
GS
0.149 GC
2 setlinecap
1 LJ
0.5 LW
N
97.5 199.5 M
99.32 199.5 L
S
GR
GS
0.149 GC
2 setlinecap
1 LJ
0.5 LW
N
97.5 173.5 M
99.32 173.5 L
S
GR
GS
0.149 GC
2 setlinecap
1 LJ
0.5 LW
N
97.5 147.5 M
99.32 147.5 L
S
GR
GS
0.149 GC
2 setlinecap
1 LJ
0.5 LW
N
97.5 121.5 M
99.32 121.5 L
S
GR
GS
0.149 GC
2 setlinecap
1 LJ
0.5 LW
N
97.5 95.5 M
99.32 95.5 L
S
GR
GS
0.149 GC
2 setlinecap
1 LJ
0.5 LW
N
97.5 69.5 M
99.32 69.5 L
S
GR
GS
0.149 GC
2 setlinecap
1 LJ
0.5 LW
N
97.5 43.5 M
99.32 43.5 L
S
GR
GS
0.149 GC
2 setlinecap
1 LJ
0.5 LW
N
97.5 17.5 M
99.32 17.5 L
S
GR
GS
0.149 GC
2 setlinecap
1 LJ
0.5 LW
N
257.5 199.5 M
255.68 199.5 L
S
GR
GS
0.149 GC
2 setlinecap
1 LJ
0.5 LW
N
257.5 173.5 M
255.68 173.5 L
S
GR
GS
0.149 GC
2 setlinecap
1 LJ
0.5 LW
N
257.5 147.5 M
255.68 147.5 L
S
GR
GS
0.149 GC
2 setlinecap
1 LJ
0.5 LW
N
257.5 121.5 M
255.68 121.5 L
S
GR
GS
0.149 GC
2 setlinecap
1 LJ
0.5 LW
N
257.5 95.5 M
255.68 95.5 L
S
GR
GS
0.149 GC
2 setlinecap
1 LJ
0.5 LW
N
257.5 69.5 M
255.68 69.5 L
S
GR
GS
0.149 GC
2 setlinecap
1 LJ
0.5 LW
N
257.5 43.5 M
255.68 43.5 L
S
GR
GS
0.149 GC
2 setlinecap
1 LJ
0.5 LW
N
257.5 17.5 M
255.68 17.5 L
S
GR
GS
[1 0 0 1 93.49999 199.5] CT
0.149 GC
/Helvetica 10 F
GS
[1 0 0 1 0 0] CT
-10 3.5 moveto 
1 -1 scale
(-2) t 
GR
GR
GS
[1 0 0 1 93.49999 173.5] CT
0.149 GC
/Helvetica 10 F
GS
[1 0 0 1 0 0] CT
-18 3.5 moveto 
1 -1 scale
(-1.5) t 
GR
GR
GS
[1 0 0 1 93.49999 147.5] CT
0.149 GC
/Helvetica 10 F
GS
[1 0 0 1 0 0] CT
-10 3.5 moveto 
1 -1 scale
(-1) t 
GR
GR
GS
[1 0 0 1 93.49999 121.5] CT
0.149 GC
/Helvetica 10 F
GS
[1 0 0 1 0 0] CT
-18 3.5 moveto 
1 -1 scale
(-0.5) t 
GR
GR
GS
[1 0 0 1 93.49999 95.5] CT
0.149 GC
/Helvetica 10 F
GS
[1 0 0 1 0 0] CT
-6 3.5 moveto 
1 -1 scale
(0) t 
GR
GR
GS
[1 0 0 1 93.49999 69.5] CT
0.149 GC
/Helvetica 10 F
GS
[1 0 0 1 0 0] CT
-14 3.5 moveto 
1 -1 scale
(0.5) t 
GR
GR
GS
[1 0 0 1 93.49999 43.5] CT
0.149 GC
/Helvetica 10 F
GS
[1 0 0 1 0 0] CT
-6 3.5 moveto 
1 -1 scale
(1) t 
GR
GR
GS
[1 0 0 1 93.49999 17.5] CT
0.149 GC
/Helvetica 10 F
GS
[1 0 0 1 0 0] CT
-14 3.5 moveto 
1 -1 scale
(1.5) t 
GR
GR
GS
[0 -1 1 0 72.49999 108.49992] CT
0.149 GC
/Helvetica 11 F
GS
[1 0 0 1 0 0] CT
-3 -3 moveto 
1 -1 scale
(y) t 
GR
GR
GS
[1 0 0 1 177.50017 16.125] CT
/Helvetica-Bold 11 F
GS
[1 0 0 1 0 0] CT
-10 -3 moveto 
1 -1 scale
(n=3) t 
GR
GR
GS
1 LJ
2 LW
N
97.5 95.5 M
99.116 92.451 L
100.732 89.354 L
102.348 86.259 L
103.965 83.218 L
105.581 80.282 L
107.197 77.505 L
108.813 74.937 L
110.429 72.627 L
112.045 70.623 L
113.662 68.968 L
115.278 67.699 L
116.894 66.851 L
118.51 66.452 L
120.126 66.522 L
121.742 67.075 L
123.359 68.118 L
124.975 69.649 L
126.591 71.659 L
128.207 74.13 L
129.823 77.035 L
131.439 80.34 L
133.056 84.004 L
134.672 87.976 L
136.288 92.202 L
137.904 96.618 L
139.52 101.159 L
141.136 105.752 L
142.753 110.322 L
144.369 114.794 L
145.985 119.09 L
147.601 123.133 L
149.217 126.847 L
150.833 130.161 L
152.449 133.005 L
154.066 135.319 L
155.682 137.047 L
157.298 138.14 L
158.914 138.56 L
160.53 138.279 L
162.146 137.279 L
163.763 135.553 L
165.379 133.106 L
166.995 129.956 L
168.611 126.132 L
170.227 121.676 L
171.843 116.642 L
173.46 111.095 L
175.076 105.11 L
176.692 98.772 L
178.308 92.176 L
179.924 85.422 L
181.54 78.618 L
183.157 71.874 L
184.773 65.306 L
186.389 59.027 L
188.005 53.151 L
189.621 47.789 L
191.237 43.047 L
192.854 39.022 L
194.47 35.805 L
196.086 33.476 L
197.702 32.101 L
199.318 31.734 L
200.934 32.415 L
202.551 34.165 L
204.167 36.99 L
205.783 40.877 L
207.399 45.797 L
209.015 51.7 L
210.631 58.521 L
212.247 66.176 L
213.864 74.565 L
215.48 83.571 L
217.096 93.066 L
218.712 102.908 L
220.328 112.944 L
221.944 123.014 L
223.561 132.952 L
225.177 142.588 L
226.793 151.753 L
228.409 160.28 L
230.025 168.006 L
231.641 174.777 L
233.258 180.451 L
234.874 184.897 L
236.49 188.002 L
238.106 189.671 L
239.722 189.83 L
241.338 188.428 L
242.955 185.439 L
244.571 180.859 L
246.187 174.715 L
247.803 167.057 L
249.419 157.964 L
251.035 147.541 L
252.652 135.918 L
254.268 123.249 L
255.884 109.711 L
257.5 95.5 L
S
GR
GS
1 0 0 RC
[8 8] 0 setdash
2 LJ
2 LW
N
99.116 101.125 M
100.732 106.383 L
102.348 111.283 L
103.965 115.833 L
105.581 120.039 L
107.197 123.91 L
108.813 127.454 L
110.429 130.678 L
112.045 133.591 L
113.662 136.199 L
115.278 138.511 L
116.894 140.534 L
118.51 142.277 L
120.126 143.747 L
121.742 144.952 L
123.359 145.899 L
124.975 146.597 L
126.591 147.053 L
128.207 147.275 L
129.823 147.27 L
131.439 147.047 L
133.056 146.614 L
134.672 145.977 L
136.288 145.145 L
137.904 144.126 L
139.52 142.927 L
141.136 141.557 L
142.753 140.022 L
144.369 138.331 L
145.985 136.492 L
147.601 134.512 L
149.217 132.399 L
S
GR
GS
1 0 0 RC
[8 8] 0 setdash
2 LJ
2 LW
N
152.449 127.805 M
154.066 125.34 L
155.682 122.773 L
157.298 120.112 L
158.914 117.364 L
160.53 114.538 L
162.146 111.642 L
163.763 108.682 L
165.379 105.668 L
166.995 102.606 L
168.611 99.504 L
170.227 96.371 L
171.843 93.213 L
173.46 90.039 L
175.076 86.857 L
176.692 83.674 L
178.308 80.498 L
179.924 77.337 L
181.54 74.198 L
183.157 71.09 L
184.773 68.02 L
186.389 64.996 L
188.005 62.026 L
189.621 59.117 L
191.237 56.278 L
192.854 53.515 L
194.47 50.838 L
196.086 48.253 L
197.702 45.768 L
199.318 43.392 L
200.934 41.132 L
202.551 38.995 L
S
GR
GS
1 0 0 RC
[8 8] 0 setdash
2 LJ
2 LW
N
205.783 35.124 M
207.399 33.405 L
209.015 31.841 L
210.631 30.44 L
212.247 29.209 L
213.864 28.156 L
215.48 27.289 L
217.096 26.616 L
218.712 26.144 L
220.328 25.882 L
221.944 25.837 L
223.561 26.016 L
225.177 26.428 L
226.793 27.081 L
228.409 27.982 L
230.025 29.138 L
231.641 30.559 L
233.258 32.251 L
234.874 34.222 L
236.49 36.48 L
238.106 39.034 L
239.722 41.889 L
241.338 45.055 L
242.955 48.54 L
244.571 52.35 L
246.187 56.494 L
247.803 60.98 L
249.419 65.814 L
251.035 71.006 L
252.652 76.563 L
254.268 82.492 L
255.884 88.802 L
S
GR
GS
[1 0 0 1 97.5 95.5] CT
0 0.447 0.741 RC
10.0 ML
0.5 LW
N
2.5 -0.5 M
2.5 -2.157 1.157 -3.5 -0.5 -3.5 C
-2.157 -3.5 -3.5 -2.157 -3.5 -0.5 C
-3.5 1.157 -2.157 2.5 -0.5 2.5 C
1.157 2.5 2.5 1.157 2.5 -0.5 C
S
GR
GS
[1 0 0 1 150.83333 130.16058] CT
0 0.447 0.741 RC
10.0 ML
0.5 LW
N
2.5 -0.5 M
2.5 -2.157 1.157 -3.5 -0.5 -3.5 C
-2.157 -3.5 -3.5 -2.157 -3.5 -0.5 C
-3.5 1.157 -2.157 2.5 -0.5 2.5 C
1.157 2.5 2.5 1.157 2.5 -0.5 C
S
GR
GS
[1 0 0 1 204.16667 36.98974] CT
0 0.447 0.741 RC
10.0 ML
0.5 LW
N
2.5 -0.5 M
2.5 -2.157 1.157 -3.5 -0.5 -3.5 C
-2.157 -3.5 -3.5 -2.157 -3.5 -0.5 C
-3.5 1.157 -2.157 2.5 -0.5 2.5 C
1.157 2.5 2.5 1.157 2.5 -0.5 C
S
GR
GS
[1 0 0 1 257.5 95.5] CT
0 0.447 0.741 RC
10.0 ML
0.5 LW
N
2.5 -0.5 M
2.5 -2.157 1.157 -3.5 -0.5 -3.5 C
-2.157 -3.5 -3.5 -2.157 -3.5 -0.5 C
-3.5 1.157 -2.157 2.5 -0.5 2.5 C
1.157 2.5 2.5 1.157 2.5 -0.5 C
S
GR
GS
1 GC
N
308 199.5 M
468 199.5 L
468 17.5 L
308 17.5 L
cp
f
GR
GS
0.149 GC
2 setlinecap
1 LJ
0.5 LW
N
308 199.5 M
468 199.5 L
S
GR
GS
0.149 GC
2 setlinecap
1 LJ
0.5 LW
N
308 17.5 M
468 17.5 L
S
GR
GS
0.149 GC
2 setlinecap
1 LJ
0.5 LW
N
337.07 199.5 M
337.07 197.68 L
S
GR
GS
0.149 GC
2 setlinecap
1 LJ
0.5 LW
N
388 199.5 M
388 197.68 L
S
GR
GS
0.149 GC
2 setlinecap
1 LJ
0.5 LW
N
438.93 199.5 M
438.93 197.68 L
S
GR
GS
0.149 GC
2 setlinecap
1 LJ
0.5 LW
N
337.07 17.5 M
337.07 19.32 L
S
GR
GS
0.149 GC
2 setlinecap
1 LJ
0.5 LW
N
388 17.5 M
388 19.32 L
S
GR
GS
0.149 GC
2 setlinecap
1 LJ
0.5 LW
N
438.93 17.5 M
438.93 19.32 L
S
GR
GS
[1 0 0 1 337.0704 203.5] CT
0.149 GC
/Helvetica 10 F
GS
[1 0 0 1 0 0] CT
-5 10 moveto 
1 -1 scale
(-2) t 
GR
GR
GS
[1 0 0 1 388 203.5] CT
0.149 GC
/Helvetica 10 F
GS
[1 0 0 1 0 0] CT
-3 10 moveto 
1 -1 scale
(0) t 
GR
GR
GS
[1 0 0 1 438.9296 203.5] CT
0.149 GC
/Helvetica 10 F
GS
[1 0 0 1 0 0] CT
-3 10 moveto 
1 -1 scale
(2) t 
GR
GR
GS
[1 0 0 1 388.00009 217] CT
0.149 GC
/Helvetica 11 F
GS
[1 0 0 1 0 0] CT
-3 11 moveto 
1 -1 scale
(x) t 
GR
GR
GS
0.149 GC
2 setlinecap
1 LJ
0.5 LW
N
308 199.5 M
308 17.5 L
S
GR
GS
0.149 GC
2 setlinecap
1 LJ
0.5 LW
N
468 199.5 M
468 17.5 L
S
GR
GS
0.149 GC
2 setlinecap
1 LJ
0.5 LW
N
308 199.5 M
309.82 199.5 L
S
GR
GS
0.149 GC
2 setlinecap
1 LJ
0.5 LW
N
308 163.1 M
309.82 163.1 L
S
GR
GS
0.149 GC
2 setlinecap
1 LJ
0.5 LW
N
308 126.7 M
309.82 126.7 L
S
GR
GS
0.149 GC
2 setlinecap
1 LJ
0.5 LW
N
308 90.3 M
309.82 90.3 L
S
GR
GS
0.149 GC
2 setlinecap
1 LJ
0.5 LW
N
308 53.9 M
309.82 53.9 L
S
GR
GS
0.149 GC
2 setlinecap
1 LJ
0.5 LW
N
308 17.5 M
309.82 17.5 L
S
GR
GS
0.149 GC
2 setlinecap
1 LJ
0.5 LW
N
468 199.5 M
466.18 199.5 L
S
GR
GS
0.149 GC
2 setlinecap
1 LJ
0.5 LW
N
468 163.1 M
466.18 163.1 L
S
GR
GS
0.149 GC
2 setlinecap
1 LJ
0.5 LW
N
468 126.7 M
466.18 126.7 L
S
GR
GS
0.149 GC
2 setlinecap
1 LJ
0.5 LW
N
468 90.3 M
466.18 90.3 L
S
GR
GS
0.149 GC
2 setlinecap
1 LJ
0.5 LW
N
468 53.9 M
466.18 53.9 L
S
GR
GS
0.149 GC
2 setlinecap
1 LJ
0.5 LW
N
468 17.5 M
466.18 17.5 L
S
GR
GS
[1 0 0 1 304 199.5] CT
0.149 GC
/Helvetica 10 F
GS
[1 0 0 1 0 0] CT
-10 3.5 moveto 
1 -1 scale
(-3) t 
GR
GR
GS
[1 0 0 1 304 163.10001] CT
0.149 GC
/Helvetica 10 F
GS
[1 0 0 1 0 0] CT
-10 3.5 moveto 
1 -1 scale
(-2) t 
GR
GR
GS
[1 0 0 1 304 126.7] CT
0.149 GC
/Helvetica 10 F
GS
[1 0 0 1 0 0] CT
-10 3.5 moveto 
1 -1 scale
(-1) t 
GR
GR
GS
[1 0 0 1 304 90.3] CT
0.149 GC
/Helvetica 10 F
GS
[1 0 0 1 0 0] CT
-6 3.5 moveto 
1 -1 scale
(0) t 
GR
GR
GS
[1 0 0 1 304 53.9] CT
0.149 GC
/Helvetica 10 F
GS
[1 0 0 1 0 0] CT
-6 3.5 moveto 
1 -1 scale
(1) t 
GR
GR
GS
[1 0 0 1 304 17.5] CT
0.149 GC
/Helvetica 10 F
GS
[1 0 0 1 0 0] CT
-6 3.5 moveto 
1 -1 scale
(2) t 
GR
GR
GS
[0 -1 1 0 291.5 108.49992] CT
0.149 GC
/Helvetica 11 F
GS
[1 0 0 1 0 0] CT
-3 -3 moveto 
1 -1 scale
(y) t 
GR
GR
GS
[1 0 0 1 388.00037 16.125] CT
/Helvetica-Bold 11 F
GS
[1 0 0 1 0 0] CT
-10 -3 moveto 
1 -1 scale
(n=6) t 
GR
GR
GS
1 LJ
2 LW
N
308 90.3 M
309.616 88.165 L
311.232 85.998 L
312.848 83.831 L
314.465 81.702 L
316.081 79.648 L
317.697 77.703 L
319.313 75.906 L
320.929 74.289 L
322.545 72.886 L
324.162 71.727 L
325.778 70.839 L
327.394 70.246 L
329.01 69.966 L
330.626 70.015 L
332.242 70.402 L
333.859 71.133 L
335.475 72.204 L
337.091 73.611 L
338.707 75.341 L
340.323 77.374 L
341.939 79.688 L
343.556 82.253 L
345.172 85.033 L
346.788 87.991 L
348.404 91.083 L
350.02 94.261 L
351.636 97.476 L
353.253 100.676 L
354.869 103.806 L
356.485 106.813 L
358.101 109.643 L
359.717 112.243 L
361.333 114.562 L
362.949 116.554 L
364.566 118.173 L
366.182 119.383 L
367.798 120.148 L
369.414 120.442 L
371.03 120.245 L
372.646 119.545 L
374.263 118.337 L
375.879 116.624 L
377.495 114.419 L
379.111 111.742 L
380.727 108.623 L
382.343 105.099 L
383.96 101.216 L
385.576 97.027 L
387.192 92.59 L
388.808 87.973 L
390.424 83.245 L
392.04 78.482 L
393.657 73.762 L
395.273 69.164 L
396.889 64.769 L
398.505 60.656 L
400.121 56.903 L
401.737 53.583 L
403.354 50.765 L
404.97 48.513 L
406.586 46.883 L
408.202 45.921 L
409.818 45.664 L
411.434 46.141 L
413.051 47.366 L
414.667 49.343 L
416.283 52.064 L
417.899 55.508 L
419.515 59.64 L
421.131 64.415 L
422.747 69.773 L
424.364 75.645 L
425.98 81.95 L
427.596 88.596 L
429.212 95.486 L
430.828 102.511 L
432.444 109.56 L
434.061 116.516 L
435.677 123.262 L
437.293 129.677 L
438.909 135.646 L
440.525 141.054 L
442.141 145.794 L
443.758 149.766 L
445.374 152.878 L
446.99 155.051 L
448.606 156.219 L
450.222 156.331 L
451.838 155.35 L
453.455 153.257 L
455.071 150.051 L
456.687 145.75 L
458.303 140.39 L
459.919 134.025 L
461.535 126.729 L
463.152 118.593 L
464.768 109.724 L
466.384 100.247 L
468 90.3 L
S
GR
GS
1 0 0 RC
[8 8] 0 setdash
2 LJ
2 LW
N
309.616 85.802 M
311.232 81.632 L
312.848 77.842 L
314.465 74.476 L
316.081 71.565 L
317.697 69.132 L
319.313 67.19 L
320.929 65.744 L
322.545 64.792 L
324.162 64.325 L
325.778 64.329 L
327.394 64.782 L
329.01 65.66 L
330.626 66.934 L
332.242 68.57 L
333.859 70.534 L
335.475 72.786 L
337.091 75.286 L
338.707 77.994 L
340.323 80.866 L
341.939 83.859 L
343.556 86.93 L
345.172 90.036 L
346.788 93.136 L
348.404 96.188 L
350.02 99.152 L
351.636 101.992 L
353.253 104.67 L
354.869 107.153 L
356.485 109.411 L
358.101 111.415 L
359.717 113.139 L
S
GR
GS
1 0 0 RC
[8 8] 0 setdash
2 LJ
2 LW
N
362.949 115.666 M
364.566 116.433 L
366.182 116.854 L
367.798 116.919 L
369.414 116.624 L
371.03 115.969 L
372.646 114.956 L
374.263 113.592 L
375.879 111.889 L
377.495 109.86 L
379.111 107.523 L
380.727 104.9 L
382.343 102.016 L
383.96 98.899 L
385.576 95.58 L
387.192 92.094 L
388.808 88.478 L
390.424 84.771 L
392.04 81.015 L
393.657 77.254 L
395.273 73.533 L
396.889 69.9 L
398.505 66.401 L
400.121 63.087 L
401.737 60.006 L
403.354 57.205 L
404.97 54.735 L
406.586 52.641 L
408.202 50.97 L
409.818 49.765 L
411.434 49.067 L
413.051 48.915 L
S
GR
GS
1 0 0 RC
[8 8] 0 setdash
2 LJ
2 LW
N
416.283 50.381 M
417.899 52.054 L
419.515 54.384 L
421.131 57.382 L
422.747 61.057 L
424.364 65.408 L
425.98 70.426 L
427.596 76.094 L
429.212 82.383 L
430.828 89.256 L
432.444 96.664 L
434.061 104.545 L
435.677 112.823 L
437.293 121.411 L
438.909 130.204 L
440.525 139.084 L
442.141 147.914 L
443.758 156.54 L
445.374 164.789 L
446.99 172.47 L
448.606 179.369 L
450.222 185.25 L
451.838 189.856 L
453.455 192.905 L
455.071 194.09 L
456.687 193.076 L
458.303 189.502 L
459.919 182.979 L
461.535 173.086 L
463.152 159.373 L
464.768 141.355 L
466.384 118.515 L
S
GR
GS
[1 0 0 1 308 90.3] CT
0 0.447 0.741 RC
10.0 ML
0.5 LW
N
2.5 -0.5 M
2.5 -2.157 1.157 -3.5 -0.5 -3.5 C
-2.157 -3.5 -3.5 -2.157 -3.5 -0.5 C
-3.5 1.157 -2.157 2.5 -0.5 2.5 C
1.157 2.5 2.5 1.157 2.5 -0.5 C
S
GR
GS
[1 0 0 1 334.66666 71.62606] CT
0 0.447 0.741 RC
10.0 ML
0.5 LW
N
2.5 -0.5 M
2.5 -2.157 1.157 -3.5 -0.5 -3.5 C
-2.157 -3.5 -3.5 -2.157 -3.5 -0.5 C
-3.5 1.157 -2.157 2.5 -0.5 2.5 C
1.157 2.5 2.5 1.157 2.5 -0.5 C
S
GR
GS
[1 0 0 1 361.33334 114.56242] CT
0 0.447 0.741 RC
10.0 ML
0.5 LW
N
2.5 -0.5 M
2.5 -2.157 1.157 -3.5 -0.5 -3.5 C
-2.157 -3.5 -3.5 -2.157 -3.5 -0.5 C
-3.5 1.157 -2.157 2.5 -0.5 2.5 C
1.157 2.5 2.5 1.157 2.5 -0.5 C
S
GR
GS
[1 0 0 1 388 90.3] CT
0 0.447 0.741 RC
10.0 ML
0.5 LW
N
2.5 -0.5 M
2.5 -2.157 1.157 -3.5 -0.5 -3.5 C
-2.157 -3.5 -3.5 -2.157 -3.5 -0.5 C
-3.5 1.157 -2.157 2.5 -0.5 2.5 C
1.157 2.5 2.5 1.157 2.5 -0.5 C
S
GR
GS
[1 0 0 1 414.66666 49.34282] CT
0 0.447 0.741 RC
10.0 ML
0.5 LW
N
2.5 -0.5 M
2.5 -2.157 1.157 -3.5 -0.5 -3.5 C
-2.157 -3.5 -3.5 -2.157 -3.5 -0.5 C
-3.5 1.157 -2.157 2.5 -0.5 2.5 C
1.157 2.5 2.5 1.157 2.5 -0.5 C
S
GR
GS
[1 0 0 1 441.33334 143.51427] CT
0 0.447 0.741 RC
10.0 ML
0.5 LW
N
2.5 -0.5 M
2.5 -2.157 1.157 -3.5 -0.5 -3.5 C
-2.157 -3.5 -3.5 -2.157 -3.5 -0.5 C
-3.5 1.157 -2.157 2.5 -0.5 2.5 C
1.157 2.5 2.5 1.157 2.5 -0.5 C
S
GR
GS
[1 0 0 1 468 90.3] CT
0 0.447 0.741 RC
10.0 ML
0.5 LW
N
2.5 -0.5 M
2.5 -2.157 1.157 -3.5 -0.5 -3.5 C
-2.157 -3.5 -3.5 -2.157 -3.5 -0.5 C
-3.5 1.157 -2.157 2.5 -0.5 2.5 C
1.157 2.5 2.5 1.157 2.5 -0.5 C
S
GR
GS
1 GC
N
518.5 199.5 M
679 199.5 L
679 17.5 L
518.5 17.5 L
cp
f
GR
GS
0.149 GC
2 setlinecap
1 LJ
0.5 LW
N
518.5 199.5 M
679 199.5 L
S
GR
GS
0.149 GC
2 setlinecap
1 LJ
0.5 LW
N
518.5 17.5 M
679 17.5 L
S
GR
GS
0.149 GC
2 setlinecap
1 LJ
0.5 LW
N
547.661 199.5 M
547.661 197.68 L
S
GR
GS
0.149 GC
2 setlinecap
1 LJ
0.5 LW
N
598.75 199.5 M
598.75 197.68 L
S
GR
GS
0.149 GC
2 setlinecap
1 LJ
0.5 LW
N
649.839 199.5 M
649.839 197.68 L
S
GR
GS
0.149 GC
2 setlinecap
1 LJ
0.5 LW
N
547.661 17.5 M
547.661 19.32 L
S
GR
GS
0.149 GC
2 setlinecap
1 LJ
0.5 LW
N
598.75 17.5 M
598.75 19.32 L
S
GR
GS
0.149 GC
2 setlinecap
1 LJ
0.5 LW
N
649.839 17.5 M
649.839 19.32 L
S
GR
GS
[1 0 0 1 547.66125 203.5] CT
0.149 GC
/Helvetica 10 F
GS
[1 0 0 1 0 0] CT
-5 10 moveto 
1 -1 scale
(-2) t 
GR
GR
GS
[1 0 0 1 598.75 203.5] CT
0.149 GC
/Helvetica 10 F
GS
[1 0 0 1 0 0] CT
-3 10 moveto 
1 -1 scale
(0) t 
GR
GR
GS
[1 0 0 1 649.83875 203.5] CT
0.149 GC
/Helvetica 10 F
GS
[1 0 0 1 0 0] CT
-3 10 moveto 
1 -1 scale
(2) t 
GR
GR
GS
[1 0 0 1 598.75006 217] CT
0.149 GC
/Helvetica 11 F
GS
[1 0 0 1 0 0] CT
-3 11 moveto 
1 -1 scale
(x) t 
GR
GR
GS
0.149 GC
2 setlinecap
1 LJ
0.5 LW
N
518.5 199.5 M
518.5 17.5 L
S
GR
GS
0.149 GC
2 setlinecap
1 LJ
0.5 LW
N
679 199.5 M
679 17.5 L
S
GR
GS
0.149 GC
2 setlinecap
1 LJ
0.5 LW
N
518.5 199.5 M
520.32 199.5 L
S
GR
GS
0.149 GC
2 setlinecap
1 LJ
0.5 LW
N
518.5 173.5 M
520.32 173.5 L
S
GR
GS
0.149 GC
2 setlinecap
1 LJ
0.5 LW
N
518.5 147.5 M
520.32 147.5 L
S
GR
GS
0.149 GC
2 setlinecap
1 LJ
0.5 LW
N
518.5 121.5 M
520.32 121.5 L
S
GR
GS
0.149 GC
2 setlinecap
1 LJ
0.5 LW
N
518.5 95.5 M
520.32 95.5 L
S
GR
GS
0.149 GC
2 setlinecap
1 LJ
0.5 LW
N
518.5 69.5 M
520.32 69.5 L
S
GR
GS
0.149 GC
2 setlinecap
1 LJ
0.5 LW
N
518.5 43.5 M
520.32 43.5 L
S
GR
GS
0.149 GC
2 setlinecap
1 LJ
0.5 LW
N
518.5 17.5 M
520.32 17.5 L
S
GR
GS
0.149 GC
2 setlinecap
1 LJ
0.5 LW
N
679 199.5 M
677.18 199.5 L
S
GR
GS
0.149 GC
2 setlinecap
1 LJ
0.5 LW
N
679 173.5 M
677.18 173.5 L
S
GR
GS
0.149 GC
2 setlinecap
1 LJ
0.5 LW
N
679 147.5 M
677.18 147.5 L
S
GR
GS
0.149 GC
2 setlinecap
1 LJ
0.5 LW
N
679 121.5 M
677.18 121.5 L
S
GR
GS
0.149 GC
2 setlinecap
1 LJ
0.5 LW
N
679 95.5 M
677.18 95.5 L
S
GR
GS
0.149 GC
2 setlinecap
1 LJ
0.5 LW
N
679 69.5 M
677.18 69.5 L
S
GR
GS
0.149 GC
2 setlinecap
1 LJ
0.5 LW
N
679 43.5 M
677.18 43.5 L
S
GR
GS
0.149 GC
2 setlinecap
1 LJ
0.5 LW
N
679 17.5 M
677.18 17.5 L
S
GR
GS
[1 0 0 1 514.5 199.5] CT
0.149 GC
/Helvetica 10 F
GS
[1 0 0 1 0 0] CT
-10 3.5 moveto 
1 -1 scale
(-2) t 
GR
GR
GS
[1 0 0 1 514.5 173.5] CT
0.149 GC
/Helvetica 10 F
GS
[1 0 0 1 0 0] CT
-18 3.5 moveto 
1 -1 scale
(-1.5) t 
GR
GR
GS
[1 0 0 1 514.5 147.5] CT
0.149 GC
/Helvetica 10 F
GS
[1 0 0 1 0 0] CT
-10 3.5 moveto 
1 -1 scale
(-1) t 
GR
GR
GS
[1 0 0 1 514.5 121.5] CT
0.149 GC
/Helvetica 10 F
GS
[1 0 0 1 0 0] CT
-18 3.5 moveto 
1 -1 scale
(-0.5) t 
GR
GR
GS
[1 0 0 1 514.5 95.5] CT
0.149 GC
/Helvetica 10 F
GS
[1 0 0 1 0 0] CT
-6 3.5 moveto 
1 -1 scale
(0) t 
GR
GR
GS
[1 0 0 1 514.5 69.5] CT
0.149 GC
/Helvetica 10 F
GS
[1 0 0 1 0 0] CT
-14 3.5 moveto 
1 -1 scale
(0.5) t 
GR
GR
GS
[1 0 0 1 514.5 43.5] CT
0.149 GC
/Helvetica 10 F
GS
[1 0 0 1 0 0] CT
-6 3.5 moveto 
1 -1 scale
(1) t 
GR
GR
GS
[1 0 0 1 514.5 17.5] CT
0.149 GC
/Helvetica 10 F
GS
[1 0 0 1 0 0] CT
-14 3.5 moveto 
1 -1 scale
(1.5) t 
GR
GR
GS
[0 -1 1 0 493.5 108.49992] CT
0.149 GC
/Helvetica 11 F
GS
[1 0 0 1 0 0] CT
-3 -3 moveto 
1 -1 scale
(y) t 
GR
GR
GS
[1 0 0 1 598.75055 16.125] CT
/Helvetica-Bold 11 F
GS
[1 0 0 1 0 0] CT
-13 -3 moveto 
1 -1 scale
(n=12) t 
GR
GR
GS
1 LJ
2 LW
N
518.5 95.5 M
520.121 92.451 L
521.742 89.354 L
523.364 86.259 L
524.985 83.218 L
526.606 80.282 L
528.227 77.505 L
529.849 74.937 L
531.47 72.627 L
533.091 70.623 L
534.712 68.968 L
536.333 67.699 L
537.955 66.851 L
539.576 66.452 L
541.197 66.522 L
542.818 67.075 L
544.439 68.118 L
546.061 69.649 L
547.682 71.659 L
549.303 74.13 L
550.924 77.035 L
552.545 80.34 L
554.167 84.004 L
555.788 87.976 L
557.409 92.202 L
559.03 96.618 L
560.651 101.159 L
562.273 105.752 L
563.894 110.322 L
565.515 114.794 L
567.136 119.09 L
568.758 123.133 L
570.379 126.847 L
572 130.161 L
573.621 133.005 L
575.242 135.319 L
576.864 137.047 L
578.485 138.14 L
580.106 138.56 L
581.727 138.279 L
583.349 137.279 L
584.97 135.553 L
586.591 133.106 L
588.212 129.956 L
589.833 126.132 L
591.455 121.676 L
593.076 116.642 L
594.697 111.095 L
596.318 105.11 L
597.939 98.772 L
599.561 92.176 L
601.182 85.422 L
602.803 78.618 L
604.424 71.874 L
606.045 65.306 L
607.667 59.027 L
609.288 53.151 L
610.909 47.789 L
612.53 43.047 L
614.151 39.022 L
615.773 35.805 L
617.394 33.476 L
619.015 32.101 L
620.636 31.734 L
622.258 32.415 L
623.879 34.165 L
625.5 36.99 L
627.121 40.877 L
628.742 45.797 L
630.364 51.7 L
631.985 58.521 L
633.606 66.176 L
635.227 74.565 L
636.849 83.571 L
638.47 93.066 L
640.091 102.908 L
641.712 112.944 L
643.333 123.014 L
644.955 132.952 L
646.576 142.588 L
648.197 151.753 L
649.818 160.28 L
651.439 168.006 L
653.061 174.777 L
654.682 180.451 L
656.303 184.897 L
657.924 188.002 L
659.545 189.671 L
661.167 189.83 L
662.788 188.428 L
664.409 185.439 L
666.03 180.859 L
667.651 174.715 L
669.273 167.057 L
670.894 157.964 L
672.515 147.541 L
674.136 135.918 L
675.758 123.249 L
677.379 109.711 L
679 95.5 L
S
GR
GS
1 0 0 RC
[8 8] 0 setdash
2 LJ
2 LW
N
520.121 92.328 M
521.742 89.194 L
523.364 86.109 L
524.985 83.099 L
526.606 80.2 L
528.227 77.456 L
529.849 74.915 L
531.47 72.624 L
533.091 70.631 L
534.712 68.981 L
536.333 67.714 L
537.955 66.865 L
539.576 66.462 L
541.197 66.528 L
542.818 67.079 L
544.439 68.119 L
546.061 69.648 L
547.682 71.657 L
549.303 74.127 L
550.924 77.032 L
552.545 80.338 L
554.167 84.002 L
555.788 87.975 L
557.409 92.202 L
559.03 96.619 L
560.651 101.159 L
562.273 105.752 L
563.894 110.323 L
565.515 114.795 L
567.136 119.091 L
568.758 123.133 L
570.379 126.847 L
S
GR
GS
1 0 0 RC
[8 8] 0 setdash
2 LJ
2 LW
N
573.621 133.005 M
575.242 135.319 L
576.864 137.046 L
578.485 138.14 L
580.106 138.56 L
581.727 138.279 L
583.349 137.279 L
584.97 135.553 L
586.591 133.106 L
588.212 129.956 L
589.833 126.132 L
591.455 121.676 L
593.076 116.642 L
594.697 111.095 L
596.318 105.11 L
597.939 98.772 L
599.561 92.176 L
601.182 85.422 L
602.803 78.618 L
604.424 71.875 L
606.045 65.306 L
607.667 59.027 L
609.288 53.152 L
610.909 47.789 L
612.53 43.046 L
614.151 39.022 L
615.773 35.805 L
617.394 33.475 L
619.015 32.1 L
620.636 31.734 L
622.258 32.415 L
623.879 34.165 L
S
GR
GS
1 0 0 RC
[8 8] 0 setdash
2 LJ
2 LW
N
627.121 40.877 M
628.742 45.797 L
630.364 51.701 L
631.985 58.522 L
633.606 66.177 L
635.227 74.566 L
636.849 83.572 L
638.47 93.066 L
640.091 102.907 L
641.712 112.942 L
643.333 123.011 L
644.955 132.948 L
646.576 142.583 L
648.197 151.748 L
649.818 160.276 L
651.439 168.005 L
653.061 174.779 L
654.682 180.458 L
656.303 184.909 L
657.924 188.02 L
659.545 189.695 L
661.167 189.857 L
662.788 188.452 L
664.409 185.453 L
666.03 180.853 L
667.651 174.676 L
669.273 166.972 L
670.894 157.822 L
672.515 147.338 L
674.136 135.663 L
675.758 122.978 L
677.379 109.502 L
S
GR
GS
[1 0 0 1 518.5 95.5] CT
0 0.447 0.741 RC
10.0 ML
0.5 LW
N
2.5 -0.5 M
2.5 -2.157 1.157 -3.5 -0.5 -3.5 C
-2.157 -3.5 -3.5 -2.157 -3.5 -0.5 C
-3.5 1.157 -2.157 2.5 -0.5 2.5 C
1.157 2.5 2.5 1.157 2.5 -0.5 C
S
GR
GS
[1 0 0 1 531.875 72.09606] CT
0 0.447 0.741 RC
10.0 ML
0.5 LW
N
2.5 -0.5 M
2.5 -2.157 1.157 -3.5 -0.5 -3.5 C
-2.157 -3.5 -3.5 -2.157 -3.5 -0.5 C
-3.5 1.157 -2.157 2.5 -0.5 2.5 C
1.157 2.5 2.5 1.157 2.5 -0.5 C
S
GR
GS
[1 0 0 1 545.25 68.82294] CT
0 0.447 0.741 RC
10.0 ML
0.5 LW
N
2.5 -0.5 M
2.5 -2.157 1.157 -3.5 -0.5 -3.5 C
-2.157 -3.5 -3.5 -2.157 -3.5 -0.5 C
-3.5 1.157 -2.157 2.5 -0.5 2.5 C
1.157 2.5 2.5 1.157 2.5 -0.5 C
S
GR
GS
[1 0 0 1 558.625 95.5] CT
0 0.447 0.741 RC
10.0 ML
0.5 LW
N
2.5 -0.5 M
2.5 -2.157 1.157 -3.5 -0.5 -3.5 C
-2.157 -3.5 -3.5 -2.157 -3.5 -0.5 C
-3.5 1.157 -2.157 2.5 -0.5 2.5 C
1.157 2.5 2.5 1.157 2.5 -0.5 C
S
GR
GS
[1 0 0 1 572 130.16058] CT
0 0.447 0.741 RC
10.0 ML
0.5 LW
N
2.5 -0.5 M
2.5 -2.157 1.157 -3.5 -0.5 -3.5 C
-2.157 -3.5 -3.5 -2.157 -3.5 -0.5 C
-3.5 1.157 -2.157 2.5 -0.5 2.5 C
1.157 2.5 2.5 1.157 2.5 -0.5 C
S
GR
GS
[1 0 0 1 585.375 135.008] CT
0 0.447 0.741 RC
10.0 ML
0.5 LW
N
2.5 -0.5 M
2.5 -2.157 1.157 -3.5 -0.5 -3.5 C
-2.157 -3.5 -3.5 -2.157 -3.5 -0.5 C
-3.5 1.157 -2.157 2.5 -0.5 2.5 C
1.157 2.5 2.5 1.157 2.5 -0.5 C
S
GR
GS
[1 0 0 1 598.75 95.5] CT
0 0.447 0.741 RC
10.0 ML
0.5 LW
N
2.5 -0.5 M
2.5 -2.157 1.157 -3.5 -0.5 -3.5 C
-2.157 -3.5 -3.5 -2.157 -3.5 -0.5 C
-3.5 1.157 -2.157 2.5 -0.5 2.5 C
1.157 2.5 2.5 1.157 2.5 -0.5 C
S
GR
GS
[1 0 0 1 612.125 44.16861] CT
0 0.447 0.741 RC
10.0 ML
0.5 LW
N
2.5 -0.5 M
2.5 -2.157 1.157 -3.5 -0.5 -3.5 C
-2.157 -3.5 -3.5 -2.157 -3.5 -0.5 C
-3.5 1.157 -2.157 2.5 -0.5 2.5 C
1.157 2.5 2.5 1.157 2.5 -0.5 C
S
GR
GS
[1 0 0 1 625.5 36.98974] CT
0 0.447 0.741 RC
10.0 ML
0.5 LW
N
2.5 -0.5 M
2.5 -2.157 1.157 -3.5 -0.5 -3.5 C
-2.157 -3.5 -3.5 -2.157 -3.5 -0.5 C
-3.5 1.157 -2.157 2.5 -0.5 2.5 C
1.157 2.5 2.5 1.157 2.5 -0.5 C
S
GR
GS
[1 0 0 1 638.875 95.5] CT
0 0.447 0.741 RC
10.0 ML
0.5 LW
N
2.5 -0.5 M
2.5 -2.157 1.157 -3.5 -0.5 -3.5 C
-2.157 -3.5 -3.5 -2.157 -3.5 -0.5 C
-3.5 1.157 -2.157 2.5 -0.5 2.5 C
1.157 2.5 2.5 1.157 2.5 -0.5 C
S
GR
GS
[1 0 0 1 652.25 171.52039] CT
0 0.447 0.741 RC
10.0 ML
0.5 LW
N
2.5 -0.5 M
2.5 -2.157 1.157 -3.5 -0.5 -3.5 C
-2.157 -3.5 -3.5 -2.157 -3.5 -0.5 C
-3.5 1.157 -2.157 2.5 -0.5 2.5 C
1.157 2.5 2.5 1.157 2.5 -0.5 C
S
GR
GS
[1 0 0 1 665.625 182.15208] CT
0 0.447 0.741 RC
10.0 ML
0.5 LW
N
2.5 -0.5 M
2.5 -2.157 1.157 -3.5 -0.5 -3.5 C
-2.157 -3.5 -3.5 -2.157 -3.5 -0.5 C
-3.5 1.157 -2.157 2.5 -0.5 2.5 C
1.157 2.5 2.5 1.157 2.5 -0.5 C
S
GR
GS
[1 0 0 1 679 95.5] CT
0 0.447 0.741 RC
10.0 ML
0.5 LW
N
2.5 -0.5 M
2.5 -2.157 1.157 -3.5 -0.5 -3.5 C
-2.157 -3.5 -3.5 -2.157 -3.5 -0.5 C
-3.5 1.157 -2.157 2.5 -0.5 2.5 C
1.157 2.5 2.5 1.157 2.5 -0.5 C
S
GR
%%Trailer
%%Pages: 1
%%EOF
