%!PS-Adobe-3.0 EPSF-3.0
%%Creator: MATLAB, The Mathworks, Inc. Version 7.8.0.347 (R2009a). Operating System: Microsoft Windows Vista.
%%Title: C:\Users\felix\Documents\analyse_numerique\analyse_numerique_2010_11\tp\tp4_asteroid.eps
%%CreationDate: 11/02/2010  11:47:46
%%DocumentNeededFonts: Helvetica
%%DocumentProcessColors: Cyan Magenta Yellow Black
%%LanguageLevel: 2
%%Pages: 1
%%BoundingBox:    96   238   515   553
%%EndComments

%%BeginProlog
% MathWorks dictionary
/MathWorks 160 dict begin
% definition operators
/bdef {bind def} bind def
/ldef {load def} bind def
/xdef {exch def} bdef
/xstore {exch store} bdef
% operator abbreviations
/c  /clip ldef
/cc /concat ldef
/cp /closepath ldef
/gr /grestore ldef
/gs /gsave ldef
/mt /moveto ldef
/np /newpath ldef
/cm /currentmatrix ldef
/sm /setmatrix ldef
/rm /rmoveto ldef
/rl /rlineto ldef
/s {show newpath} bdef
/sc {setcmykcolor} bdef
/sr /setrgbcolor ldef
/sg /setgray ldef
/w /setlinewidth ldef
/j /setlinejoin ldef
/cap /setlinecap ldef
/rc {rectclip} bdef
/rf {rectfill} bdef
% page state control
/pgsv () def
/bpage {/pgsv save def} bdef
/epage {pgsv restore} bdef
/bplot /gsave ldef
/eplot {stroke grestore} bdef
% orientation switch
/portraitMode 0 def /landscapeMode 1 def /rotateMode 2 def
% coordinate system mappings
/dpi2point 0 def
% font control
/FontSize 0 def
/FMS {/FontSize xstore findfont [FontSize 0 0 FontSize neg 0 0]
  makefont setfont} bdef
/ISOLatin1Encoding where {pop /WindowsLatin1Encoding 256 array bdef
ISOLatin1Encoding WindowsLatin1Encoding copy pop
/.notdef/.notdef/quotesinglbase/florin/quotedblbase/ellipsis/dagger
/daggerdbl/circumflex/perthousand/Scaron/guilsinglleft/OE/.notdef/.notdef
/.notdef/.notdef/quoteleft/quoteright/quotedblleft/quotedblright/bullet
/endash/emdash/tilde/trademark/scaron/guilsinglright/oe/.notdef/.notdef
/Ydieresis WindowsLatin1Encoding 128 32 getinterval astore pop}
{/WindowsLatin1Encoding StandardEncoding bdef} ifelse
/reencode {exch dup where {pop load} {pop StandardEncoding} ifelse
  exch dup 3 1 roll findfont dup length dict begin
  { 1 index /FID ne {def}{pop pop} ifelse } forall
  /Encoding exch def currentdict end definefont pop} bdef
/isroman {findfont /CharStrings get /Agrave known} bdef
/FMSR {3 1 roll 1 index dup isroman {reencode} {pop pop} ifelse
  exch FMS} bdef
/csm {1 dpi2point div -1 dpi2point div scale neg translate
 dup landscapeMode eq {pop -90 rotate}
  {rotateMode eq {90 rotate} if} ifelse} bdef
% line types: solid, dotted, dashed, dotdash
/SO { [] 0 setdash } bdef
/DO { [.5 dpi2point mul 4 dpi2point mul] 0 setdash } bdef
/DA { [6 dpi2point mul] 0 setdash } bdef
/DD { [.5 dpi2point mul 4 dpi2point mul 6 dpi2point mul 4
  dpi2point mul] 0 setdash } bdef
% macros for lines and objects
/L {lineto stroke} bdef
/MP {3 1 roll moveto 1 sub {rlineto} repeat} bdef
/AP {{rlineto} repeat} bdef
/PDlw -1 def
/W {/PDlw currentlinewidth def setlinewidth} def
/PP {closepath eofill} bdef
/DP {closepath stroke} bdef
/MR {4 -2 roll moveto dup  0 exch rlineto exch 0 rlineto
  neg 0 exch rlineto closepath} bdef
/FR {MR stroke} bdef
/PR {MR fill} bdef
/L1i {{currentfile picstr readhexstring pop} image} bdef
/tMatrix matrix def
/MakeOval {newpath tMatrix currentmatrix pop translate scale
0 0 1 0 360 arc tMatrix setmatrix} bdef
/FO {MakeOval stroke} bdef
/PO {MakeOval fill} bdef
/PD {currentlinewidth 2 div 0 360 arc fill
   PDlw -1 eq not {PDlw w /PDlw -1 def} if} def
/FA {newpath tMatrix currentmatrix pop translate scale
  0 0 1 5 -2 roll arc tMatrix setmatrix stroke} bdef
/PA {newpath tMatrix currentmatrix pop	translate 0 0 moveto scale
  0 0 1 5 -2 roll arc closepath tMatrix setmatrix fill} bdef
/FAn {newpath tMatrix currentmatrix pop translate scale
  0 0 1 5 -2 roll arcn tMatrix setmatrix stroke} bdef
/PAn {newpath tMatrix currentmatrix pop translate 0 0 moveto scale
  0 0 1 5 -2 roll arcn closepath tMatrix setmatrix fill} bdef
/vradius 0 def /hradius 0 def /lry 0 def
/lrx 0 def /uly 0 def /ulx 0 def /rad 0 def
/MRR {/vradius xdef /hradius xdef /lry xdef /lrx xdef /uly xdef
  /ulx xdef newpath tMatrix currentmatrix pop ulx hradius add uly
  vradius add translate hradius vradius scale 0 0 1 180 270 arc 
  tMatrix setmatrix lrx hradius sub uly vradius add translate
  hradius vradius scale 0 0 1 270 360 arc tMatrix setmatrix
  lrx hradius sub lry vradius sub translate hradius vradius scale
  0 0 1 0 90 arc tMatrix setmatrix ulx hradius add lry vradius sub
  translate hradius vradius scale 0 0 1 90 180 arc tMatrix setmatrix
  closepath} bdef
/FRR {MRR stroke } bdef
/PRR {MRR fill } bdef
/MlrRR {/lry xdef /lrx xdef /uly xdef /ulx xdef /rad lry uly sub 2 div def
  newpath tMatrix currentmatrix pop ulx rad add uly rad add translate
  rad rad scale 0 0 1 90 270 arc tMatrix setmatrix lrx rad sub lry rad
  sub translate rad rad scale 0 0 1 270 90 arc tMatrix setmatrix
  closepath} bdef
/FlrRR {MlrRR stroke } bdef
/PlrRR {MlrRR fill } bdef
/MtbRR {/lry xdef /lrx xdef /uly xdef /ulx xdef /rad lrx ulx sub 2 div def
  newpath tMatrix currentmatrix pop ulx rad add uly rad add translate
  rad rad scale 0 0 1 180 360 arc tMatrix setmatrix lrx rad sub lry rad
  sub translate rad rad scale 0 0 1 0 180 arc tMatrix setmatrix
  closepath} bdef
/FtbRR {MtbRR stroke } bdef
/PtbRR {MtbRR fill } bdef
/stri 6 array def /dtri 6 array def
/smat 6 array def /dmat 6 array def
/tmat1 6 array def /tmat2 6 array def /dif 3 array def
/asub {/ind2 exch def /ind1 exch def dup dup
  ind1 get exch ind2 get sub exch } bdef
/tri_to_matrix {
  2 0 asub 3 1 asub 4 0 asub 5 1 asub
  dup 0 get exch 1 get 7 -1 roll astore } bdef
/compute_transform {
  dmat dtri tri_to_matrix tmat1 invertmatrix 
  smat stri tri_to_matrix tmat2 concatmatrix } bdef
/ds {stri astore pop} bdef
/dt {dtri astore pop} bdef
/db {2 copy /cols xdef /rows xdef mul dup 3 mul string
  currentfile 
  3 index 0 eq {/ASCIIHexDecode filter}
  {/ASCII85Decode filter 3 index 2 eq {/RunLengthDecode filter} if }
  ifelse exch readstring pop
  dup 0 3 index getinterval /rbmap xdef
  dup 2 index dup getinterval /gbmap xdef
  1 index dup 2 mul exch getinterval /bbmap xdef pop pop}bdef
/it {gs np dtri aload pop moveto lineto lineto cp c
  cols rows 8 compute_transform 
  rbmap gbmap bbmap true 3 colorimage gr}bdef
/il {newpath moveto lineto stroke}bdef
currentdict end def
%%EndProlog

%%BeginSetup
MathWorks begin

0 cap

end
%%EndSetup

%%Page: 1 1
%%BeginPageSetup
%%PageBoundingBox:    96   238   515   553
MathWorks begin
bpage
%%EndPageSetup

%%BeginObject: obj1
bplot

/dpi2point 12 def
portraitMode 1152 6636 csm

    0     0  5039  3780 rc
85 dict begin %Colortable dictionary
/c0 { 0.000000 0.000000 0.000000 sr} bdef
/c1 { 1.000000 1.000000 1.000000 sr} bdef
/c2 { 0.900000 0.000000 0.000000 sr} bdef
/c3 { 0.000000 0.820000 0.000000 sr} bdef
/c4 { 0.000000 0.000000 0.800000 sr} bdef
/c5 { 0.910000 0.820000 0.320000 sr} bdef
/c6 { 1.000000 0.260000 0.820000 sr} bdef
/c7 { 0.000000 0.820000 0.820000 sr} bdef
c0
1 j
1 sg
   0    0 5040 3781 rf
6 w
0 3081 3905 0 0 -3081 655 3364 4 MP
PP
-3905 0 0 3081 3905 0 0 -3081 655 3364 5 MP stroke
gs 655 283 3906 3082 rc
0 sg
 655 1408 mt  677 1392 L
 677 1392 mt  694 1380 L
 694 1380 mt  721 1361 L
 721 1361 mt  733 1353 L
 733 1353 mt  766 1330 L
 766 1330 mt  772 1327 L
 772 1327 mt  811 1301 L
 811 1301 mt  814 1299 L
 814 1299 mt  850 1277 L
 850 1277 mt  863 1268 L
 863 1268 mt  889 1253 L
 889 1253 mt  915 1238 L
 915 1238 mt  928 1230 L
 928 1230 mt  967 1208 L
 967 1208 mt  969 1207 L
 969 1207 mt 1006 1186 L
1006 1186 mt 1025 1176 L
1025 1176 mt 1045 1166 L
1045 1166 mt 1084 1145 L
1084 1145 mt 1084 1145 L
1084 1145 mt 1123 1126 L
1123 1126 mt 1146 1114 L
1146 1114 mt 1162 1107 L
1162 1107 mt 1201 1088 L
1201 1088 mt 1211 1084 L
1211 1084 mt 1240 1070 L
1240 1070 mt 1279 1053 L
1279 1053 mt 1280 1053 L
1280 1053 mt 1318 1036 L
1318 1036 mt 1353 1022 L
1353 1022 mt 1357 1020 L
1357 1020 mt 1396 1004 L
1396 1004 mt 1429  991 L
1429  991 mt 1435  989 L
1435  989 mt 1475  974 L
1475  974 mt 1511  960 L
1511  960 mt 1514  959 L
1514  959 mt 1553  946 L
1553  946 mt 1592  932 L
1592  932 mt 1599  930 L
1599  930 mt 1631  919 L
1631  919 mt 1670  906 L
1670  906 mt 1693  899 L
1693  899 mt 1709  894 L
1709  894 mt 1748  882 L
1748  882 mt 1787  870 L
1787  870 mt 1795  868 L
1795  868 mt 1826  859 L
1826  859 mt 1865  848 L
1865  848 mt 1904  838 L
1904  838 mt 1906  837 L
1906  837 mt 1943  828 L
1943  828 mt 1982  818 L
1982  818 mt 2021  808 L
2021  808 mt 2030  806 L
2030  806 mt 2060  799 L
2060  799 mt 2099  791 L
2099  791 mt 2138  782 L
2138  782 mt 2170  775 L
2170  775 mt 2177  774 L
2177  774 mt 2217  766 L
2217  766 mt 2256  759 L
2256  759 mt 2295  751 L
2295  751 mt 2332  745 L
2332  745 mt 2334  744 L
2334  744 mt 2373  738 L
2373  738 mt 2412  731 L
2412  731 mt 2451  725 L
2451  725 mt 2490  719 L
2490  719 mt 2529  714 L
2529  714 mt 2529  714 L
2529  714 mt 2568  709 L
2568  709 mt 2607  704 L
2607  704 mt 2646  699 L
2646  699 mt 2685  694 L
2685  694 mt 2724  690 L
2724  690 mt 2763  686 L
2763  686 mt 2797  683 L
2797  683 mt 2802  683 L
2802  683 mt 2841  679 L
2841  679 mt 2880  676 L
2880  676 mt 2919  673 L
2919  673 mt 2958  670 L
2958  670 mt 2998  668 L
2998  668 mt 3037  665 L
3037  665 mt 3076  663 L
3076  663 mt 3115  662 L
3115  662 mt 3154  660 L
3154  660 mt 3193  659 L
3193  659 mt 3232  658 L
3232  658 mt 3271  657 L
3271  657 mt 3310  656 L
3310  656 mt 3349  656 L
3349  656 mt 3388  656 L
3388  656 mt 3427  656 L
3427  656 mt 3466  656 L
3466  656 mt 3505  656 L
3505  656 mt 3544  657 L
3544  657 mt 3583  658 L
3583  658 mt 3622  659 L
3622  659 mt 3661  660 L
3661  660 mt 3700  662 L
3700  662 mt 3739  663 L
3739  663 mt 3779  665 L
3779  665 mt 3818  667 L
3818  667 mt 3857  670 L
3857  670 mt 3896  672 L
3896  672 mt 3935  675 L
3935  675 mt 3974  678 L
3974  678 mt 4013  681 L
4013  681 mt 4038  683 L
4038  683 mt 4052  684 L
4052  684 mt 4091  688 L
4091  688 mt 4130  691 L
4130  691 mt 4169  695 L
4169  695 mt 4208  699 L
4208  699 mt 4247  704 L
4247  704 mt 4286  708 L
4286  708 mt 4325  713 L
4325  713 mt 4332  714 L
4332  714 mt 4364  718 L
4364  718 mt 4403  723 L
4403  723 mt 4442  728 L
4442  728 mt 4481  734 L
4481  734 mt 4520  739 L
4520  739 mt 4556  745 L
4556  745 mt 4560  745 L
gr

0 sg
/c8 { 1.000000 0.000000 0.000000 sr} bdef
c8
 814 1277 mt  886 1277 L
 850 1241 mt  850 1313 L
1141 1100 mt 1213 1100 L
1177 1064 mt 1177 1136 L
1503  950 mt 1575  950 L
1539  914 mt 1539  986 L
1902  828 mt 1974  828 L
1938  792 mt 1938  864 L
2339  737 mt 2411  737 L
2375  701 mt 2375  773 L
2817  679 mt 2889  679 L
2853  643 mt 2853  715 L
3341  656 mt 3413  656 L
3377  620 mt 3377  692 L
3916  675 mt 3988  675 L
3952  639 mt 3952  711 L
4494  741 mt 4566  741 L
4530  705 mt 4530  777 L
 825 1252 mt  875 1302 L
 875 1252 mt  825 1302 L
1152 1075 mt 1202 1125 L
1202 1075 mt 1152 1125 L
1514  925 mt 1564  975 L
1564  925 mt 1514  975 L
1913  803 mt 1963  853 L
1963  803 mt 1913  853 L
2350  712 mt 2400  762 L
2400  712 mt 2350  762 L
2828  654 mt 2878  704 L
2878  654 mt 2828  704 L
3352  631 mt 3402  681 L
3402  631 mt 3352  681 L
3927  650 mt 3977  700 L
3977  650 mt 3927  700 L
4505  716 mt 4555  766 L
4555  716 mt 4505  766 L
gs 655 283 3906 3082 rc
gr

4 w
DO
SO
6 w
0 sg
 655  283 mt 4560  283 L
 655 3364 mt 4560 3364 L
4560 3364 mt 4560  283 L
 655 3364 mt  655  283 L
 655 3364 mt 4560 3364 L
 655 3364 mt  655  283 L
 655 3364 mt  655 3324 L
 655  283 mt  655  322 L
%%IncludeResource: font Helvetica
/Helvetica /WindowsLatin1Encoding 120 FMSR

 552 3509 mt 
(-1) s
1435 3364 mt 1435 3324 L
1435  283 mt 1435  322 L
1282 3509 mt 
(-0.8) s
2217 3364 mt 2217 3324 L
2217  283 mt 2217  322 L
2064 3509 mt 
(-0.6) s
2998 3364 mt 2998 3324 L
2998  283 mt 2998  322 L
2845 3509 mt 
(-0.4) s
3779 3364 mt 3779 3324 L
3779  283 mt 3779  322 L
3626 3509 mt 
(-0.2) s
4560 3364 mt 4560 3324 L
4560  283 mt 4560  322 L
4527 3509 mt 
(0) s
 655 3364 mt  694 3364 L
4560 3364 mt 4520 3364 L
 484 3408 mt 
(-1) s
 655 3055 mt  694 3055 L
4560 3055 mt 4520 3055 L
 384 3099 mt 
(-0.9) s
 655 2747 mt  694 2747 L
4560 2747 mt 4520 2747 L
 384 2791 mt 
(-0.8) s
 655 2439 mt  694 2439 L
4560 2439 mt 4520 2439 L
 384 2483 mt 
(-0.7) s
 655 2131 mt  694 2131 L
4560 2131 mt 4520 2131 L
 384 2175 mt 
(-0.6) s
 655 1823 mt  694 1823 L
4560 1823 mt 4520 1823 L
 384 1867 mt 
(-0.5) s
 655 1515 mt  694 1515 L
4560 1515 mt 4520 1515 L
 384 1559 mt 
(-0.4) s
 655 1207 mt  694 1207 L
4560 1207 mt 4520 1207 L
 384 1251 mt 
(-0.3) s
 655  899 mt  694  899 L
4560  899 mt 4520  899 L
 384  943 mt 
(-0.2) s
 655  591 mt  694  591 L
4560  591 mt 4520  591 L
 384  635 mt 
(-0.1) s
 655  283 mt  694  283 L
4560  283 mt 4520  283 L
 554  327 mt 
(0) s
 655  283 mt 4560  283 L
 655 3364 mt 4560 3364 L
4560 3364 mt 4560  283 L
 655 3364 mt  655  283 L

end %%Color Dict

eplot
%%EndObject

epage
end

showpage

%%Trailer
%%EOF
