%!PS-Adobe-3.0 EPSF-3.0
%%Creator: (MATLAB, The Mathworks, Inc. Version 9.2.0.538062 \(R2017a\). Operating System: Linux)
%%Title: /home/pk/Desktop/10/Ex1_fig2_h_080.eps
%%CreationDate: 2019-04-11T13:55:29
%%Pages: (atend)
%%BoundingBox: 0 0 420 315
%%LanguageLevel: 3
%%EndComments
%%BeginProlog
%%BeginResource: procset (Apache XML Graphics Std ProcSet) 1.2 0
%%Version: 1.2 0
%%Copyright: (Copyright 2001-2003,2010 The Apache Software Foundation. License terms: http://www.apache.org/licenses/LICENSE-2.0)
/bd{bind def}bind def
/ld{load def}bd
/GR/grestore ld
/M/moveto ld
/LJ/setlinejoin ld
/C/curveto ld
/f/fill ld
/LW/setlinewidth ld
/GC/setgray ld
/t/show ld
/N/newpath ld
/CT/concat ld
/cp/closepath ld
/S/stroke ld
/L/lineto ld
/CC/setcmykcolor ld
/A/ashow ld
/GS/gsave ld
/RC/setrgbcolor ld
/RM/rmoveto ld
/ML/setmiterlimit ld
/re {4 2 roll M
1 index 0 rlineto
0 exch rlineto
neg 0 rlineto
cp } bd
/_ctm matrix def
/_tm matrix def
/BT { _ctm currentmatrix pop matrix _tm copy pop 0 0 moveto } bd
/ET { _ctm setmatrix } bd
/iTm { _ctm setmatrix _tm concat } bd
/Tm { _tm astore pop iTm 0 0 moveto } bd
/ux 0.0 def
/uy 0.0 def
/F {
  /Tp exch def
  /Tf exch def
  Tf findfont Tp scalefont setfont
  /cf Tf def  /cs Tp def
} bd
/ULS {currentpoint /uy exch def /ux exch def} bd
/ULE {
  /Tcx currentpoint pop def
  gsave
  newpath
  cf findfont cs scalefont dup
  /FontMatrix get 0 get /Ts exch def /FontInfo get dup
  /UnderlinePosition get Ts mul /To exch def
  /UnderlineThickness get Ts mul /Tt exch def
  ux uy To add moveto  Tcx uy To add lineto
  Tt setlinewidth stroke
  grestore
} bd
/OLE {
  /Tcx currentpoint pop def
  gsave
  newpath
  cf findfont cs scalefont dup
  /FontMatrix get 0 get /Ts exch def /FontInfo get dup
  /UnderlinePosition get Ts mul /To exch def
  /UnderlineThickness get Ts mul /Tt exch def
  ux uy To add cs add moveto Tcx uy To add cs add lineto
  Tt setlinewidth stroke
  grestore
} bd
/SOE {
  /Tcx currentpoint pop def
  gsave
  newpath
  cf findfont cs scalefont dup
  /FontMatrix get 0 get /Ts exch def /FontInfo get dup
  /UnderlinePosition get Ts mul /To exch def
  /UnderlineThickness get Ts mul /Tt exch def
  ux uy To add cs 10 mul 26 idiv add moveto Tcx uy To add cs 10 mul 26 idiv add lineto
  Tt setlinewidth stroke
  grestore
} bd
/QT {
/Y22 exch store
/X22 exch store
/Y21 exch store
/X21 exch store
currentpoint
/Y21 load 2 mul add 3 div exch
/X21 load 2 mul add 3 div exch
/X21 load 2 mul /X22 load add 3 div
/Y21 load 2 mul /Y22 load add 3 div
/X22 load /Y22 load curveto
} bd
/SSPD {
dup length /d exch dict def
{
/v exch def
/k exch def
currentpagedevice k known {
/cpdv currentpagedevice k get def
v cpdv ne {
/upd false def
/nullv v type /nulltype eq def
/nullcpdv cpdv type /nulltype eq def
nullv nullcpdv or
{
/upd true def
} {
/sametype v type cpdv type eq def
sametype {
v type /arraytype eq {
/vlen v length def
/cpdvlen cpdv length def
vlen cpdvlen eq {
0 1 vlen 1 sub {
/i exch def
/obj v i get def
/cpdobj cpdv i get def
obj cpdobj ne {
/upd true def
exit
} if
} for
} {
/upd true def
} ifelse
} {
v type /dicttype eq {
v {
/dv exch def
/dk exch def
/cpddv cpdv dk get def
dv cpddv ne {
/upd true def
exit
} if
} forall
} {
/upd true def
} ifelse
} ifelse
} if
} ifelse
upd true eq {
d k v put
} if
} if
} if
} forall
d length 0 gt {
d setpagedevice
} if
} bd
/RE { % /NewFontName [NewEncodingArray] /FontName RE -
  findfont dup length dict begin
  {
    1 index /FID ne
    {def} {pop pop} ifelse
  } forall
  /Encoding exch def
  /FontName 1 index def
  currentdict definefont pop
  end
} bind def
%%EndResource
%%BeginResource: procset (Apache XML Graphics EPS ProcSet) 1.0 0
%%Version: 1.0 0
%%Copyright: (Copyright 2002-2003 The Apache Software Foundation. License terms: http://www.apache.org/licenses/LICENSE-2.0)
/BeginEPSF { %def
/b4_Inc_state save def         % Save state for cleanup
/dict_count countdictstack def % Count objects on dict stack
/op_count count 1 sub def      % Count objects on operand stack
userdict begin                 % Push userdict on dict stack
/showpage { } def              % Redefine showpage, { } = null proc
0 setgray 0 setlinecap         % Prepare graphics state
1 setlinewidth 0 setlinejoin
10 setmiterlimit [ ] 0 setdash newpath
/languagelevel where           % If level not equal to 1 then
{pop languagelevel             % set strokeadjust and
1 ne                           % overprint to their defaults.
{false setstrokeadjust false setoverprint
} if
} if
} bd
/EndEPSF { %def
count op_count sub {pop} repeat            % Clean up stacks
countdictstack dict_count sub {end} repeat
b4_Inc_state restore
} bd
%%EndResource
%FOPBeginFontDict
%%IncludeResource: font Courier-Bold
%%IncludeResource: font Helvetica
%%IncludeResource: font Courier-BoldOblique
%%IncludeResource: font Courier-Oblique
%%IncludeResource: font Times-Roman
%%IncludeResource: font Helvetica-BoldOblique
%%IncludeResource: font Helvetica-Bold
%%IncludeResource: font Helvetica-Oblique
%%IncludeResource: font Times-BoldItalic
%%IncludeResource: font Courier
%%IncludeResource: font Times-Italic
%%IncludeResource: font Times-Bold
%%IncludeResource: font Symbol
%%IncludeResource: font ZapfDingbats
%FOPEndFontDict
%%BeginResource: encoding WinAnsiEncoding
/WinAnsiEncoding [
/.notdef /.notdef /.notdef /.notdef /.notdef
/.notdef /.notdef /.notdef /.notdef /.notdef
/.notdef /.notdef /.notdef /.notdef /.notdef
/.notdef /.notdef /.notdef /.notdef /.notdef
/.notdef /.notdef /.notdef /.notdef /.notdef
/.notdef /.notdef /.notdef /.notdef /.notdef
/.notdef /.notdef /space /exclam /quotedbl
/numbersign /dollar /percent /ampersand /quotesingle
/parenleft /parenright /asterisk /plus /comma
/hyphen /period /slash /zero /one
/two /three /four /five /six
/seven /eight /nine /colon /semicolon
/less /equal /greater /question /at
/A /B /C /D /E
/F /G /H /I /J
/K /L /M /N /O
/P /Q /R /S /T
/U /V /W /X /Y
/Z /bracketleft /backslash /bracketright /asciicircum
/underscore /quoteleft /a /b /c
/d /e /f /g /h
/i /j /k /l /m
/n /o /p /q /r
/s /t /u /v /w
/x /y /z /braceleft /bar
/braceright /asciitilde /bullet /Euro /bullet
/quotesinglbase /florin /quotedblbase /ellipsis /dagger
/daggerdbl /circumflex /perthousand /Scaron /guilsinglleft
/OE /bullet /Zcaron /bullet /bullet
/quoteleft /quoteright /quotedblleft /quotedblright /bullet
/endash /emdash /asciitilde /trademark /scaron
/guilsinglright /oe /bullet /zcaron /Ydieresis
/space /exclamdown /cent /sterling /currency
/yen /brokenbar /section /dieresis /copyright
/ordfeminine /guillemotleft /logicalnot /sfthyphen /registered
/macron /degree /plusminus /twosuperior /threesuperior
/acute /mu /paragraph /middot /cedilla
/onesuperior /ordmasculine /guillemotright /onequarter /onehalf
/threequarters /questiondown /Agrave /Aacute /Acircumflex
/Atilde /Adieresis /Aring /AE /Ccedilla
/Egrave /Eacute /Ecircumflex /Edieresis /Igrave
/Iacute /Icircumflex /Idieresis /Eth /Ntilde
/Ograve /Oacute /Ocircumflex /Otilde /Odieresis
/multiply /Oslash /Ugrave /Uacute /Ucircumflex
/Udieresis /Yacute /Thorn /germandbls /agrave
/aacute /acircumflex /atilde /adieresis /aring
/ae /ccedilla /egrave /eacute /ecircumflex
/edieresis /igrave /iacute /icircumflex /idieresis
/eth /ntilde /ograve /oacute /ocircumflex
/otilde /odieresis /divide /oslash /ugrave
/uacute /ucircumflex /udieresis /yacute /thorn
/ydieresis
] def
%%EndResource
%FOPBeginFontReencode
/Courier-Bold findfont
dup length dict begin
  {1 index /FID ne {def} {pop pop} ifelse} forall
  /Encoding WinAnsiEncoding def
  currentdict
end
/Courier-Bold exch definefont pop
/Helvetica findfont
dup length dict begin
  {1 index /FID ne {def} {pop pop} ifelse} forall
  /Encoding WinAnsiEncoding def
  currentdict
end
/Helvetica exch definefont pop
/Courier-BoldOblique findfont
dup length dict begin
  {1 index /FID ne {def} {pop pop} ifelse} forall
  /Encoding WinAnsiEncoding def
  currentdict
end
/Courier-BoldOblique exch definefont pop
/Courier-Oblique findfont
dup length dict begin
  {1 index /FID ne {def} {pop pop} ifelse} forall
  /Encoding WinAnsiEncoding def
  currentdict
end
/Courier-Oblique exch definefont pop
/Times-Roman findfont
dup length dict begin
  {1 index /FID ne {def} {pop pop} ifelse} forall
  /Encoding WinAnsiEncoding def
  currentdict
end
/Times-Roman exch definefont pop
/Helvetica-BoldOblique findfont
dup length dict begin
  {1 index /FID ne {def} {pop pop} ifelse} forall
  /Encoding WinAnsiEncoding def
  currentdict
end
/Helvetica-BoldOblique exch definefont pop
/Helvetica-Bold findfont
dup length dict begin
  {1 index /FID ne {def} {pop pop} ifelse} forall
  /Encoding WinAnsiEncoding def
  currentdict
end
/Helvetica-Bold exch definefont pop
/Helvetica-Oblique findfont
dup length dict begin
  {1 index /FID ne {def} {pop pop} ifelse} forall
  /Encoding WinAnsiEncoding def
  currentdict
end
/Helvetica-Oblique exch definefont pop
/Times-BoldItalic findfont
dup length dict begin
  {1 index /FID ne {def} {pop pop} ifelse} forall
  /Encoding WinAnsiEncoding def
  currentdict
end
/Times-BoldItalic exch definefont pop
/Courier findfont
dup length dict begin
  {1 index /FID ne {def} {pop pop} ifelse} forall
  /Encoding WinAnsiEncoding def
  currentdict
end
/Courier exch definefont pop
/Times-Italic findfont
dup length dict begin
  {1 index /FID ne {def} {pop pop} ifelse} forall
  /Encoding WinAnsiEncoding def
  currentdict
end
/Times-Italic exch definefont pop
/Times-Bold findfont
dup length dict begin
  {1 index /FID ne {def} {pop pop} ifelse} forall
  /Encoding WinAnsiEncoding def
  currentdict
end
/Times-Bold exch definefont pop
%FOPEndFontReencode
%%EndProlog
%%Page: 1 1
%%PageBoundingBox: 0 0 420 315
%%BeginPageSetup
[1 0 0 -1 0 315] CT
%%EndPageSetup
GS
[0.75 0 0 0.75 0 0] CT
1 GC
N
0 0 560 420 re
f
GR
GS
[0.75 0 0 0.75 0 0] CT
1 GC
N
0 0 560 420 re
f
GR
GS
[0.75 0 0 0.75 0 0] CT
1 GC
N
73 374 M
507 374 L
507 31 L
73 31 L
cp
f
GR
GS
[0.75 0 0 0.75 0 0] CT
0.149 GC
2 setlinecap
1 LJ
0.667 LW
N
73 374 M
507 374 L
S
GR
GS
[0.75 0 0 0.75 0 0] CT
0.149 GC
2 setlinecap
1 LJ
0.667 LW
N
73 374 M
73 369.66 L
S
GR
GS
[0.75 0 0 0.75 0 0] CT
0.149 GC
2 setlinecap
1 LJ
0.667 LW
N
159.8 374 M
159.8 369.66 L
S
GR
GS
[0.75 0 0 0.75 0 0] CT
0.149 GC
2 setlinecap
1 LJ
0.667 LW
N
246.6 374 M
246.6 369.66 L
S
GR
GS
[0.75 0 0 0.75 0 0] CT
0.149 GC
2 setlinecap
1 LJ
0.667 LW
N
333.4 374 M
333.4 369.66 L
S
GR
GS
[0.75 0 0 0.75 0 0] CT
0.149 GC
2 setlinecap
1 LJ
0.667 LW
N
420.2 374 M
420.2 369.66 L
S
GR
GS
[0.75 0 0 0.75 0 0] CT
0.149 GC
2 setlinecap
1 LJ
0.667 LW
N
507 374 M
507 369.66 L
S
GR
GS
[0.75 0 0 0.75 54.75 284.49998] CT
0.149 GC
/Helvetica 13.333 F
GS
[1 0 0 1 0 0] CT
-4.5 13 moveto 
1 -1 scale
(0) t 
GR
GR
GS
[0.75 0 0 0.75 119.85 284.49998] CT
0.149 GC
/Helvetica 13.333 F
GS
[1 0 0 1 0 0] CT
-12.5 13 moveto 
1 -1 scale
(100) t 
GR
GR
GS
[0.75 0 0 0.75 184.95 284.49998] CT
0.149 GC
/Helvetica 13.333 F
GS
[1 0 0 1 0 0] CT
-12.5 13 moveto 
1 -1 scale
(200) t 
GR
GR
GS
[0.75 0 0 0.75 250.05 284.49998] CT
0.149 GC
/Helvetica 13.333 F
GS
[1 0 0 1 0 0] CT
-12.5 13 moveto 
1 -1 scale
(300) t 
GR
GR
GS
[0.75 0 0 0.75 315.15001 284.49998] CT
0.149 GC
/Helvetica 13.333 F
GS
[1 0 0 1 0 0] CT
-12.5 13 moveto 
1 -1 scale
(400) t 
GR
GR
GS
[0.75 0 0 0.75 380.25 284.49998] CT
0.149 GC
/Helvetica 13.333 F
GS
[1 0 0 1 0 0] CT
-12.5 13 moveto 
1 -1 scale
(500) t 
GR
GR
GS
[0.75 0 0 0.75 217.50016 298.24999] CT
0.149 GC
/Helvetica 14.667 F
GS
[1 0 0 1 0 0] CT
-3 14 moveto 
1 -1 scale
(t) t 
GR
GR
GS
[0.75 0 0 0.75 0 0] CT
0.149 GC
2 setlinecap
1 LJ
0.667 LW
N
73 374 M
73 31 L
S
GR
GS
[0.75 0 0 0.75 0 0] CT
0.149 GC
2 setlinecap
1 LJ
0.667 LW
N
73 374 M
77.34 374 L
S
GR
GS
[0.75 0 0 0.75 0 0] CT
0.149 GC
2 setlinecap
1 LJ
0.667 LW
N
73 331.125 M
77.34 331.125 L
S
GR
GS
[0.75 0 0 0.75 0 0] CT
0.149 GC
2 setlinecap
1 LJ
0.667 LW
N
73 288.25 M
77.34 288.25 L
S
GR
GS
[0.75 0 0 0.75 0 0] CT
0.149 GC
2 setlinecap
1 LJ
0.667 LW
N
73 245.375 M
77.34 245.375 L
S
GR
GS
[0.75 0 0 0.75 0 0] CT
0.149 GC
2 setlinecap
1 LJ
0.667 LW
N
73 202.5 M
77.34 202.5 L
S
GR
GS
[0.75 0 0 0.75 0 0] CT
0.149 GC
2 setlinecap
1 LJ
0.667 LW
N
73 159.625 M
77.34 159.625 L
S
GR
GS
[0.75 0 0 0.75 0 0] CT
0.149 GC
2 setlinecap
1 LJ
0.667 LW
N
73 116.75 M
77.34 116.75 L
S
GR
GS
[0.75 0 0 0.75 0 0] CT
0.149 GC
2 setlinecap
1 LJ
0.667 LW
N
73 73.875 M
77.34 73.875 L
S
GR
GS
[0.75 0 0 0.75 0 0] CT
0.149 GC
2 setlinecap
1 LJ
0.667 LW
N
73 31 M
77.34 31 L
S
GR
GS
[0.75 0 0 0.75 50.75 280.5] CT
0.149 GC
/Helvetica 13.333 F
GS
[1 0 0 1 0 0] CT
-21 4.5 moveto 
1 -1 scale
(0.3) t 
GR
GR
GS
[0.75 0 0 0.75 50.75 248.34375] CT
0.149 GC
/Helvetica 13.333 F
GS
[1 0 0 1 0 0] CT
-21 4.5 moveto 
1 -1 scale
(0.4) t 
GR
GR
GS
[0.75 0 0 0.75 50.75 216.1875] CT
0.149 GC
/Helvetica 13.333 F
GS
[1 0 0 1 0 0] CT
-21 4.5 moveto 
1 -1 scale
(0.5) t 
GR
GR
GS
[0.75 0 0 0.75 50.75 184.03124] CT
0.149 GC
/Helvetica 13.333 F
GS
[1 0 0 1 0 0] CT
-21 4.5 moveto 
1 -1 scale
(0.6) t 
GR
GR
GS
[0.75 0 0 0.75 50.75 151.875] CT
0.149 GC
/Helvetica 13.333 F
GS
[1 0 0 1 0 0] CT
-21 4.5 moveto 
1 -1 scale
(0.7) t 
GR
GR
GS
[0.75 0 0 0.75 50.75 119.71875] CT
0.149 GC
/Helvetica 13.333 F
GS
[1 0 0 1 0 0] CT
-21 4.5 moveto 
1 -1 scale
(0.8) t 
GR
GR
GS
[0.75 0 0 0.75 50.75 87.56251] CT
0.149 GC
/Helvetica 13.333 F
GS
[1 0 0 1 0 0] CT
-21 4.5 moveto 
1 -1 scale
(0.9) t 
GR
GR
GS
[0.75 0 0 0.75 50.75 55.40625] CT
0.149 GC
/Helvetica 13.333 F
GS
[1 0 0 1 0 0] CT
-9 4.5 moveto 
1 -1 scale
(1) t 
GR
GR
GS
[0.75 0 0 0.75 50.75 23.24999] CT
0.149 GC
/Helvetica 13.333 F
GS
[1 0 0 1 0 0] CT
-21 4.5 moveto 
1 -1 scale
(1.1) t 
GR
GR
GS
[0 -0.75 0.75 0 24.75 172.5] CT
0.149 GC
/Helvetica 14.667 F
GS
[1 0 0 1 0 0] CT
0 0 moveto 
1 -1 scale
(||x\(t\)||) t 
GR
GR
GS
[0 -0.75 0.75 0 30 137.25] CT
0.149 GC
/Helvetica 11.733 F
GS
[1 0 0 1 0 0] CT
0 0 moveto 
1 -1 scale
(2) t 
GR
GR
GS
[0.75 0 0 0.75 217.50021 21.18751] CT
/Helvetica-Bold 14.667 F
GS
[1 0 0 1 0 0] CT
-30.5 -4 moveto 
1 -1 scale
(h=0.80) t 
GR
GR
GS
[0.75 0 0 0.75 0 0] CT
0.929 0.694 0.125 RC
1 LJ
2 LW
N
73 73.875 M
73.694 73.875 L
74.389 73.875 L
75.083 73.875 L
75.778 73.875 L
76.472 73.875 L
77.166 73.875 L
77.861 73.875 L
78.555 73.875 L
79.25 73.875 L
79.944 73.875 L
80.638 73.875 L
81.333 73.875 L
82.027 73.875 L
82.722 73.875 L
83.416 73.875 L
84.11 73.875 L
84.805 73.875 L
85.499 73.875 L
86.194 73.875 L
86.888 73.875 L
87.582 73.875 L
88.277 73.875 L
88.971 73.875 L
89.666 73.875 L
90.36 73.875 L
91.054 73.875 L
91.749 73.875 L
92.443 73.875 L
93.138 73.875 L
93.832 73.875 L
94.526 73.875 L
95.221 73.875 L
95.915 73.875 L
96.61 73.875 L
97.304 73.875 L
97.998 73.875 L
98.693 73.875 L
99.387 73.875 L
100.082 73.875 L
100.776 73.875 L
101.47 73.875 L
102.165 73.875 L
102.859 73.875 L
103.554 73.875 L
104.248 73.875 L
104.942 73.875 L
105.637 73.875 L
106.331 73.875 L
107.026 73.875 L
107.72 73.875 L
108.414 73.875 L
109.109 73.875 L
109.803 73.875 L
110.498 73.875 L
111.192 73.875 L
111.886 73.875 L
112.581 73.875 L
113.275 73.875 L
113.97 73.875 L
114.664 73.875 L
115.358 73.875 L
116.053 73.875 L
116.747 73.875 L
117.442 73.875 L
118.136 73.875 L
118.83 73.875 L
119.525 73.875 L
120.219 73.875 L
120.914 73.875 L
121.608 73.875 L
122.302 73.875 L
122.997 73.875 L
123.691 73.875 L
124.386 73.875 L
125.08 73.875 L
125.774 73.875 L
126.469 73.875 L
127.163 73.875 L
127.858 73.875 L
128.552 73.875 L
129.246 73.875 L
129.941 73.875 L
130.635 73.875 L
131.33 73.875 L
132.024 73.875 L
132.718 73.875 L
133.413 73.875 L
134.107 73.875 L
134.802 73.875 L
135.496 73.875 L
136.19 73.875 L
136.885 73.875 L
137.579 73.875 L
138.274 73.875 L
138.968 73.875 L
139.662 73.875 L
140.357 73.875 L
141.051 73.875 L
141.746 73.875 L
142.44 73.875 L
143.134 73.875 L
143.829 73.875 L
144.523 73.875 L
145.218 73.875 L
145.912 73.875 L
146.606 73.875 L
147.301 73.875 L
147.995 73.875 L
148.69 73.875 L
149.384 73.875 L
150.078 73.875 L
150.773 73.875 L
151.467 73.875 L
152.162 73.875 L
152.856 73.875 L
153.55 73.875 L
154.245 73.875 L
154.939 73.875 L
155.634 73.875 L
156.328 73.875 L
157.022 73.875 L
157.717 73.875 L
158.411 73.875 L
159.106 73.875 L
159.8 73.875 L
160.494 73.875 L
161.189 73.875 L
161.883 73.875 L
162.578 73.875 L
163.272 73.875 L
163.966 73.875 L
164.661 73.875 L
165.355 73.875 L
166.05 73.875 L
166.744 73.875 L
167.438 73.875 L
168.133 73.875 L
168.827 73.875 L
169.522 73.875 L
170.216 73.875 L
170.91 73.875 L
171.605 73.875 L
172.299 73.875 L
172.994 73.875 L
173.688 73.875 L
174.382 73.875 L
175.077 73.875 L
175.771 73.875 L
176.466 73.875 L
177.16 73.875 L
177.854 73.875 L
178.549 73.875 L
179.243 73.875 L
179.938 73.875 L
180.632 73.875 L
181.326 73.875 L
182.021 73.875 L
182.715 73.875 L
183.41 73.875 L
184.104 73.875 L
184.798 73.875 L
185.493 73.875 L
186.187 73.875 L
186.882 73.875 L
187.576 73.875 L
188.27 73.875 L
188.965 73.875 L
189.659 73.875 L
190.354 73.875 L
191.048 73.875 L
191.742 73.875 L
192.437 73.875 L
193.131 73.875 L
193.826 73.875 L
194.52 73.875 L
195.214 73.875 L
195.909 73.875 L
196.603 73.875 L
197.298 73.875 L
197.992 73.875 L
198.686 73.875 L
199.381 73.875 L
200.075 73.875 L
200.77 73.875 L
201.464 73.875 L
202.158 73.875 L
202.853 73.875 L
203.547 73.875 L
204.242 73.875 L
204.936 73.875 L
205.63 73.875 L
206.325 73.875 L
207.019 73.875 L
207.714 73.875 L
208.408 73.875 L
209.102 73.875 L
209.797 73.875 L
210.491 73.875 L
211.186 73.875 L
211.88 73.875 L
212.574 73.875 L
213.269 73.875 L
213.963 73.875 L
214.658 73.875 L
215.352 73.875 L
216.046 73.875 L
216.741 73.875 L
217.435 73.875 L
218.13 73.875 L
218.824 73.875 L
219.518 73.875 L
220.213 73.875 L
220.907 73.875 L
221.602 73.875 L
222.296 73.875 L
222.99 73.875 L
223.685 73.875 L
224.379 73.875 L
225.074 73.875 L
225.768 73.875 L
226.462 73.875 L
227.157 73.875 L
227.851 73.875 L
228.546 73.875 L
229.24 73.875 L
229.934 73.875 L
230.629 73.875 L
231.323 73.875 L
232.018 73.875 L
232.712 73.875 L
233.406 73.875 L
234.101 73.875 L
234.795 73.875 L
235.49 73.875 L
236.184 73.875 L
236.878 73.875 L
237.573 73.875 L
238.267 73.875 L
238.962 73.875 L
239.656 73.875 L
240.35 73.875 L
241.045 73.875 L
241.739 73.875 L
242.434 73.875 L
243.128 73.875 L
243.822 73.875 L
244.517 73.875 L
245.211 73.875 L
245.906 73.875 L
246.6 73.875 L
247.294 73.875 L
247.989 73.875 L
248.683 73.875 L
249.378 73.875 L
250.072 73.875 L
250.766 73.875 L
251.461 73.875 L
252.155 73.875 L
252.85 73.875 L
253.544 73.875 L
254.238 73.875 L
254.933 73.875 L
255.627 73.875 L
256.322 73.875 L
257.016 73.875 L
257.71 73.875 L
258.405 73.875 L
259.099 73.875 L
259.794 73.875 L
260.488 73.875 L
261.182 73.875 L
261.877 73.875 L
262.571 73.875 L
263.266 73.875 L
263.96 73.875 L
264.654 73.875 L
265.349 73.875 L
266.043 73.875 L
266.738 73.875 L
267.432 73.875 L
268.126 73.875 L
268.821 73.875 L
269.515 73.875 L
270.21 73.875 L
270.904 73.875 L
271.598 73.875 L
272.293 73.875 L
272.987 73.875 L
273.682 73.875 L
274.376 73.875 L
275.07 73.875 L
275.765 73.875 L
276.459 73.875 L
277.154 73.875 L
277.848 73.875 L
278.542 73.875 L
279.237 73.875 L
279.931 73.875 L
280.626 73.875 L
281.32 73.875 L
282.014 73.875 L
282.709 73.875 L
283.403 73.875 L
284.098 73.875 L
284.792 73.875 L
285.486 73.875 L
286.181 73.875 L
286.875 73.875 L
287.57 73.875 L
288.264 73.875 L
288.958 73.875 L
289.653 73.875 L
290.347 73.875 L
291.042 73.875 L
291.736 73.875 L
292.43 73.875 L
293.125 73.875 L
293.819 73.875 L
294.514 73.875 L
295.208 73.875 L
295.902 73.875 L
296.597 73.875 L
297.291 73.875 L
297.986 73.875 L
298.68 73.875 L
299.374 73.875 L
300.069 73.875 L
300.763 73.875 L
301.458 73.875 L
302.152 73.875 L
302.846 73.875 L
303.541 73.875 L
304.235 73.875 L
304.93 73.875 L
305.624 73.875 L
306.318 73.875 L
307.013 73.875 L
307.707 73.875 L
308.402 73.875 L
309.096 73.875 L
309.79 73.875 L
310.485 73.875 L
311.179 73.875 L
311.874 73.875 L
312.568 73.875 L
313.262 73.875 L
313.957 73.875 L
314.651 73.875 L
315.346 73.875 L
316.04 73.875 L
316.734 73.875 L
317.429 73.875 L
318.123 73.875 L
318.818 73.875 L
319.512 73.875 L
320.206 73.875 L
320.901 73.875 L
321.595 73.875 L
322.29 73.875 L
322.984 73.875 L
323.678 73.875 L
324.373 73.875 L
325.067 73.875 L
325.762 73.875 L
326.456 73.875 L
327.15 73.875 L
327.845 73.875 L
328.539 73.875 L
329.234 73.875 L
329.928 73.875 L
330.622 73.875 L
331.317 73.875 L
332.011 73.875 L
332.706 73.875 L
333.4 73.875 L
334.094 73.875 L
334.789 73.875 L
335.483 73.875 L
336.178 73.875 L
336.872 73.875 L
337.566 73.875 L
338.261 73.875 L
338.955 73.875 L
339.65 73.875 L
340.344 73.875 L
341.038 73.875 L
341.733 73.875 L
342.427 73.875 L
343.122 73.875 L
343.816 73.875 L
344.51 73.875 L
345.205 73.875 L
345.899 73.875 L
346.594 73.875 L
347.288 73.875 L
347.982 73.875 L
348.677 73.875 L
349.371 73.875 L
350.066 73.875 L
350.76 73.875 L
351.454 73.875 L
352.149 73.875 L
352.843 73.875 L
353.538 73.875 L
354.232 73.875 L
354.926 73.875 L
355.621 73.875 L
356.315 73.875 L
357.01 73.875 L
357.704 73.875 L
358.398 73.875 L
359.093 73.875 L
359.787 73.875 L
360.482 73.875 L
361.176 73.875 L
361.87 73.875 L
362.565 73.875 L
363.259 73.875 L
363.954 73.875 L
364.648 73.875 L
365.342 73.875 L
366.037 73.875 L
366.731 73.875 L
367.426 73.875 L
368.12 73.875 L
368.814 73.875 L
369.509 73.875 L
370.203 73.875 L
370.898 73.875 L
371.592 73.875 L
372.286 73.875 L
372.981 73.875 L
373.675 73.875 L
374.37 73.875 L
375.064 73.875 L
375.758 73.875 L
376.453 73.875 L
377.147 73.875 L
377.842 73.875 L
378.536 73.875 L
379.23 73.875 L
379.925 73.875 L
380.619 73.875 L
381.314 73.875 L
382.008 73.875 L
382.702 73.875 L
383.397 73.875 L
384.091 73.875 L
384.786 73.875 L
385.48 73.875 L
386.174 73.875 L
386.869 73.875 L
387.563 73.875 L
388.258 73.875 L
388.952 73.875 L
389.646 73.875 L
390.341 73.875 L
391.035 73.875 L
391.73 73.875 L
392.424 73.875 L
393.118 73.875 L
393.813 73.875 L
394.507 73.875 L
395.202 73.875 L
395.896 73.875 L
396.59 73.875 L
397.285 73.875 L
397.979 73.875 L
398.674 73.875 L
399.368 73.875 L
400.062 73.875 L
400.757 73.875 L
401.451 73.875 L
402.146 73.875 L
402.84 73.875 L
403.534 73.875 L
404.229 73.875 L
404.923 73.875 L
405.618 73.875 L
406.312 73.875 L
407.006 73.875 L
407.701 73.875 L
408.395 73.875 L
409.09 73.875 L
409.784 73.875 L
410.478 73.875 L
411.173 73.875 L
411.867 73.875 L
412.562 73.875 L
413.256 73.875 L
413.95 73.875 L
414.645 73.875 L
415.339 73.875 L
416.034 73.875 L
416.728 73.875 L
417.422 73.875 L
418.117 73.875 L
418.811 73.875 L
419.506 73.875 L
420.2 73.875 L
420.894 73.875 L
421.589 73.875 L
422.283 73.875 L
422.978 73.875 L
423.672 73.875 L
424.366 73.875 L
425.061 73.875 L
425.755 73.875 L
426.45 73.875 L
427.144 73.875 L
427.838 73.875 L
428.533 73.875 L
429.227 73.875 L
429.922 73.875 L
430.616 73.875 L
431.31 73.875 L
432.005 73.875 L
432.699 73.875 L
433.394 73.875 L
434.088 73.875 L
434.782 73.875 L
435.477 73.875 L
436.171 73.875 L
436.866 73.875 L
437.56 73.875 L
438.254 73.875 L
438.949 73.875 L
439.643 73.875 L
440.338 73.875 L
441.032 73.875 L
441.726 73.875 L
442.421 73.875 L
443.115 73.875 L
443.81 73.875 L
444.504 73.875 L
445.198 73.875 L
445.893 73.875 L
446.587 73.875 L
447.282 73.875 L
447.976 73.875 L
448.67 73.875 L
449.365 73.875 L
450.059 73.875 L
450.754 73.875 L
451.448 73.875 L
452.142 73.875 L
452.837 73.875 L
453.531 73.875 L
454.226 73.875 L
454.92 73.875 L
455.614 73.875 L
456.309 73.875 L
457.003 73.875 L
457.698 73.875 L
458.392 73.875 L
459.086 73.875 L
459.781 73.875 L
460.475 73.875 L
461.17 73.875 L
461.864 73.875 L
462.558 73.875 L
463.253 73.875 L
463.947 73.875 L
464.642 73.875 L
465.336 73.875 L
466.03 73.875 L
466.725 73.875 L
467.419 73.875 L
468.114 73.875 L
468.808 73.875 L
469.502 73.875 L
470.197 73.875 L
470.891 73.875 L
471.586 73.875 L
472.28 73.875 L
472.974 73.875 L
473.669 73.875 L
474.363 73.875 L
475.058 73.875 L
475.752 73.875 L
476.446 73.875 L
477.141 73.875 L
477.835 73.875 L
478.53 73.875 L
479.224 73.875 L
479.918 73.875 L
480.613 73.875 L
481.307 73.875 L
482.002 73.875 L
482.696 73.875 L
483.39 73.875 L
484.085 73.875 L
484.779 73.875 L
485.474 73.875 L
486.168 73.875 L
486.862 73.875 L
487.557 73.875 L
488.251 73.875 L
488.946 73.875 L
489.64 73.875 L
490.334 73.875 L
491.029 73.875 L
491.723 73.875 L
492.418 73.875 L
493.112 73.875 L
493.806 73.875 L
494.501 73.875 L
495.195 73.875 L
495.89 73.875 L
496.584 73.875 L
497.278 73.875 L
497.973 73.875 L
498.667 73.875 L
499.362 73.875 L
500.056 73.875 L
500.75 73.875 L
501.445 73.875 L
502.139 73.875 L
502.834 73.875 L
503.528 73.875 L
504.222 73.875 L
504.917 73.875 L
505.611 73.875 L
506.306 73.875 L
507 73.875 L
S
GR
GS
[0.75 0 0 0.75 0 0] CT
0.494 0.184 0.557 RC
[8 8] 0 setdash
2 LJ
2 LW
N
73 73.875 M
73.694 74.594 L
74.389 75.311 L
75.083 76.027 L
75.778 76.742 L
76.472 77.456 L
77.166 78.169 L
77.861 78.881 L
78.555 79.591 L
79.25 80.3 L
79.944 81.008 L
80.638 81.715 L
81.333 82.42 L
82.027 83.124 L
82.722 83.828 L
83.416 84.53 L
84.11 85.23 L
84.805 85.93 L
85.499 86.628 L
86.194 87.326 L
86.888 88.022 L
87.582 88.717 L
88.277 89.411 L
88.971 90.103 L
89.666 90.795 L
90.36 91.485 L
91.054 92.174 L
91.749 92.862 L
92.443 93.549 L
93.138 94.235 L
93.832 94.919 L
94.526 95.603 L
95.221 96.285 L
95.915 96.966 L
96.61 97.646 L
97.304 98.325 L
97.998 99.003 L
98.693 99.679 L
99.387 100.355 L
100.082 101.029 L
100.776 101.702 L
101.47 102.374 L
102.165 103.045 L
102.859 103.715 L
103.554 104.383 L
104.248 105.051 L
104.942 105.717 L
105.637 106.383 L
106.331 107.047 L
107.026 107.71 L
107.72 108.372 L
108.414 109.033 L
109.109 109.693 L
109.803 110.351 L
110.498 111.009 L
111.192 111.665 L
111.886 112.32 L
112.581 112.975 L
113.275 113.628 L
113.97 114.28 L
114.664 114.931 L
115.358 115.581 L
116.053 116.229 L
116.747 116.877 L
117.442 117.524 L
118.136 118.169 L
118.83 118.814 L
119.525 119.457 L
120.219 120.099 L
120.914 120.741 L
121.608 121.381 L
122.302 122.02 L
122.997 122.658 L
123.691 123.295 L
124.386 123.93 L
125.08 124.565 L
125.774 125.199 L
126.469 125.832 L
127.163 126.463 L
127.858 127.094 L
128.552 127.723 L
129.246 128.352 L
129.941 128.979 L
130.635 129.605 L
131.33 130.23 L
132.024 130.855 L
132.718 131.478 L
133.413 132.1 L
134.107 132.721 L
134.802 133.341 L
135.496 133.96 L
136.19 134.578 L
136.885 135.195 L
137.579 135.811 L
138.274 136.426 L
138.968 137.04 L
139.662 137.652 L
140.357 138.264 L
141.051 138.875 L
141.746 139.485 L
142.44 140.093 L
143.134 140.701 L
143.829 141.308 L
144.523 141.913 L
145.218 142.518 L
145.912 143.122 L
146.606 143.724 L
147.301 144.326 L
147.995 144.926 L
148.69 145.526 L
149.384 146.124 L
150.078 146.722 L
150.773 147.319 L
151.467 147.914 L
152.162 148.509 L
152.856 149.102 L
153.55 149.695 L
154.245 150.286 L
154.939 150.877 L
155.634 151.467 L
156.328 152.055 L
157.022 152.643 L
157.717 153.23 L
158.411 153.815 L
159.106 154.4 L
159.8 154.984 L
160.494 155.566 L
161.189 156.148 L
161.883 156.729 L
162.578 157.309 L
163.272 157.887 L
163.966 158.465 L
164.661 159.042 L
165.355 159.618 L
166.05 160.193 L
166.744 160.767 L
167.438 161.34 L
168.133 161.912 L
168.827 162.483 L
169.522 163.053 L
170.216 163.623 L
170.91 164.191 L
171.605 164.758 L
172.299 165.324 L
172.994 165.89 L
173.688 166.454 L
174.382 167.018 L
175.077 167.58 L
175.771 168.142 L
176.466 168.703 L
177.16 169.262 L
177.854 169.821 L
178.549 170.379 L
179.243 170.936 L
179.938 171.492 L
180.632 172.047 L
181.326 172.601 L
182.021 173.154 L
182.715 173.707 L
183.41 174.258 L
184.104 174.808 L
184.798 175.358 L
185.493 175.906 L
186.187 176.454 L
186.882 177.001 L
187.576 177.546 L
188.27 178.091 L
188.965 178.635 L
189.659 179.178 L
190.354 179.721 L
191.048 180.262 L
191.742 180.802 L
192.437 181.342 L
193.131 181.88 L
193.826 182.418 L
194.52 182.955 L
195.214 183.49 L
195.909 184.025 L
196.603 184.559 L
197.298 185.093 L
197.992 185.625 L
198.686 186.156 L
199.381 186.687 L
200.075 187.216 L
200.77 187.745 L
201.464 188.273 L
202.158 188.8 L
202.853 189.326 L
203.547 189.851 L
204.242 190.375 L
204.936 190.898 L
205.63 191.421 L
206.325 191.943 L
207.019 192.463 L
207.714 192.983 L
208.408 193.502 L
209.102 194.021 L
209.797 194.538 L
210.491 195.054 L
211.186 195.57 L
211.88 196.084 L
212.574 196.598 L
213.269 197.111 L
213.963 197.623 L
214.658 198.135 L
215.352 198.645 L
216.046 199.155 L
216.741 199.663 L
217.435 200.171 L
218.13 200.678 L
218.824 201.184 L
219.518 201.689 L
220.213 202.194 L
220.907 202.697 L
221.602 203.2 L
222.296 203.702 L
222.99 204.203 L
223.685 204.703 L
224.379 205.203 L
225.074 205.701 L
225.768 206.199 L
226.462 206.696 L
227.157 207.192 L
227.851 207.687 L
228.546 208.182 L
229.24 208.675 L
229.934 209.168 L
230.629 209.66 L
231.323 210.151 L
232.018 210.641 L
232.712 211.13 L
233.406 211.619 L
234.101 212.107 L
234.795 212.594 L
235.49 213.08 L
236.184 213.565 L
236.878 214.05 L
237.573 214.534 L
238.267 215.016 L
238.962 215.499 L
239.656 215.98 L
240.35 216.46 L
241.045 216.94 L
241.739 217.419 L
242.434 217.897 L
243.128 218.374 L
243.822 218.851 L
244.517 219.326 L
245.211 219.801 L
245.906 220.275 L
246.6 220.749 L
247.294 221.221 L
247.989 221.693 L
248.683 222.164 L
249.378 222.634 L
250.072 223.103 L
250.766 223.572 L
251.461 224.039 L
252.155 224.506 L
252.85 224.972 L
253.544 225.438 L
254.238 225.903 L
254.933 226.366 L
255.627 226.829 L
256.322 227.292 L
257.016 227.753 L
257.71 228.214 L
258.405 228.674 L
259.099 229.133 L
259.794 229.592 L
260.488 230.049 L
261.182 230.506 L
261.877 230.962 L
262.571 231.418 L
263.266 231.872 L
263.96 232.326 L
264.654 232.779 L
265.349 233.231 L
266.043 233.683 L
266.738 234.134 L
267.432 234.584 L
268.126 235.033 L
268.821 235.482 L
269.515 235.93 L
270.21 236.377 L
270.904 236.823 L
271.598 237.268 L
272.293 237.713 L
272.987 238.157 L
273.682 238.601 L
274.376 239.043 L
275.07 239.485 L
275.765 239.926 L
276.459 240.366 L
277.154 240.806 L
277.848 241.245 L
278.542 241.683 L
279.237 242.12 L
279.931 242.557 L
280.626 242.993 L
281.32 243.428 L
282.014 243.863 L
282.709 244.296 L
283.403 244.729 L
284.098 245.162 L
284.792 245.593 L
285.486 246.024 L
286.181 246.454 L
286.875 246.884 L
287.57 247.312 L
288.264 247.74 L
288.958 248.167 L
289.653 248.594 L
290.347 249.02 L
291.042 249.445 L
291.736 249.869 L
292.43 250.293 L
293.125 250.716 L
293.819 251.138 L
294.514 251.56 L
295.208 251.981 L
295.902 252.401 L
296.597 252.82 L
297.291 253.239 L
297.986 253.657 L
298.68 254.074 L
299.374 254.491 L
300.069 254.907 L
300.763 255.322 L
301.458 255.736 L
302.152 256.15 L
302.846 256.563 L
303.541 256.976 L
304.235 257.388 L
304.93 257.799 L
305.624 258.209 L
306.318 258.619 L
307.013 259.028 L
307.707 259.436 L
308.402 259.844 L
309.096 260.251 L
309.79 260.657 L
310.485 261.063 L
311.179 261.467 L
311.874 261.872 L
312.568 262.275 L
313.262 262.678 L
313.957 263.08 L
314.651 263.482 L
315.346 263.883 L
316.04 264.283 L
316.734 264.682 L
317.429 265.081 L
318.123 265.479 L
318.818 265.877 L
319.512 266.274 L
320.206 266.67 L
320.901 267.065 L
321.595 267.46 L
322.29 267.855 L
322.984 268.248 L
323.678 268.641 L
324.373 269.033 L
325.067 269.425 L
325.762 269.816 L
326.456 270.206 L
327.15 270.595 L
327.845 270.984 L
328.539 271.373 L
329.234 271.76 L
329.928 272.147 L
330.622 272.534 L
331.317 272.919 L
332.011 273.304 L
332.706 273.689 L
333.4 274.072 L
334.094 274.455 L
334.789 274.838 L
335.483 275.22 L
336.178 275.601 L
336.872 275.982 L
337.566 276.361 L
338.261 276.741 L
338.955 277.119 L
339.65 277.497 L
340.344 277.875 L
341.038 278.251 L
341.733 278.627 L
342.427 279.003 L
343.122 279.378 L
343.816 279.752 L
344.51 280.126 L
345.205 280.499 L
345.899 280.871 L
346.594 281.243 L
347.288 281.614 L
347.982 281.984 L
348.677 282.354 L
349.371 282.723 L
350.066 283.092 L
350.76 283.46 L
351.454 283.827 L
352.149 284.194 L
352.843 284.56 L
353.538 284.926 L
354.232 285.29 L
354.926 285.655 L
355.621 286.018 L
356.315 286.382 L
357.01 286.744 L
357.704 287.106 L
358.398 287.467 L
359.093 287.828 L
359.787 288.188 L
360.482 288.547 L
361.176 288.906 L
361.87 289.264 L
362.565 289.622 L
363.259 289.979 L
363.954 290.335 L
364.648 290.691 L
365.342 291.047 L
366.037 291.401 L
366.731 291.755 L
367.426 292.109 L
368.12 292.462 L
368.814 292.814 L
369.509 293.166 L
370.203 293.517 L
370.898 293.867 L
371.592 294.217 L
372.286 294.566 L
372.981 294.915 L
373.675 295.263 L
374.37 295.611 L
375.064 295.958 L
375.758 296.304 L
376.453 296.65 L
377.147 296.995 L
377.842 297.34 L
378.536 297.684 L
379.23 298.028 L
379.925 298.371 L
380.619 298.713 L
381.314 299.055 L
382.008 299.396 L
382.702 299.737 L
383.397 300.077 L
384.091 300.416 L
384.786 300.755 L
385.48 301.094 L
386.174 301.431 L
386.869 301.769 L
387.563 302.105 L
388.258 302.441 L
388.952 302.777 L
389.646 303.112 L
390.341 303.446 L
391.035 303.78 L
391.73 304.114 L
392.424 304.446 L
393.118 304.779 L
393.813 305.11 L
394.507 305.441 L
395.202 305.772 L
395.896 306.102 L
396.59 306.431 L
397.285 306.76 L
397.979 307.088 L
398.674 307.416 L
399.368 307.743 L
400.062 308.07 L
400.757 308.396 L
401.451 308.722 L
402.146 309.047 L
402.84 309.371 L
403.534 309.695 L
404.229 310.019 L
404.923 310.341 L
405.618 310.664 L
406.312 310.985 L
407.006 311.307 L
407.701 311.627 L
408.395 311.948 L
409.09 312.267 L
409.784 312.586 L
410.478 312.905 L
411.173 313.223 L
411.867 313.54 L
412.562 313.857 L
413.256 314.174 L
413.95 314.489 L
414.645 314.805 L
415.339 315.12 L
416.034 315.434 L
416.728 315.748 L
417.422 316.061 L
418.117 316.374 L
418.811 316.686 L
419.506 316.998 L
420.2 317.309 L
420.894 317.619 L
421.589 317.929 L
422.283 318.239 L
422.978 318.548 L
423.672 318.857 L
424.366 319.165 L
425.061 319.472 L
425.755 319.779 L
426.45 320.086 L
427.144 320.392 L
427.838 320.697 L
428.533 321.002 L
429.227 321.307 L
429.922 321.61 L
430.616 321.914 L
431.31 322.217 L
432.005 322.519 L
432.699 322.821 L
433.394 323.122 L
434.088 323.423 L
434.782 323.724 L
435.477 324.024 L
436.171 324.323 L
436.866 324.622 L
437.56 324.92 L
438.254 325.218 L
438.949 325.516 L
439.643 325.812 L
440.338 326.109 L
441.032 326.405 L
441.726 326.7 L
442.421 326.995 L
443.115 327.289 L
443.81 327.583 L
444.504 327.877 L
445.198 328.17 L
445.893 328.462 L
446.587 328.754 L
447.282 329.045 L
447.976 329.336 L
448.67 329.627 L
449.365 329.917 L
450.059 330.206 L
450.754 330.495 L
451.448 330.784 L
452.142 331.072 L
452.837 331.359 L
453.531 331.646 L
454.226 331.933 L
454.92 332.219 L
455.614 332.505 L
456.309 332.79 L
457.003 333.075 L
457.698 333.359 L
458.392 333.643 L
459.086 333.926 L
459.781 334.209 L
460.475 334.491 L
461.17 334.773 L
461.864 335.054 L
462.558 335.335 L
463.253 335.615 L
463.947 335.895 L
464.642 336.175 L
465.336 336.454 L
466.03 336.732 L
466.725 337.01 L
467.419 337.288 L
468.114 337.565 L
468.808 337.842 L
469.502 338.118 L
470.197 338.394 L
470.891 338.669 L
471.586 338.944 L
472.28 339.218 L
472.974 339.492 L
473.669 339.766 L
474.363 340.039 L
475.058 340.311 L
475.752 340.583 L
476.446 340.855 L
477.141 341.126 L
477.835 341.397 L
478.53 341.667 L
479.224 341.937 L
479.918 342.206 L
480.613 342.475 L
481.307 342.743 L
482.002 343.011 L
482.696 343.279 L
483.39 343.546 L
484.085 343.813 L
484.779 344.079 L
485.474 344.345 L
486.168 344.61 L
486.862 344.875 L
487.557 345.139 L
488.251 345.403 L
488.946 345.667 L
489.64 345.93 L
490.334 346.193 L
491.029 346.455 L
491.723 346.717 L
492.418 346.978 L
493.112 347.239 L
493.806 347.499 L
494.501 347.759 L
495.195 348.019 L
495.89 348.278 L
496.584 348.537 L
497.278 348.795 L
497.973 349.053 L
498.667 349.31 L
499.362 349.567 L
500.056 349.824 L
500.75 350.08 L
501.445 350.336 L
502.139 350.591 L
502.834 350.846 L
503.528 351.1 L
504.222 351.354 L
504.917 351.608 L
505.611 351.861 L
506.306 352.114 L
507 352.366 L
S
GR
GS
[0.75 0 0 0.75 0 0] CT
1 GC
N
415 171 M
415 137 L
490 137 L
490 171 L
cp
f
GR
GS
[0.75 0 0 0.75 346.5 109.77174] CT
/Helvetica 12 F
GS
[1 0 0 1 0 0] CT
0 4.5 moveto 
1 -1 scale
(CN) t 
GR
GR
GS
[0.75 0 0 0.75 0 0] CT
0.929 0.694 0.125 RC
1 LJ
2 LW
N
419 146.362 M
459 146.362 L
S
GR
GS
[0.75 0 0 0.75 346.5 121.22826] CT
/Helvetica 12 F
GS
[1 0 0 1 0 0] CT
0 4.5 moveto 
1 -1 scale
(RK4) t 
GR
GR
GS
[0.75 0 0 0.75 0 0] CT
0.494 0.184 0.557 RC
[8 8] 0 setdash
2 LJ
2 LW
N
419 161.638 M
459 161.638 L
S
GR
GS
[0.75 0 0 0.75 0 0] CT
0.149 GC
10.0 ML
0.667 LW
N
415 171 M
415 137 L
490 137 L
490 171 L
cp
S
GR
%%Trailer
%%Pages: 1
%%EOF
