%!PS-Adobe-3.0 EPSF-3.0
%%Creator: (MATLAB, The Mathworks, Inc. Version 9.2.0.538062 \(R2017a\). Operating System: Windows 8)
%%Title: C:/Users/Laurent/Desktop/03/Fig8.eps
%%CreationDate: 2017-10-10T11:15:06
%%Pages: (atend)
%%BoundingBox: 0 0 420 315
%%LanguageLevel: 3
%%EndComments
%%BeginProlog
%%BeginResource: procset (Apache XML Graphics Std ProcSet) 1.2 0
%%Version: 1.2 0
%%Copyright: (Copyright 2001-2003,2010 The Apache Software Foundation. License terms: http://www.apache.org/licenses/LICENSE-2.0)
/bd{bind def}bind def
/ld{load def}bd
/GR/grestore ld
/M/moveto ld
/LJ/setlinejoin ld
/C/curveto ld
/f/fill ld
/LW/setlinewidth ld
/GC/setgray ld
/t/show ld
/N/newpath ld
/CT/concat ld
/cp/closepath ld
/S/stroke ld
/L/lineto ld
/CC/setcmykcolor ld
/A/ashow ld
/GS/gsave ld
/RC/setrgbcolor ld
/RM/rmoveto ld
/ML/setmiterlimit ld
/re {4 2 roll M
1 index 0 rlineto
0 exch rlineto
neg 0 rlineto
cp } bd
/_ctm matrix def
/_tm matrix def
/BT { _ctm currentmatrix pop matrix _tm copy pop 0 0 moveto } bd
/ET { _ctm setmatrix } bd
/iTm { _ctm setmatrix _tm concat } bd
/Tm { _tm astore pop iTm 0 0 moveto } bd
/ux 0.0 def
/uy 0.0 def
/F {
  /Tp exch def
  /Tf exch def
  Tf findfont Tp scalefont setfont
  /cf Tf def  /cs Tp def
} bd
/ULS {currentpoint /uy exch def /ux exch def} bd
/ULE {
  /Tcx currentpoint pop def
  gsave
  newpath
  cf findfont cs scalefont dup
  /FontMatrix get 0 get /Ts exch def /FontInfo get dup
  /UnderlinePosition get Ts mul /To exch def
  /UnderlineThickness get Ts mul /Tt exch def
  ux uy To add moveto  Tcx uy To add lineto
  Tt setlinewidth stroke
  grestore
} bd
/OLE {
  /Tcx currentpoint pop def
  gsave
  newpath
  cf findfont cs scalefont dup
  /FontMatrix get 0 get /Ts exch def /FontInfo get dup
  /UnderlinePosition get Ts mul /To exch def
  /UnderlineThickness get Ts mul /Tt exch def
  ux uy To add cs add moveto Tcx uy To add cs add lineto
  Tt setlinewidth stroke
  grestore
} bd
/SOE {
  /Tcx currentpoint pop def
  gsave
  newpath
  cf findfont cs scalefont dup
  /FontMatrix get 0 get /Ts exch def /FontInfo get dup
  /UnderlinePosition get Ts mul /To exch def
  /UnderlineThickness get Ts mul /Tt exch def
  ux uy To add cs 10 mul 26 idiv add moveto Tcx uy To add cs 10 mul 26 idiv add lineto
  Tt setlinewidth stroke
  grestore
} bd
/QT {
/Y22 exch store
/X22 exch store
/Y21 exch store
/X21 exch store
currentpoint
/Y21 load 2 mul add 3 div exch
/X21 load 2 mul add 3 div exch
/X21 load 2 mul /X22 load add 3 div
/Y21 load 2 mul /Y22 load add 3 div
/X22 load /Y22 load curveto
} bd
/SSPD {
dup length /d exch dict def
{
/v exch def
/k exch def
currentpagedevice k known {
/cpdv currentpagedevice k get def
v cpdv ne {
/upd false def
/nullv v type /nulltype eq def
/nullcpdv cpdv type /nulltype eq def
nullv nullcpdv or
{
/upd true def
} {
/sametype v type cpdv type eq def
sametype {
v type /arraytype eq {
/vlen v length def
/cpdvlen cpdv length def
vlen cpdvlen eq {
0 1 vlen 1 sub {
/i exch def
/obj v i get def
/cpdobj cpdv i get def
obj cpdobj ne {
/upd true def
exit
} if
} for
} {
/upd true def
} ifelse
} {
v type /dicttype eq {
v {
/dv exch def
/dk exch def
/cpddv cpdv dk get def
dv cpddv ne {
/upd true def
exit
} if
} forall
} {
/upd true def
} ifelse
} ifelse
} if
} ifelse
upd true eq {
d k v put
} if
} if
} if
} forall
d length 0 gt {
d setpagedevice
} if
} bd
/RE { % /NewFontName [NewEncodingArray] /FontName RE -
  findfont dup length dict begin
  {
    1 index /FID ne
    {def} {pop pop} ifelse
  } forall
  /Encoding exch def
  /FontName 1 index def
  currentdict definefont pop
  end
} bind def
%%EndResource
%%BeginResource: procset (Apache XML Graphics EPS ProcSet) 1.0 0
%%Version: 1.0 0
%%Copyright: (Copyright 2002-2003 The Apache Software Foundation. License terms: http://www.apache.org/licenses/LICENSE-2.0)
/BeginEPSF { %def
/b4_Inc_state save def         % Save state for cleanup
/dict_count countdictstack def % Count objects on dict stack
/op_count count 1 sub def      % Count objects on operand stack
userdict begin                 % Push userdict on dict stack
/showpage { } def              % Redefine showpage, { } = null proc
0 setgray 0 setlinecap         % Prepare graphics state
1 setlinewidth 0 setlinejoin
10 setmiterlimit [ ] 0 setdash newpath
/languagelevel where           % If level not equal to 1 then
{pop languagelevel             % set strokeadjust and
1 ne                           % overprint to their defaults.
{false setstrokeadjust false setoverprint
} if
} if
} bd
/EndEPSF { %def
count op_count sub {pop} repeat            % Clean up stacks
countdictstack dict_count sub {end} repeat
b4_Inc_state restore
} bd
%%EndResource
%FOPBeginFontDict
%%IncludeResource: font Courier-Bold
%%IncludeResource: font Helvetica
%%IncludeResource: font Courier-BoldOblique
%%IncludeResource: font Courier-Oblique
%%IncludeResource: font Times-Roman
%%IncludeResource: font Helvetica-BoldOblique
%%IncludeResource: font Helvetica-Bold
%%IncludeResource: font Helvetica-Oblique
%%IncludeResource: font Times-BoldItalic
%%IncludeResource: font Courier
%%IncludeResource: font Times-Italic
%%IncludeResource: font Times-Bold
%%IncludeResource: font Symbol
%%IncludeResource: font ZapfDingbats
%FOPEndFontDict
%%BeginResource: encoding WinAnsiEncoding
/WinAnsiEncoding [
/.notdef /.notdef /.notdef /.notdef /.notdef
/.notdef /.notdef /.notdef /.notdef /.notdef
/.notdef /.notdef /.notdef /.notdef /.notdef
/.notdef /.notdef /.notdef /.notdef /.notdef
/.notdef /.notdef /.notdef /.notdef /.notdef
/.notdef /.notdef /.notdef /.notdef /.notdef
/.notdef /.notdef /space /exclam /quotedbl
/numbersign /dollar /percent /ampersand /quotesingle
/parenleft /parenright /asterisk /plus /comma
/hyphen /period /slash /zero /one
/two /three /four /five /six
/seven /eight /nine /colon /semicolon
/less /equal /greater /question /at
/A /B /C /D /E
/F /G /H /I /J
/K /L /M /N /O
/P /Q /R /S /T
/U /V /W /X /Y
/Z /bracketleft /backslash /bracketright /asciicircum
/underscore /quoteleft /a /b /c
/d /e /f /g /h
/i /j /k /l /m
/n /o /p /q /r
/s /t /u /v /w
/x /y /z /braceleft /bar
/braceright /asciitilde /bullet /Euro /bullet
/quotesinglbase /florin /quotedblbase /ellipsis /dagger
/daggerdbl /circumflex /perthousand /Scaron /guilsinglleft
/OE /bullet /Zcaron /bullet /bullet
/quoteleft /quoteright /quotedblleft /quotedblright /bullet
/endash /emdash /asciitilde /trademark /scaron
/guilsinglright /oe /bullet /zcaron /Ydieresis
/space /exclamdown /cent /sterling /currency
/yen /brokenbar /section /dieresis /copyright
/ordfeminine /guillemotleft /logicalnot /sfthyphen /registered
/macron /degree /plusminus /twosuperior /threesuperior
/acute /mu /paragraph /middot /cedilla
/onesuperior /ordmasculine /guillemotright /onequarter /onehalf
/threequarters /questiondown /Agrave /Aacute /Acircumflex
/Atilde /Adieresis /Aring /AE /Ccedilla
/Egrave /Eacute /Ecircumflex /Edieresis /Igrave
/Iacute /Icircumflex /Idieresis /Eth /Ntilde
/Ograve /Oacute /Ocircumflex /Otilde /Odieresis
/multiply /Oslash /Ugrave /Uacute /Ucircumflex
/Udieresis /Yacute /Thorn /germandbls /agrave
/aacute /acircumflex /atilde /adieresis /aring
/ae /ccedilla /egrave /eacute /ecircumflex
/edieresis /igrave /iacute /icircumflex /idieresis
/eth /ntilde /ograve /oacute /ocircumflex
/otilde /odieresis /divide /oslash /ugrave
/uacute /ucircumflex /udieresis /yacute /thorn
/ydieresis
] def
%%EndResource
%FOPBeginFontReencode
/Courier-Bold findfont
dup length dict begin
  {1 index /FID ne {def} {pop pop} ifelse} forall
  /Encoding WinAnsiEncoding def
  currentdict
end
/Courier-Bold exch definefont pop
/Helvetica findfont
dup length dict begin
  {1 index /FID ne {def} {pop pop} ifelse} forall
  /Encoding WinAnsiEncoding def
  currentdict
end
/Helvetica exch definefont pop
/Courier-BoldOblique findfont
dup length dict begin
  {1 index /FID ne {def} {pop pop} ifelse} forall
  /Encoding WinAnsiEncoding def
  currentdict
end
/Courier-BoldOblique exch definefont pop
/Courier-Oblique findfont
dup length dict begin
  {1 index /FID ne {def} {pop pop} ifelse} forall
  /Encoding WinAnsiEncoding def
  currentdict
end
/Courier-Oblique exch definefont pop
/Times-Roman findfont
dup length dict begin
  {1 index /FID ne {def} {pop pop} ifelse} forall
  /Encoding WinAnsiEncoding def
  currentdict
end
/Times-Roman exch definefont pop
/Helvetica-BoldOblique findfont
dup length dict begin
  {1 index /FID ne {def} {pop pop} ifelse} forall
  /Encoding WinAnsiEncoding def
  currentdict
end
/Helvetica-BoldOblique exch definefont pop
/Helvetica-Bold findfont
dup length dict begin
  {1 index /FID ne {def} {pop pop} ifelse} forall
  /Encoding WinAnsiEncoding def
  currentdict
end
/Helvetica-Bold exch definefont pop
/Helvetica-Oblique findfont
dup length dict begin
  {1 index /FID ne {def} {pop pop} ifelse} forall
  /Encoding WinAnsiEncoding def
  currentdict
end
/Helvetica-Oblique exch definefont pop
/Times-BoldItalic findfont
dup length dict begin
  {1 index /FID ne {def} {pop pop} ifelse} forall
  /Encoding WinAnsiEncoding def
  currentdict
end
/Times-BoldItalic exch definefont pop
/Courier findfont
dup length dict begin
  {1 index /FID ne {def} {pop pop} ifelse} forall
  /Encoding WinAnsiEncoding def
  currentdict
end
/Courier exch definefont pop
/Times-Italic findfont
dup length dict begin
  {1 index /FID ne {def} {pop pop} ifelse} forall
  /Encoding WinAnsiEncoding def
  currentdict
end
/Times-Italic exch definefont pop
/Times-Bold findfont
dup length dict begin
  {1 index /FID ne {def} {pop pop} ifelse} forall
  /Encoding WinAnsiEncoding def
  currentdict
end
/Times-Bold exch definefont pop
%FOPEndFontReencode
%%EndProlog
%%Page: 1 1
%%PageBoundingBox: 0 0 420 315
%%BeginPageSetup
[1 0 0 -1 0 315] CT
%%EndPageSetup
GS
[0.6 0 0 0.6 0 0] CT
1 GC
N
0 0 700 525 re
f
GR
GS
[0.6 0 0 0.6 0 0] CT
1 GC
N
0 0 700 525 re
f
GR
GS
[0.6 0 0 0.6 0 0] CT
1 GC
N
73 420.613 M
506 420.613 L
506 85.387 L
73 85.387 L
cp
f
GR
GS
[0.6 0 0 0.6 0 0] CT
0.149 GC
2 setlinecap
1 LJ
0.833 LW
N
73 420.613 M
506 420.613 L
S
GR
GS
[0.6 0 0 0.6 0 0] CT
0.149 GC
2 setlinecap
1 LJ
0.833 LW
N
73 85.387 M
506 85.387 L
S
GR
GS
[0.6 0 0 0.6 0 0] CT
0.149 GC
2 setlinecap
1 LJ
0.833 LW
N
86.968 420.613 M
86.968 416.283 L
S
GR
GS
[0.6 0 0 0.6 0 0] CT
0.149 GC
2 setlinecap
1 LJ
0.833 LW
N
156.806 420.613 M
156.806 416.283 L
S
GR
GS
[0.6 0 0 0.6 0 0] CT
0.149 GC
2 setlinecap
1 LJ
0.833 LW
N
226.645 420.613 M
226.645 416.283 L
S
GR
GS
[0.6 0 0 0.6 0 0] CT
0.149 GC
2 setlinecap
1 LJ
0.833 LW
N
296.484 420.613 M
296.484 416.283 L
S
GR
GS
[0.6 0 0 0.6 0 0] CT
0.149 GC
2 setlinecap
1 LJ
0.833 LW
N
366.323 420.613 M
366.323 416.283 L
S
GR
GS
[0.6 0 0 0.6 0 0] CT
0.149 GC
2 setlinecap
1 LJ
0.833 LW
N
436.161 420.613 M
436.161 416.283 L
S
GR
GS
[0.6 0 0 0.6 0 0] CT
0.149 GC
2 setlinecap
1 LJ
0.833 LW
N
506 420.613 M
506 416.283 L
S
GR
GS
[0.6 0 0 0.6 0 0] CT
0.149 GC
2 setlinecap
1 LJ
0.833 LW
N
86.968 85.387 M
86.968 89.717 L
S
GR
GS
[0.6 0 0 0.6 0 0] CT
0.149 GC
2 setlinecap
1 LJ
0.833 LW
N
156.806 85.387 M
156.806 89.717 L
S
GR
GS
[0.6 0 0 0.6 0 0] CT
0.149 GC
2 setlinecap
1 LJ
0.833 LW
N
226.645 85.387 M
226.645 89.717 L
S
GR
GS
[0.6 0 0 0.6 0 0] CT
0.149 GC
2 setlinecap
1 LJ
0.833 LW
N
296.484 85.387 M
296.484 89.717 L
S
GR
GS
[0.6 0 0 0.6 0 0] CT
0.149 GC
2 setlinecap
1 LJ
0.833 LW
N
366.323 85.387 M
366.323 89.717 L
S
GR
GS
[0.6 0 0 0.6 0 0] CT
0.149 GC
2 setlinecap
1 LJ
0.833 LW
N
436.161 85.387 M
436.161 89.717 L
S
GR
GS
[0.6 0 0 0.6 0 0] CT
0.149 GC
2 setlinecap
1 LJ
0.833 LW
N
506 85.387 M
506 89.717 L
S
GR
GS
[0.6 0 0 0.6 52.18065 256.36774] CT
0.149 GC
/Helvetica 16.667 F
GS
[1 0 0 1 0 0] CT
-5 18 moveto 
1 -1 scale
(0) t 
GR
GR
GS
[0.6 0 0 0.6 94.08387 256.36774] CT
0.149 GC
/Helvetica 16.667 F
GS
[1 0 0 1 0 0] CT
-5 18 moveto 
1 -1 scale
(5) t 
GR
GR
GS
[0.6 0 0 0.6 135.98709 256.36774] CT
0.149 GC
/Helvetica 16.667 F
GS
[1 0 0 1 0 0] CT
-9.5 18 moveto 
1 -1 scale
(10) t 
GR
GR
GS
[0.6 0 0 0.6 177.89031 256.36774] CT
0.149 GC
/Helvetica 16.667 F
GS
[1 0 0 1 0 0] CT
-9.5 18 moveto 
1 -1 scale
(15) t 
GR
GR
GS
[0.6 0 0 0.6 219.79354 256.36774] CT
0.149 GC
/Helvetica 16.667 F
GS
[1 0 0 1 0 0] CT
-9.5 18 moveto 
1 -1 scale
(20) t 
GR
GR
GS
[0.6 0 0 0.6 261.69677 256.36774] CT
0.149 GC
/Helvetica 16.667 F
GS
[1 0 0 1 0 0] CT
-9.5 18 moveto 
1 -1 scale
(25) t 
GR
GR
GS
[0.6 0 0 0.6 303.6 256.36774] CT
0.149 GC
/Helvetica 16.667 F
GS
[1 0 0 1 0 0] CT
-9.5 18 moveto 
1 -1 scale
(30) t 
GR
GR
GS
[0.6 0 0 0.6 173.70013 270.56774] CT
0.149 GC
N
-42.628 22.4 M
-42.628 21.447 L
-39.847 21.447 -39.847 20.587 QT
-39.847 5.759 L
-39.847 4.9 -42.628 4.9 QT
-42.628 3.962 L
-34.144 3.962 L
-32.628 3.962 -30.964 4.509 QT
-29.3 5.056 -28.175 6.173 QT
-27.05 7.291 -27.05 8.853 QT
-27.05 9.978 -27.73 10.869 QT
-28.409 11.759 -29.472 12.361 QT
-30.534 12.962 -31.644 13.228 QT
-30.425 13.65 -29.519 14.572 QT
-28.612 15.494 -28.425 16.681 QT
-28.034 19.072 L
-27.784 20.697 -27.487 21.494 QT
-27.19 22.291 -26.206 22.291 QT
-25.362 22.291 -24.948 21.509 QT
-24.534 20.728 -24.534 19.806 QT
-24.534 19.712 -24.448 19.642 QT
-24.362 19.572 -24.269 19.572 QT
-24.019 19.572 L
-23.753 19.572 -23.753 19.916 QT
-23.753 20.666 -24.042 21.369 QT
-24.331 22.072 -24.878 22.533 QT
-25.425 22.994 -26.175 22.994 QT
-28.128 22.994 -29.534 22.025 QT
-30.94 21.056 -30.94 19.181 QT
-30.94 16.791 L
-30.94 15.431 -31.878 14.47 QT
-32.815 13.509 -34.175 13.509 QT
-37.409 13.509 L
-37.409 20.587 L
-37.409 21.447 -34.628 21.447 QT
-34.628 22.4 L
-42.628 22.4 L
cp
-37.409 12.822 M
-34.534 12.822 L
-32.284 12.822 -31.112 11.916 QT
-29.94 11.009 -29.94 8.853 QT
-29.94 6.697 -31.097 5.798 QT
-32.253 4.9 -34.534 4.9 QT
-36.05 4.9 L
-36.534 4.9 -36.8 4.939 QT
-37.065 4.978 -37.237 5.173 QT
-37.409 5.369 -37.409 5.759 QT
-37.409 12.822 L
cp
f
GR
GS
[0.6 0 0 0.6 173.70013 270.56774] CT
0.149 GC
N
-17.17 22.697 M
-18.811 22.697 -20.186 21.837 QT
-21.561 20.978 -22.35 19.533 QT
-23.139 18.087 -23.139 16.478 QT
-23.139 14.9 -22.42 13.478 QT
-21.701 12.056 -20.412 11.173 QT
-19.123 10.291 -17.545 10.291 QT
-16.311 10.291 -15.397 10.712 QT
-14.483 11.134 -13.889 11.869 QT
-13.295 12.603 -12.991 13.603 QT
-12.686 14.603 -12.686 15.806 QT
-12.686 16.166 -12.967 16.166 QT
-20.78 16.166 L
-20.78 16.447 L
-20.78 18.697 -19.873 20.306 QT
-18.967 21.916 -16.92 21.916 QT
-16.092 21.916 -15.389 21.548 QT
-14.686 21.181 -14.162 20.517 QT
-13.639 19.853 -13.467 19.103 QT
-13.436 19.009 -13.366 18.939 QT
-13.295 18.869 -13.201 18.869 QT
-12.967 18.869 L
-12.686 18.869 -12.686 19.212 QT
-13.061 20.744 -14.326 21.72 QT
-15.592 22.697 -17.17 22.697 QT
cp
-20.748 15.494 M
-14.592 15.494 L
-14.592 14.478 -14.873 13.439 QT
-15.155 12.4 -15.819 11.705 QT
-16.483 11.009 -17.545 11.009 QT
-19.076 11.009 -19.912 12.439 QT
-20.748 13.869 -20.748 15.494 QT
cp
f
GR
GS
[0.6 0 0 0.6 173.70013 270.56774] CT
0.149 GC
N
-10.959 19.744 M
-10.959 18.134 -9.693 17.126 QT
-8.428 16.119 -6.654 15.705 QT
-4.881 15.291 -3.287 15.291 QT
-3.287 14.181 L
-3.287 13.416 -3.631 12.681 QT
-3.975 11.947 -4.615 11.478 QT
-5.256 11.009 -6.037 11.009 QT
-7.834 11.009 -8.771 11.806 QT
-8.256 11.806 -7.92 12.197 QT
-7.584 12.587 -7.584 13.103 QT
-7.584 13.65 -7.967 14.033 QT
-8.35 14.416 -8.865 14.416 QT
-9.412 14.416 -9.795 14.033 QT
-10.178 13.65 -10.178 13.103 QT
-10.178 11.681 -8.889 10.986 QT
-7.6 10.291 -6.037 10.291 QT
-4.943 10.291 -3.834 10.759 QT
-2.725 11.228 -2.021 12.103 QT
-1.318 12.978 -1.318 14.134 QT
-1.318 20.212 L
-1.318 20.744 -1.092 21.181 QT
-0.865 21.619 -0.396 21.619 QT
0.057 21.619 0.275 21.173 QT
0.494 20.728 0.494 20.212 QT
0.494 18.478 L
1.275 18.478 L
1.275 20.212 L
1.275 20.822 0.963 21.369 QT
0.65 21.916 0.111 22.236 QT
-0.428 22.556 -1.037 22.556 QT
-1.834 22.556 -2.404 21.947 QT
-2.975 21.337 -3.053 20.494 QT
-3.553 21.509 -4.521 22.103 QT
-5.49 22.697 -6.6 22.697 QT
-7.631 22.697 -8.631 22.4 QT
-9.631 22.103 -10.295 21.447 QT
-10.959 20.791 -10.959 19.744 QT
cp
-8.771 19.744 M
-8.771 20.697 -8.068 21.345 QT
-7.365 21.994 -6.428 21.994 QT
-5.553 21.994 -4.842 21.556 QT
-4.131 21.119 -3.709 20.369 QT
-3.287 19.619 -3.287 18.791 QT
-3.287 15.978 L
-4.506 15.978 -5.795 16.384 QT
-7.084 16.791 -7.928 17.642 QT
-8.771 18.494 -8.771 19.744 QT
cp
f
GR
GS
[0.6 0 0 0.6 173.70013 270.56774] CT
0.149 GC
N
2.124 22.4 M
2.124 21.447 L
3.046 21.447 3.64 21.306 QT
4.234 21.166 4.234 20.587 QT
4.234 6.416 L
4.234 5.697 4.015 5.376 QT
3.796 5.056 3.39 4.978 QT
2.984 4.9 2.124 4.9 QT
2.124 3.962 L
6.14 3.666 L
6.14 20.587 L
6.14 21.166 6.734 21.306 QT
7.328 21.447 8.234 21.447 QT
8.234 22.4 L
2.124 22.4 L
cp
f
GR
GS
[0.6 0 0 0.6 173.70013 270.56774] CT
0.149 GC
N
17.079 29.103 M
15.579 27.916 14.485 26.376 QT
13.391 24.837 12.704 23.095 QT
12.016 21.353 11.672 19.455 QT
11.329 17.556 11.329 15.65 QT
11.329 13.712 11.672 11.814 QT
12.016 9.916 12.719 8.166 QT
13.422 6.416 14.516 4.884 QT
15.61 3.353 17.079 2.197 QT
17.079 2.15 17.204 2.15 QT
17.454 2.15 L
17.532 2.15 17.602 2.22 QT
17.672 2.291 17.672 2.384 QT
17.672 2.509 17.61 2.556 QT
16.297 3.853 15.422 5.33 QT
14.547 6.806 14.008 8.47 QT
13.469 10.134 13.235 11.923 QT
13.001 13.712 13.001 15.65 QT
13.001 24.228 17.594 28.681 QT
17.672 28.775 17.672 28.916 QT
17.672 28.978 17.594 29.064 QT
17.516 29.15 17.454 29.15 QT
17.204 29.15 L
17.079 29.15 17.079 29.103 QT
cp
f
GR
GS
[0.6 0 0 0.6 173.70013 270.56774] CT
0.149 GC
N
19.402 22.4 M
19.402 21.447 L
20.433 21.447 21.34 21.048 QT
22.246 20.65 22.887 19.853 QT
25.34 16.728 L
22.152 12.572 L
21.668 11.978 21.113 11.845 QT
20.558 11.712 19.543 11.712 QT
19.543 10.759 L
25.152 10.759 L
25.152 11.712 L
24.793 11.712 24.488 11.869 QT
24.183 12.025 24.183 12.322 QT
24.183 12.431 24.262 12.572 QT
26.418 15.384 L
28.043 13.306 L
28.371 12.9 28.371 12.509 QT
28.371 12.181 28.152 11.947 QT
27.933 11.712 27.574 11.712 QT
27.574 10.759 L
32.543 10.759 L
32.543 11.712 L
31.512 11.712 30.59 12.111 QT
29.668 12.509 29.043 13.306 QT
26.902 16.025 L
30.355 20.587 L
30.871 21.181 31.426 21.314 QT
31.98 21.447 33.012 21.447 QT
33.012 22.4 L
27.387 22.4 L
27.387 21.447 L
27.73 21.447 28.027 21.291 QT
28.324 21.134 28.324 20.837 QT
28.324 20.712 28.246 20.587 QT
25.824 17.384 L
23.887 19.853 L
23.59 20.197 23.59 20.65 QT
23.59 20.978 23.808 21.212 QT
24.027 21.447 24.34 21.447 QT
24.34 22.4 L
19.402 22.4 L
cp
f
GR
GS
[0.6 0 0 0.6 173.70013 270.56774] CT
0.149 GC
N
34.898 29.15 M
34.664 29.15 34.664 28.916 QT
34.664 28.791 34.711 28.744 QT
39.336 24.228 39.336 15.65 QT
39.336 7.072 34.773 2.619 QT
34.664 2.541 34.664 2.384 QT
34.664 2.291 34.734 2.22 QT
34.804 2.15 34.898 2.15 QT
35.148 2.15 L
35.226 2.15 35.289 2.197 QT
37.226 3.728 38.515 5.916 QT
39.804 8.103 40.406 10.587 QT
41.008 13.072 41.008 15.65 QT
41.008 17.556 40.687 19.408 QT
40.367 21.259 39.656 23.064 QT
38.945 24.869 37.867 26.392 QT
36.789 27.916 35.289 29.103 QT
35.226 29.15 35.148 29.15 QT
34.898 29.15 L
cp
f
GR
GS
[0.6 0 0 0.6 0 0] CT
0.149 GC
2 setlinecap
1 LJ
0.833 LW
N
73 420.613 M
73 85.387 L
S
GR
GS
[0.6 0 0 0.6 0 0] CT
0.149 GC
2 setlinecap
1 LJ
0.833 LW
N
506 420.613 M
506 85.387 L
S
GR
GS
[0.6 0 0 0.6 0 0] CT
0.149 GC
2 setlinecap
1 LJ
0.833 LW
N
73 392.677 M
77.33 392.677 L
S
GR
GS
[0.6 0 0 0.6 0 0] CT
0.149 GC
2 setlinecap
1 LJ
0.833 LW
N
73 322.839 M
77.33 322.839 L
S
GR
GS
[0.6 0 0 0.6 0 0] CT
0.149 GC
2 setlinecap
1 LJ
0.833 LW
N
73 253 M
77.33 253 L
S
GR
GS
[0.6 0 0 0.6 0 0] CT
0.149 GC
2 setlinecap
1 LJ
0.833 LW
N
73 183.161 M
77.33 183.161 L
S
GR
GS
[0.6 0 0 0.6 0 0] CT
0.149 GC
2 setlinecap
1 LJ
0.833 LW
N
73 113.323 M
77.33 113.323 L
S
GR
GS
[0.6 0 0 0.6 0 0] CT
0.149 GC
2 setlinecap
1 LJ
0.833 LW
N
506 392.677 M
501.67 392.677 L
S
GR
GS
[0.6 0 0 0.6 0 0] CT
0.149 GC
2 setlinecap
1 LJ
0.833 LW
N
506 322.839 M
501.67 322.839 L
S
GR
GS
[0.6 0 0 0.6 0 0] CT
0.149 GC
2 setlinecap
1 LJ
0.833 LW
N
506 253 M
501.67 253 L
S
GR
GS
[0.6 0 0 0.6 0 0] CT
0.149 GC
2 setlinecap
1 LJ
0.833 LW
N
506 183.161 M
501.67 183.161 L
S
GR
GS
[0.6 0 0 0.6 0 0] CT
0.149 GC
2 setlinecap
1 LJ
0.833 LW
N
506 113.323 M
501.67 113.323 L
S
GR
GS
[0.6 0 0 0.6 39.8 235.60646] CT
0.149 GC
/Helvetica 16.667 F
GS
[1 0 0 1 0 0] CT
-25 7 moveto 
1 -1 scale
(-10) t 
GR
GR
GS
[0.6 0 0 0.6 39.8 193.70323] CT
0.149 GC
/Helvetica 16.667 F
GS
[1 0 0 1 0 0] CT
-16 7 moveto 
1 -1 scale
(-5) t 
GR
GR
GS
[0.6 0 0 0.6 39.8 151.8] CT
0.149 GC
/Helvetica 16.667 F
GS
[1 0 0 1 0 0] CT
-10 7 moveto 
1 -1 scale
(0) t 
GR
GR
GS
[0.6 0 0 0.6 39.8 109.89677] CT
0.149 GC
/Helvetica 16.667 F
GS
[1 0 0 1 0 0] CT
-10 7 moveto 
1 -1 scale
(5) t 
GR
GR
GS
[0.6 0 0 0.6 39.8 67.99355] CT
0.149 GC
/Helvetica 16.667 F
GS
[1 0 0 1 0 0] CT
-19 7 moveto 
1 -1 scale
(10) t 
GR
GR
GS
[0 -0.6 0.6 0 21.8 151.79991] CT
0.149 GC
N
-45.964 -9.6 M
-45.964 -10.553 L
-43.057 -10.553 -43.057 -11.413 QT
-43.057 -26.241 L
-43.057 -27.1 -45.964 -27.1 QT
-45.964 -28.038 L
-37.62 -28.038 L
-37.62 -27.1 L
-40.542 -27.1 -40.542 -26.241 QT
-40.542 -11.413 L
-40.542 -10.553 -37.62 -10.553 QT
-37.62 -9.6 L
-45.964 -9.6 L
cp
f
GR
GS
[0 -0.6 0.6 0 21.8 151.79991] CT
0.149 GC
N
-36.24 -9.6 M
-36.24 -10.553 L
-35.303 -10.553 -34.717 -10.694 QT
-34.131 -10.834 -34.131 -11.413 QT
-34.131 -18.772 L
-34.131 -19.506 -34.342 -19.827 QT
-34.553 -20.147 -34.967 -20.217 QT
-35.381 -20.288 -36.24 -20.288 QT
-36.24 -21.241 L
-32.318 -21.538 L
-32.318 -18.897 L
-31.772 -20.053 -30.709 -20.795 QT
-29.647 -21.538 -28.397 -21.538 QT
-25.287 -21.538 -24.756 -19.006 QT
-24.209 -20.131 -23.17 -20.834 QT
-22.131 -21.538 -20.881 -21.538 QT
-19.662 -21.538 -18.826 -21.139 QT
-17.99 -20.741 -17.568 -19.928 QT
-17.147 -19.116 -17.147 -17.897 QT
-17.147 -11.413 L
-17.147 -10.834 -16.545 -10.694 QT
-15.943 -10.553 -15.037 -10.553 QT
-15.037 -9.6 L
-21.209 -9.6 L
-21.209 -10.553 L
-20.287 -10.553 -19.693 -10.694 QT
-19.1 -10.834 -19.1 -11.413 QT
-19.1 -17.819 L
-19.1 -19.178 -19.482 -20.006 QT
-19.865 -20.834 -21.053 -20.834 QT
-22.615 -20.834 -23.631 -19.584 QT
-24.647 -18.334 -24.647 -16.725 QT
-24.647 -11.413 L
-24.647 -10.834 -24.053 -10.694 QT
-23.459 -10.553 -22.537 -10.553 QT
-22.537 -9.6 L
-28.725 -9.6 L
-28.725 -10.553 L
-27.803 -10.553 -27.209 -10.694 QT
-26.615 -10.834 -26.615 -11.413 QT
-26.615 -17.819 L
-26.615 -19.131 -26.998 -19.983 QT
-27.381 -20.834 -28.553 -20.834 QT
-30.131 -20.834 -31.139 -19.584 QT
-32.147 -18.334 -32.147 -16.725 QT
-32.147 -11.413 L
-32.147 -10.834 -31.553 -10.694 QT
-30.959 -10.553 -30.053 -10.553 QT
-30.053 -9.6 L
-36.24 -9.6 L
cp
f
GR
GS
[0 -0.6 0.6 0 21.8 151.79991] CT
0.149 GC
N
-13.737 -12.256 M
-13.737 -13.866 -12.471 -14.874 QT
-11.205 -15.881 -9.432 -16.295 QT
-7.659 -16.709 -6.065 -16.709 QT
-6.065 -17.819 L
-6.065 -18.584 -6.409 -19.319 QT
-6.752 -20.053 -7.393 -20.522 QT
-8.034 -20.991 -8.815 -20.991 QT
-10.612 -20.991 -11.549 -20.194 QT
-11.034 -20.194 -10.698 -19.803 QT
-10.362 -19.413 -10.362 -18.897 QT
-10.362 -18.35 -10.745 -17.967 QT
-11.127 -17.584 -11.643 -17.584 QT
-12.19 -17.584 -12.573 -17.967 QT
-12.955 -18.35 -12.955 -18.897 QT
-12.955 -20.319 -11.666 -21.014 QT
-10.377 -21.709 -8.815 -21.709 QT
-7.721 -21.709 -6.612 -21.241 QT
-5.502 -20.772 -4.799 -19.897 QT
-4.096 -19.022 -4.096 -17.866 QT
-4.096 -11.788 L
-4.096 -11.256 -3.87 -10.819 QT
-3.643 -10.381 -3.174 -10.381 QT
-2.721 -10.381 -2.502 -10.827 QT
-2.284 -11.272 -2.284 -11.788 QT
-2.284 -13.522 L
-1.502 -13.522 L
-1.502 -11.788 L
-1.502 -11.178 -1.815 -10.631 QT
-2.127 -10.084 -2.666 -9.764 QT
-3.205 -9.444 -3.815 -9.444 QT
-4.612 -9.444 -5.182 -10.053 QT
-5.752 -10.663 -5.83 -11.506 QT
-6.33 -10.491 -7.299 -9.897 QT
-8.268 -9.303 -9.377 -9.303 QT
-10.409 -9.303 -11.409 -9.6 QT
-12.409 -9.897 -13.073 -10.553 QT
-13.737 -11.209 -13.737 -12.256 QT
cp
-11.549 -12.256 M
-11.549 -11.303 -10.846 -10.655 QT
-10.143 -10.006 -9.205 -10.006 QT
-8.33 -10.006 -7.62 -10.444 QT
-6.909 -10.881 -6.487 -11.631 QT
-6.065 -12.381 -6.065 -13.209 QT
-6.065 -16.022 L
-7.284 -16.022 -8.573 -15.616 QT
-9.862 -15.209 -10.705 -14.358 QT
-11.549 -13.506 -11.549 -12.256 QT
cp
f
GR
GS
[0 -0.6 0.6 0 21.8 151.79991] CT
0.149 GC
N
-0.731 -7.491 M
-0.731 -8.459 -0.028 -9.178 QT
0.675 -9.897 1.628 -10.194 QT
1.097 -10.6 0.808 -11.217 QT
0.519 -11.834 0.519 -12.538 QT
0.519 -13.803 1.331 -14.788 QT
0.081 -15.991 0.081 -17.569 QT
0.081 -18.413 0.448 -19.147 QT
0.815 -19.881 1.464 -20.42 QT
2.112 -20.959 2.901 -21.249 QT
3.69 -21.538 4.519 -21.538 QT
6.128 -21.538 7.409 -20.6 QT
7.956 -21.194 8.714 -21.514 QT
9.472 -21.834 10.284 -21.834 QT
10.878 -21.834 11.245 -21.42 QT
11.612 -21.006 11.612 -20.428 QT
11.612 -20.1 11.362 -19.85 QT
11.112 -19.6 10.784 -19.6 QT
10.44 -19.6 10.19 -19.85 QT
9.94 -20.1 9.94 -20.428 QT
9.94 -20.928 10.269 -21.116 QT
8.862 -21.116 7.862 -20.163 QT
8.347 -19.678 8.644 -18.967 QT
8.94 -18.256 8.94 -17.569 QT
8.94 -16.413 8.308 -15.499 QT
7.675 -14.584 6.644 -14.077 QT
5.612 -13.569 4.519 -13.569 QT
3.034 -13.569 1.815 -14.366 QT
1.425 -13.85 1.425 -13.194 QT
1.425 -12.475 1.894 -11.944 QT
2.362 -11.413 3.081 -11.413 QT
5.3 -11.413 L
6.909 -11.413 8.198 -11.116 QT
9.487 -10.819 10.362 -9.952 QT
11.237 -9.084 11.237 -7.491 QT
11.237 -6.303 10.237 -5.522 QT
9.237 -4.741 7.847 -4.389 QT
6.456 -4.038 5.269 -4.038 QT
4.065 -4.038 2.667 -4.389 QT
1.269 -4.741 0.269 -5.522 QT
-0.731 -6.303 -0.731 -7.491 QT
cp
0.784 -7.491 M
0.784 -6.584 1.526 -5.967 QT
2.269 -5.35 3.308 -5.053 QT
4.347 -4.756 5.269 -4.756 QT
6.175 -4.756 7.222 -5.053 QT
8.269 -5.35 8.995 -5.967 QT
9.722 -6.584 9.722 -7.491 QT
9.722 -8.897 8.433 -9.311 QT
7.144 -9.725 5.3 -9.725 QT
3.081 -9.725 L
2.456 -9.725 1.94 -9.428 QT
1.425 -9.131 1.104 -8.6 QT
0.784 -8.069 0.784 -7.491 QT
cp
4.519 -14.288 M
6.815 -14.288 6.815 -17.569 QT
6.815 -18.975 6.323 -19.889 QT
5.831 -20.803 4.519 -20.803 QT
3.206 -20.803 2.714 -19.889 QT
2.222 -18.975 2.222 -17.569 QT
2.222 -16.663 2.409 -15.936 QT
2.597 -15.209 3.097 -14.749 QT
3.597 -14.288 4.519 -14.288 QT
cp
f
GR
GS
[0 -0.6 0.6 0 21.8 151.79991] CT
0.149 GC
N
20.227 -2.897 M
18.727 -4.084 17.633 -5.624 QT
16.539 -7.163 15.852 -8.905 QT
15.164 -10.647 14.821 -12.545 QT
14.477 -14.444 14.477 -16.35 QT
14.477 -18.288 14.821 -20.186 QT
15.164 -22.084 15.868 -23.834 QT
16.571 -25.584 17.664 -27.116 QT
18.758 -28.647 20.227 -29.803 QT
20.227 -29.85 20.352 -29.85 QT
20.602 -29.85 L
20.68 -29.85 20.75 -29.78 QT
20.821 -29.709 20.821 -29.616 QT
20.821 -29.491 20.758 -29.444 QT
19.446 -28.147 18.571 -26.67 QT
17.696 -25.194 17.157 -23.53 QT
16.618 -21.866 16.383 -20.077 QT
16.149 -18.288 16.149 -16.35 QT
16.149 -7.772 20.743 -3.319 QT
20.821 -3.225 20.821 -3.084 QT
20.821 -3.022 20.743 -2.936 QT
20.664 -2.85 20.602 -2.85 QT
20.352 -2.85 L
20.227 -2.85 20.227 -2.897 QT
cp
f
GR
GS
[0 -0.6 0.6 0 21.8 151.79991] CT
0.149 GC
N
22.55 -9.6 M
22.55 -10.553 L
23.582 -10.553 24.488 -10.952 QT
25.394 -11.35 26.035 -12.147 QT
28.488 -15.272 L
25.3 -19.428 L
24.816 -20.022 24.261 -20.155 QT
23.707 -20.288 22.691 -20.288 QT
22.691 -21.241 L
28.3 -21.241 L
28.3 -20.288 L
27.941 -20.288 27.636 -20.131 QT
27.332 -19.975 27.332 -19.678 QT
27.332 -19.569 27.41 -19.428 QT
29.566 -16.616 L
31.191 -18.694 L
31.519 -19.1 31.519 -19.491 QT
31.519 -19.819 31.3 -20.053 QT
31.082 -20.288 30.722 -20.288 QT
30.722 -21.241 L
35.691 -21.241 L
35.691 -20.288 L
34.66 -20.288 33.738 -19.889 QT
32.816 -19.491 32.191 -18.694 QT
30.05 -15.975 L
33.504 -11.413 L
34.019 -10.819 34.574 -10.686 QT
35.129 -10.553 36.16 -10.553 QT
36.16 -9.6 L
30.535 -9.6 L
30.535 -10.553 L
30.879 -10.553 31.175 -10.709 QT
31.472 -10.866 31.472 -11.163 QT
31.472 -11.288 31.394 -11.413 QT
28.972 -14.616 L
27.035 -12.147 L
26.738 -11.803 26.738 -11.35 QT
26.738 -11.022 26.957 -10.788 QT
27.175 -10.553 27.488 -10.553 QT
27.488 -9.6 L
22.55 -9.6 L
cp
f
GR
GS
[0 -0.6 0.6 0 21.8 151.79991] CT
0.149 GC
N
38.046 -2.85 M
37.812 -2.85 37.812 -3.084 QT
37.812 -3.209 37.859 -3.256 QT
42.484 -7.772 42.484 -16.35 QT
42.484 -24.928 37.921 -29.381 QT
37.812 -29.459 37.812 -29.616 QT
37.812 -29.709 37.882 -29.78 QT
37.953 -29.85 38.046 -29.85 QT
38.296 -29.85 L
38.375 -29.85 38.437 -29.803 QT
40.375 -28.272 41.664 -26.084 QT
42.953 -23.897 43.554 -21.413 QT
44.156 -18.928 44.156 -16.35 QT
44.156 -14.444 43.835 -12.592 QT
43.515 -10.741 42.804 -8.936 QT
42.093 -7.131 41.015 -5.608 QT
39.937 -4.084 38.437 -2.897 QT
38.375 -2.85 38.296 -2.85 QT
38.046 -2.85 L
cp
f
GR
GS
[0.6 0 0 0.6 173.70016 48.83226] CT
N
-137.739 -9.6 M
-137.739 -10.553 L
-134.958 -10.553 -134.958 -11.413 QT
-134.958 -26.241 L
-134.958 -27.1 -137.739 -27.1 QT
-137.739 -28.038 L
-127.786 -28.038 L
-125.927 -28.038 -124.403 -27.241 QT
-122.88 -26.444 -121.794 -25.116 QT
-120.708 -23.788 -120.122 -22.1 QT
-119.536 -20.413 -119.536 -18.647 QT
-119.536 -16.928 -120.13 -15.311 QT
-120.724 -13.694 -121.841 -12.397 QT
-122.958 -11.1 -124.481 -10.35 QT
-126.005 -9.6 -127.786 -9.6 QT
-137.739 -9.6 L
cp
-132.52 -11.413 M
-132.52 -10.819 -132.192 -10.686 QT
-131.864 -10.553 -131.161 -10.553 QT
-128.474 -10.553 L
-127.099 -10.553 -125.849 -11.155 QT
-124.599 -11.756 -123.786 -12.819 QT
-122.927 -13.944 -122.638 -15.35 QT
-122.349 -16.756 -122.349 -18.647 QT
-122.349 -20.616 -122.638 -22.092 QT
-122.927 -23.569 -123.786 -24.725 QT
-124.583 -25.866 -125.825 -26.483 QT
-127.067 -27.1 -128.474 -27.1 QT
-131.161 -27.1 L
-131.645 -27.1 -131.911 -27.061 QT
-132.177 -27.022 -132.349 -26.827 QT
-132.52 -26.631 -132.52 -26.241 QT
-132.52 -11.413 L
cp
f
GR
GS
[0.6 0 0 0.6 173.70016 48.83226] CT
N
-117.431 -9.6 M
-117.431 -10.553 L
-116.509 -10.553 -115.916 -10.694 QT
-115.322 -10.834 -115.322 -11.413 QT
-115.322 -18.772 L
-115.322 -19.819 -115.72 -20.053 QT
-116.119 -20.288 -117.306 -20.288 QT
-117.306 -21.241 L
-113.416 -21.538 L
-113.416 -11.413 L
-113.416 -10.834 -112.908 -10.694 QT
-112.4 -10.553 -111.541 -10.553 QT
-111.541 -9.6 L
-117.431 -9.6 L
cp
-116.275 -26.178 M
-116.275 -26.772 -115.83 -27.217 QT
-115.384 -27.663 -114.806 -27.663 QT
-114.416 -27.663 -114.064 -27.467 QT
-113.713 -27.272 -113.517 -26.913 QT
-113.322 -26.553 -113.322 -26.178 QT
-113.322 -25.584 -113.767 -25.139 QT
-114.213 -24.694 -114.806 -24.694 QT
-115.384 -24.694 -115.83 -25.139 QT
-116.275 -25.584 -116.275 -26.178 QT
cp
f
GR
GS
[0.6 0 0 0.6 173.70016 48.83226] CT
N
-109.961 -9.522 M
-109.961 -13.928 L
-109.961 -14.131 -109.711 -14.131 QT
-109.383 -14.131 L
-109.227 -14.131 -109.18 -13.928 QT
-108.43 -10.006 -105.54 -10.006 QT
-104.258 -10.006 -103.399 -10.584 QT
-102.54 -11.163 -102.54 -12.381 QT
-102.54 -13.256 -103.211 -13.866 QT
-103.883 -14.475 -104.805 -14.709 QT
-106.602 -15.053 L
-107.524 -15.256 -108.266 -15.663 QT
-109.008 -16.069 -109.485 -16.749 QT
-109.961 -17.428 -109.961 -18.334 QT
-109.961 -19.522 -109.329 -20.28 QT
-108.696 -21.038 -107.696 -21.374 QT
-106.696 -21.709 -105.54 -21.709 QT
-104.149 -21.709 -103.133 -20.959 QT
-102.352 -21.631 L
-102.352 -21.709 -102.211 -21.709 QT
-102.024 -21.709 L
-101.946 -21.709 -101.875 -21.631 QT
-101.805 -21.553 -101.805 -21.475 QT
-101.805 -17.944 L
-101.805 -17.694 -102.024 -17.694 QT
-102.352 -17.694 L
-102.586 -17.694 -102.586 -17.944 QT
-102.586 -19.35 -103.368 -20.209 QT
-104.149 -21.069 -105.571 -21.069 QT
-106.774 -21.069 -107.665 -20.624 QT
-108.555 -20.178 -108.555 -19.084 QT
-108.555 -18.334 -107.915 -17.85 QT
-107.274 -17.366 -106.415 -17.147 QT
-104.586 -16.819 L
-103.665 -16.6 -102.868 -16.1 QT
-102.071 -15.6 -101.602 -14.834 QT
-101.133 -14.069 -101.133 -13.1 QT
-101.133 -12.131 -101.469 -11.413 QT
-101.805 -10.694 -102.407 -10.217 QT
-103.008 -9.741 -103.829 -9.522 QT
-104.649 -9.303 -105.54 -9.303 QT
-107.227 -9.303 -108.43 -10.428 QT
-109.415 -9.366 L
-109.415 -9.303 -109.555 -9.303 QT
-109.711 -9.303 L
-109.961 -9.303 -109.961 -9.522 QT
cp
f
GR
GS
[0.6 0 0 0.6 173.70016 48.83226] CT
N
-97.583 -12.85 M
-97.583 -20.288 L
-99.818 -20.288 L
-99.818 -20.991 L
-98.052 -20.991 -97.224 -22.639 QT
-96.396 -24.288 -96.396 -26.209 QT
-95.615 -26.209 L
-95.615 -21.241 L
-91.802 -21.241 L
-91.802 -20.288 L
-95.615 -20.288 L
-95.615 -12.897 L
-95.615 -11.772 -95.24 -10.928 QT
-94.865 -10.084 -93.88 -10.084 QT
-92.958 -10.084 -92.552 -10.975 QT
-92.146 -11.866 -92.146 -12.897 QT
-92.146 -14.491 L
-91.365 -14.491 L
-91.365 -12.85 L
-91.365 -12.006 -91.677 -11.178 QT
-91.99 -10.35 -92.599 -9.827 QT
-93.208 -9.303 -94.068 -9.303 QT
-95.693 -9.303 -96.638 -10.272 QT
-97.583 -11.241 -97.583 -12.85 QT
cp
f
GR
GS
[0.6 0 0 0.6 173.70016 48.83226] CT
N
-89.26 -9.6 M
-89.26 -10.553 L
-88.338 -10.553 -87.744 -10.694 QT
-87.151 -10.834 -87.151 -11.413 QT
-87.151 -18.772 L
-87.151 -19.506 -87.369 -19.827 QT
-87.588 -20.147 -87.994 -20.217 QT
-88.401 -20.288 -89.26 -20.288 QT
-89.26 -21.241 L
-85.401 -21.538 L
-85.401 -18.897 L
-84.963 -20.069 -84.158 -20.803 QT
-83.354 -21.538 -82.213 -21.538 QT
-81.401 -21.538 -80.768 -21.061 QT
-80.135 -20.584 -80.135 -19.803 QT
-80.135 -19.319 -80.487 -18.952 QT
-80.838 -18.584 -81.354 -18.584 QT
-81.854 -18.584 -82.213 -18.944 QT
-82.572 -19.303 -82.572 -19.803 QT
-82.572 -20.522 -82.057 -20.834 QT
-82.213 -20.834 L
-83.307 -20.834 -83.994 -20.045 QT
-84.682 -19.256 -84.979 -18.077 QT
-85.276 -16.897 -85.276 -15.834 QT
-85.276 -11.413 L
-85.276 -10.553 -82.651 -10.553 QT
-82.651 -9.6 L
-89.26 -9.6 L
cp
f
GR
GS
[0.6 0 0 0.6 173.70016 48.83226] CT
N
-78.691 -9.6 M
-78.691 -10.553 L
-77.769 -10.553 -77.175 -10.694 QT
-76.581 -10.834 -76.581 -11.413 QT
-76.581 -18.772 L
-76.581 -19.819 -76.98 -20.053 QT
-77.378 -20.288 -78.566 -20.288 QT
-78.566 -21.241 L
-74.675 -21.538 L
-74.675 -11.413 L
-74.675 -10.834 -74.167 -10.694 QT
-73.659 -10.553 -72.8 -10.553 QT
-72.8 -9.6 L
-78.691 -9.6 L
cp
-77.534 -26.178 M
-77.534 -26.772 -77.089 -27.217 QT
-76.644 -27.663 -76.066 -27.663 QT
-75.675 -27.663 -75.323 -27.467 QT
-74.972 -27.272 -74.776 -26.913 QT
-74.581 -26.553 -74.581 -26.178 QT
-74.581 -25.584 -75.026 -25.139 QT
-75.472 -24.694 -76.066 -24.694 QT
-76.644 -24.694 -77.089 -25.139 QT
-77.534 -25.584 -77.534 -26.178 QT
cp
f
GR
GS
[0.6 0 0 0.6 173.70016 48.83226] CT
N
-69.299 -9.6 M
-69.299 -25.584 L
-69.299 -26.303 -69.517 -26.624 QT
-69.736 -26.944 -70.142 -27.022 QT
-70.549 -27.1 -71.408 -27.1 QT
-71.408 -28.038 L
-67.424 -28.334 L
-67.424 -19.881 L
-66.971 -20.381 -66.369 -20.756 QT
-65.767 -21.131 -65.08 -21.334 QT
-64.392 -21.538 -63.689 -21.538 QT
-62.471 -21.538 -61.439 -21.045 QT
-60.408 -20.553 -59.642 -19.694 QT
-58.877 -18.834 -58.447 -17.725 QT
-58.017 -16.616 -58.017 -15.428 QT
-58.017 -13.788 -58.814 -12.381 QT
-59.611 -10.975 -60.986 -10.139 QT
-62.361 -9.303 -64.017 -9.303 QT
-65.049 -9.303 -66.01 -9.827 QT
-66.971 -10.35 -67.596 -11.225 QT
-68.517 -9.6 L
-69.299 -9.6 L
cp
-67.346 -12.256 M
-66.892 -11.256 -66.049 -10.631 QT
-65.205 -10.006 -64.174 -10.006 QT
-62.783 -10.006 -61.916 -10.811 QT
-61.049 -11.616 -60.705 -12.842 QT
-60.361 -14.069 -60.361 -15.428 QT
-60.361 -17.709 -60.955 -18.897 QT
-61.221 -19.428 -61.674 -19.874 QT
-62.127 -20.319 -62.689 -20.577 QT
-63.252 -20.834 -63.877 -20.834 QT
-64.955 -20.834 -65.877 -20.256 QT
-66.799 -19.678 -67.346 -18.725 QT
-67.346 -12.256 L
cp
f
GR
GS
[0.6 0 0 0.6 173.70016 48.83226] CT
N
-54.39 -12.819 M
-54.39 -18.772 L
-54.39 -19.506 -54.601 -19.827 QT
-54.812 -20.147 -55.226 -20.217 QT
-55.64 -20.288 -56.499 -20.288 QT
-56.499 -21.241 L
-52.406 -21.538 L
-52.406 -12.819 L
-52.406 -11.756 -52.257 -11.17 QT
-52.109 -10.584 -51.609 -10.295 QT
-51.109 -10.006 -50.031 -10.006 QT
-48.578 -10.006 -47.726 -11.217 QT
-46.874 -12.428 -46.874 -13.975 QT
-46.874 -18.772 L
-46.874 -19.506 -47.093 -19.827 QT
-47.312 -20.147 -47.718 -20.217 QT
-48.124 -20.288 -48.984 -20.288 QT
-48.984 -21.241 L
-44.906 -21.538 L
-44.906 -12.053 L
-44.906 -11.334 -44.687 -11.014 QT
-44.468 -10.694 -44.062 -10.624 QT
-43.656 -10.553 -42.796 -10.553 QT
-42.796 -9.6 L
-46.796 -9.303 L
-46.796 -11.584 L
-47.296 -10.569 -48.187 -9.936 QT
-49.078 -9.303 -50.171 -9.303 QT
-52.109 -9.303 -53.249 -10.124 QT
-54.39 -10.944 -54.39 -12.819 QT
cp
f
GR
GS
[0.6 0 0 0.6 173.70016 48.83226] CT
N
-39.731 -12.85 M
-39.731 -20.288 L
-41.966 -20.288 L
-41.966 -20.991 L
-40.2 -20.991 -39.372 -22.639 QT
-38.544 -24.288 -38.544 -26.209 QT
-37.763 -26.209 L
-37.763 -21.241 L
-33.95 -21.241 L
-33.95 -20.288 L
-37.763 -20.288 L
-37.763 -12.897 L
-37.763 -11.772 -37.388 -10.928 QT
-37.013 -10.084 -36.028 -10.084 QT
-35.106 -10.084 -34.7 -10.975 QT
-34.294 -11.866 -34.294 -12.897 QT
-34.294 -14.491 L
-33.513 -14.491 L
-33.513 -12.85 L
-33.513 -12.006 -33.825 -11.178 QT
-34.138 -10.35 -34.747 -9.827 QT
-35.356 -9.303 -36.216 -9.303 QT
-37.841 -9.303 -38.786 -10.272 QT
-39.731 -11.241 -39.731 -12.85 QT
cp
f
GR
GS
[0.6 0 0 0.6 173.70016 48.83226] CT
N
-31.283 -9.6 M
-31.283 -10.553 L
-30.361 -10.553 -29.767 -10.694 QT
-29.174 -10.834 -29.174 -11.413 QT
-29.174 -18.772 L
-29.174 -19.819 -29.572 -20.053 QT
-29.97 -20.288 -31.158 -20.288 QT
-31.158 -21.241 L
-27.267 -21.538 L
-27.267 -11.413 L
-27.267 -10.834 -26.76 -10.694 QT
-26.252 -10.553 -25.392 -10.553 QT
-25.392 -9.6 L
-31.283 -9.6 L
cp
-30.127 -26.178 M
-30.127 -26.772 -29.681 -27.217 QT
-29.236 -27.663 -28.658 -27.663 QT
-28.267 -27.663 -27.916 -27.467 QT
-27.564 -27.272 -27.369 -26.913 QT
-27.174 -26.553 -27.174 -26.178 QT
-27.174 -25.584 -27.619 -25.139 QT
-28.064 -24.694 -28.658 -24.694 QT
-29.236 -24.694 -29.681 -25.139 QT
-30.127 -25.584 -30.127 -26.178 QT
cp
f
GR
GS
[0.6 0 0 0.6 173.70016 48.83226] CT
N
-17.954 -9.303 M
-19.579 -9.303 -20.961 -10.124 QT
-22.344 -10.944 -23.149 -12.327 QT
-23.954 -13.709 -23.954 -15.35 QT
-23.954 -16.584 -23.508 -17.733 QT
-23.063 -18.881 -22.243 -19.788 QT
-21.422 -20.694 -20.329 -21.202 QT
-19.235 -21.709 -17.954 -21.709 QT
-16.297 -21.709 -14.93 -20.827 QT
-13.563 -19.944 -12.774 -18.475 QT
-11.985 -17.006 -11.985 -15.35 QT
-11.985 -13.725 -12.79 -12.334 QT
-13.594 -10.944 -14.969 -10.124 QT
-16.344 -9.303 -17.954 -9.303 QT
cp
-17.954 -10.084 M
-15.797 -10.084 -15.071 -11.655 QT
-14.344 -13.225 -14.344 -15.647 QT
-14.344 -17.006 -14.485 -17.897 QT
-14.626 -18.788 -15.126 -19.522 QT
-15.422 -19.959 -15.891 -20.295 QT
-16.36 -20.631 -16.883 -20.811 QT
-17.407 -20.991 -17.954 -20.991 QT
-18.797 -20.991 -19.555 -20.608 QT
-20.313 -20.225 -20.813 -19.522 QT
-21.313 -18.756 -21.454 -17.834 QT
-21.594 -16.913 -21.594 -15.647 QT
-21.594 -14.131 -21.329 -12.928 QT
-21.063 -11.725 -20.266 -10.905 QT
-19.469 -10.084 -17.954 -10.084 QT
cp
f
GR
GS
[0.6 0 0 0.6 173.70016 48.83226] CT
N
-10.573 -9.6 M
-10.573 -10.553 L
-9.636 -10.553 -9.05 -10.694 QT
-8.464 -10.834 -8.464 -11.413 QT
-8.464 -18.772 L
-8.464 -19.506 -8.675 -19.827 QT
-8.886 -20.147 -9.3 -20.217 QT
-9.714 -20.288 -10.573 -20.288 QT
-10.573 -21.241 L
-6.652 -21.538 L
-6.652 -18.897 L
-6.105 -20.053 -5.042 -20.795 QT
-3.98 -21.538 -2.73 -21.538 QT
-0.87 -21.538 0.075 -20.639 QT
1.02 -19.741 1.02 -17.897 QT
1.02 -11.413 L
1.02 -10.834 1.614 -10.694 QT
2.208 -10.553 3.13 -10.553 QT
3.13 -9.6 L
-3.058 -9.6 L
-3.058 -10.553 L
-2.136 -10.553 -1.542 -10.694 QT
-0.948 -10.834 -0.948 -11.413 QT
-0.948 -17.819 L
-0.948 -19.131 -1.331 -19.983 QT
-1.714 -20.834 -2.886 -20.834 QT
-4.464 -20.834 -5.472 -19.584 QT
-6.48 -18.334 -6.48 -16.725 QT
-6.48 -11.413 L
-6.48 -10.834 -5.886 -10.694 QT
-5.292 -10.553 -4.386 -10.553 QT
-4.386 -9.6 L
-10.573 -9.6 L
cp
f
GR
GS
[0.6 0 0 0.6 173.70016 48.83226] CT
N
18.927 -9.303 M
17.333 -9.303 16.013 -10.163 QT
14.693 -11.022 13.958 -12.436 QT
13.224 -13.85 13.224 -15.428 QT
13.224 -17.069 14.021 -18.467 QT
14.818 -19.866 16.193 -20.702 QT
17.568 -21.538 19.208 -21.538 QT
20.208 -21.538 21.091 -21.116 QT
21.974 -20.694 22.615 -19.959 QT
22.615 -25.584 L
22.615 -26.303 22.396 -26.624 QT
22.177 -26.944 21.779 -27.022 QT
21.38 -27.1 20.521 -27.1 QT
20.521 -28.038 L
24.521 -28.334 L
24.521 -12.053 L
24.521 -11.334 24.732 -11.014 QT
24.943 -10.694 25.349 -10.624 QT
25.755 -10.553 26.615 -10.553 QT
26.615 -9.6 L
22.537 -9.303 L
22.537 -10.991 L
21.833 -10.194 20.873 -9.749 QT
19.912 -9.303 18.927 -9.303 QT
cp
16.177 -11.944 M
16.63 -11.069 17.404 -10.538 QT
18.177 -10.006 19.083 -10.006 QT
20.208 -10.006 21.146 -10.655 QT
22.083 -11.303 22.537 -12.334 QT
22.537 -18.803 L
22.224 -19.397 21.74 -19.866 QT
21.255 -20.334 20.654 -20.584 QT
20.052 -20.834 19.38 -20.834 QT
17.974 -20.834 17.115 -20.038 QT
16.255 -19.241 15.919 -17.999 QT
15.583 -16.756 15.583 -15.397 QT
15.583 -14.319 15.693 -13.514 QT
15.802 -12.709 16.177 -11.944 QT
cp
f
GR
GS
[0.6 0 0 0.6 173.70016 48.83226] CT
N
33.867 -9.303 M
32.226 -9.303 30.851 -10.163 QT
29.476 -11.022 28.687 -12.467 QT
27.898 -13.913 27.898 -15.522 QT
27.898 -17.1 28.617 -18.522 QT
29.336 -19.944 30.625 -20.827 QT
31.914 -21.709 33.492 -21.709 QT
34.726 -21.709 35.641 -21.288 QT
36.555 -20.866 37.148 -20.131 QT
37.742 -19.397 38.047 -18.397 QT
38.351 -17.397 38.351 -16.194 QT
38.351 -15.834 38.07 -15.834 QT
30.258 -15.834 L
30.258 -15.553 L
30.258 -13.303 31.164 -11.694 QT
32.07 -10.084 34.117 -10.084 QT
34.945 -10.084 35.648 -10.452 QT
36.351 -10.819 36.875 -11.483 QT
37.398 -12.147 37.57 -12.897 QT
37.601 -12.991 37.672 -13.061 QT
37.742 -13.131 37.836 -13.131 QT
38.07 -13.131 L
38.351 -13.131 38.351 -12.788 QT
37.976 -11.256 36.711 -10.28 QT
35.445 -9.303 33.867 -9.303 QT
cp
30.289 -16.506 M
36.445 -16.506 L
36.445 -17.522 36.164 -18.561 QT
35.883 -19.6 35.219 -20.295 QT
34.555 -20.991 33.492 -20.991 QT
31.961 -20.991 31.125 -19.561 QT
30.289 -18.131 30.289 -16.506 QT
cp
f
GR
GS
[0.6 0 0 0.6 173.70016 48.83226] CT
N
39.891 -9.522 M
39.891 -13.928 L
39.891 -14.131 40.141 -14.131 QT
40.469 -14.131 L
40.625 -14.131 40.672 -13.928 QT
41.422 -10.006 44.313 -10.006 QT
45.594 -10.006 46.453 -10.584 QT
47.313 -11.163 47.313 -12.381 QT
47.313 -13.256 46.641 -13.866 QT
45.969 -14.475 45.047 -14.709 QT
43.25 -15.053 L
42.328 -15.256 41.586 -15.663 QT
40.844 -16.069 40.367 -16.749 QT
39.891 -17.428 39.891 -18.334 QT
39.891 -19.522 40.524 -20.28 QT
41.156 -21.038 42.156 -21.374 QT
43.156 -21.709 44.313 -21.709 QT
45.703 -21.709 46.719 -20.959 QT
47.5 -21.631 L
47.5 -21.709 47.641 -21.709 QT
47.828 -21.709 L
47.906 -21.709 47.977 -21.631 QT
48.047 -21.553 48.047 -21.475 QT
48.047 -17.944 L
48.047 -17.694 47.828 -17.694 QT
47.5 -17.694 L
47.266 -17.694 47.266 -17.944 QT
47.266 -19.35 46.485 -20.209 QT
45.703 -21.069 44.281 -21.069 QT
43.078 -21.069 42.188 -20.624 QT
41.297 -20.178 41.297 -19.084 QT
41.297 -18.334 41.938 -17.85 QT
42.578 -17.366 43.438 -17.147 QT
45.266 -16.819 L
46.188 -16.6 46.985 -16.1 QT
47.781 -15.6 48.25 -14.834 QT
48.719 -14.069 48.719 -13.1 QT
48.719 -12.131 48.383 -11.413 QT
48.047 -10.694 47.445 -10.217 QT
46.844 -9.741 46.024 -9.522 QT
45.203 -9.303 44.313 -9.303 QT
42.625 -9.303 41.422 -10.428 QT
40.438 -9.366 L
40.438 -9.303 40.297 -9.303 QT
40.141 -9.303 L
39.891 -9.303 39.891 -9.522 QT
cp
f
GR
GS
[0.6 0 0 0.6 173.70016 48.83226] CT
N
59.111 -9.6 M
59.111 -10.553 L
60.033 -10.553 60.626 -10.694 QT
61.22 -10.834 61.22 -11.413 QT
61.22 -18.772 L
61.22 -19.506 61.001 -19.827 QT
60.783 -20.147 60.376 -20.217 QT
59.97 -20.288 59.111 -20.288 QT
59.111 -21.241 L
62.97 -21.538 L
62.97 -18.897 L
63.408 -20.069 64.212 -20.803 QT
65.017 -21.538 66.158 -21.538 QT
66.97 -21.538 67.603 -21.061 QT
68.236 -20.584 68.236 -19.803 QT
68.236 -19.319 67.884 -18.952 QT
67.533 -18.584 67.017 -18.584 QT
66.517 -18.584 66.158 -18.944 QT
65.798 -19.303 65.798 -19.803 QT
65.798 -20.522 66.314 -20.834 QT
66.158 -20.834 L
65.064 -20.834 64.376 -20.045 QT
63.689 -19.256 63.392 -18.077 QT
63.095 -16.897 63.095 -15.834 QT
63.095 -11.413 L
63.095 -10.553 65.72 -10.553 QT
65.72 -9.6 L
59.111 -9.6 L
cp
f
GR
GS
[0.6 0 0 0.6 173.70016 48.83226] CT
N
69.93 -12.256 M
69.93 -13.866 71.196 -14.874 QT
72.461 -15.881 74.235 -16.295 QT
76.008 -16.709 77.602 -16.709 QT
77.602 -17.819 L
77.602 -18.584 77.258 -19.319 QT
76.915 -20.053 76.274 -20.522 QT
75.633 -20.991 74.852 -20.991 QT
73.055 -20.991 72.118 -20.194 QT
72.633 -20.194 72.969 -19.803 QT
73.305 -19.413 73.305 -18.897 QT
73.305 -18.35 72.922 -17.967 QT
72.54 -17.584 72.024 -17.584 QT
71.477 -17.584 71.094 -17.967 QT
70.711 -18.35 70.711 -18.897 QT
70.711 -20.319 72 -21.014 QT
73.29 -21.709 74.852 -21.709 QT
75.946 -21.709 77.055 -21.241 QT
78.165 -20.772 78.868 -19.897 QT
79.571 -19.022 79.571 -17.866 QT
79.571 -11.788 L
79.571 -11.256 79.797 -10.819 QT
80.024 -10.381 80.493 -10.381 QT
80.946 -10.381 81.165 -10.827 QT
81.383 -11.272 81.383 -11.788 QT
81.383 -13.522 L
82.165 -13.522 L
82.165 -11.788 L
82.165 -11.178 81.852 -10.631 QT
81.54 -10.084 81 -9.764 QT
80.461 -9.444 79.852 -9.444 QT
79.055 -9.444 78.485 -10.053 QT
77.915 -10.663 77.836 -11.506 QT
77.336 -10.491 76.368 -9.897 QT
75.399 -9.303 74.29 -9.303 QT
73.258 -9.303 72.258 -9.6 QT
71.258 -9.897 70.594 -10.553 QT
69.93 -11.209 69.93 -12.256 QT
cp
72.118 -12.256 M
72.118 -11.303 72.821 -10.655 QT
73.524 -10.006 74.461 -10.006 QT
75.336 -10.006 76.047 -10.444 QT
76.758 -10.881 77.18 -11.631 QT
77.602 -12.381 77.602 -13.209 QT
77.602 -16.022 L
76.383 -16.022 75.094 -15.616 QT
73.805 -15.209 72.961 -14.358 QT
72.118 -13.506 72.118 -12.256 QT
cp
f
GR
GS
[0.6 0 0 0.6 173.70016 48.83226] CT
N
88.904 -9.303 M
87.279 -9.303 85.943 -10.147 QT
84.607 -10.991 83.842 -12.413 QT
83.076 -13.834 83.076 -15.428 QT
83.076 -17.022 83.834 -18.483 QT
84.592 -19.944 85.935 -20.827 QT
87.279 -21.709 88.904 -21.709 QT
90.498 -21.709 91.795 -21.084 QT
93.092 -20.459 93.092 -19.053 QT
93.092 -18.522 92.717 -18.131 QT
92.342 -17.741 91.795 -17.741 QT
91.264 -17.741 90.881 -18.131 QT
90.498 -18.522 90.498 -19.053 QT
90.498 -19.522 90.803 -19.874 QT
91.107 -20.225 91.56 -20.319 QT
90.623 -20.913 88.935 -20.913 QT
87.639 -20.913 86.849 -20.053 QT
86.06 -19.194 85.748 -17.928 QT
85.435 -16.663 85.435 -15.428 QT
85.435 -14.116 85.818 -12.897 QT
86.201 -11.678 87.068 -10.881 QT
87.935 -10.084 89.232 -10.084 QT
90.514 -10.084 91.412 -10.874 QT
92.31 -11.663 92.639 -12.928 QT
92.639 -13.084 92.857 -13.084 QT
93.185 -13.084 L
93.264 -13.084 93.326 -13.006 QT
93.389 -12.928 93.389 -12.85 QT
93.389 -12.772 L
92.982 -11.163 91.771 -10.233 QT
90.56 -9.303 88.904 -9.303 QT
cp
f
GR
GS
[0.6 0 0 0.6 173.70016 48.83226] CT
N
94.865 -9.6 M
94.865 -10.553 L
95.787 -10.553 96.381 -10.694 QT
96.975 -10.834 96.975 -11.413 QT
96.975 -18.772 L
96.975 -19.819 96.576 -20.053 QT
96.178 -20.288 94.99 -20.288 QT
94.99 -21.241 L
98.881 -21.538 L
98.881 -11.413 L
98.881 -10.834 99.389 -10.694 QT
99.897 -10.553 100.756 -10.553 QT
100.756 -9.6 L
94.865 -9.6 L
cp
96.022 -26.178 M
96.022 -26.772 96.467 -27.217 QT
96.912 -27.663 97.49 -27.663 QT
97.881 -27.663 98.233 -27.467 QT
98.584 -27.272 98.779 -26.913 QT
98.975 -26.553 98.975 -26.178 QT
98.975 -25.584 98.529 -25.139 QT
98.084 -24.694 97.49 -24.694 QT
96.912 -24.694 96.467 -25.139 QT
96.022 -25.584 96.022 -26.178 QT
cp
f
GR
GS
[0.6 0 0 0.6 173.70016 48.83226] CT
N
102.242 -9.6 M
102.242 -10.553 L
103.179 -10.553 103.765 -10.694 QT
104.351 -10.834 104.351 -11.413 QT
104.351 -18.772 L
104.351 -19.506 104.14 -19.827 QT
103.929 -20.147 103.515 -20.217 QT
103.101 -20.288 102.242 -20.288 QT
102.242 -21.241 L
106.163 -21.538 L
106.163 -18.897 L
106.71 -20.053 107.773 -20.795 QT
108.835 -21.538 110.085 -21.538 QT
111.945 -21.538 112.89 -20.639 QT
113.835 -19.741 113.835 -17.897 QT
113.835 -11.413 L
113.835 -10.834 114.429 -10.694 QT
115.023 -10.553 115.945 -10.553 QT
115.945 -9.6 L
109.757 -9.6 L
109.757 -10.553 L
110.679 -10.553 111.273 -10.694 QT
111.867 -10.834 111.867 -11.413 QT
111.867 -17.819 L
111.867 -19.131 111.484 -19.983 QT
111.101 -20.834 109.929 -20.834 QT
108.351 -20.834 107.343 -19.584 QT
106.335 -18.334 106.335 -16.725 QT
106.335 -11.413 L
106.335 -10.834 106.929 -10.694 QT
107.523 -10.553 108.429 -10.553 QT
108.429 -9.6 L
102.242 -9.6 L
cp
f
GR
GS
[0.6 0 0 0.6 173.70016 48.83226] CT
N
122.978 -9.303 M
121.338 -9.303 119.963 -10.163 QT
118.588 -11.022 117.799 -12.467 QT
117.01 -13.913 117.01 -15.522 QT
117.01 -17.1 117.728 -18.522 QT
118.447 -19.944 119.736 -20.827 QT
121.025 -21.709 122.603 -21.709 QT
123.838 -21.709 124.752 -21.288 QT
125.666 -20.866 126.26 -20.131 QT
126.853 -19.397 127.158 -18.397 QT
127.463 -17.397 127.463 -16.194 QT
127.463 -15.834 127.181 -15.834 QT
119.369 -15.834 L
119.369 -15.553 L
119.369 -13.303 120.275 -11.694 QT
121.181 -10.084 123.228 -10.084 QT
124.056 -10.084 124.76 -10.452 QT
125.463 -10.819 125.986 -11.483 QT
126.51 -12.147 126.681 -12.897 QT
126.713 -12.991 126.783 -13.061 QT
126.853 -13.131 126.947 -13.131 QT
127.181 -13.131 L
127.463 -13.131 127.463 -12.788 QT
127.088 -11.256 125.822 -10.28 QT
124.556 -9.303 122.978 -9.303 QT
cp
119.4 -16.506 M
125.556 -16.506 L
125.556 -17.522 125.275 -18.561 QT
124.994 -19.6 124.33 -20.295 QT
123.666 -20.991 122.603 -20.991 QT
121.072 -20.991 120.236 -19.561 QT
119.4 -18.131 119.4 -16.506 QT
cp
f
GR
GS
[0.6 0 0 0.6 173.70016 48.83226] CT
N
129.002 -9.522 M
129.002 -13.928 L
129.002 -14.131 129.252 -14.131 QT
129.58 -14.131 L
129.736 -14.131 129.783 -13.928 QT
130.533 -10.006 133.424 -10.006 QT
134.705 -10.006 135.564 -10.584 QT
136.424 -11.163 136.424 -12.381 QT
136.424 -13.256 135.752 -13.866 QT
135.08 -14.475 134.158 -14.709 QT
132.361 -15.053 L
131.439 -15.256 130.697 -15.663 QT
129.955 -16.069 129.479 -16.749 QT
129.002 -17.428 129.002 -18.334 QT
129.002 -19.522 129.635 -20.28 QT
130.268 -21.038 131.268 -21.374 QT
132.268 -21.709 133.424 -21.709 QT
134.814 -21.709 135.83 -20.959 QT
136.611 -21.631 L
136.611 -21.709 136.752 -21.709 QT
136.939 -21.709 L
137.018 -21.709 137.088 -21.631 QT
137.158 -21.553 137.158 -21.475 QT
137.158 -17.944 L
137.158 -17.694 136.939 -17.694 QT
136.611 -17.694 L
136.377 -17.694 136.377 -17.944 QT
136.377 -19.35 135.596 -20.209 QT
134.814 -21.069 133.393 -21.069 QT
132.189 -21.069 131.299 -20.624 QT
130.408 -20.178 130.408 -19.084 QT
130.408 -18.334 131.049 -17.85 QT
131.689 -17.366 132.549 -17.147 QT
134.377 -16.819 L
135.299 -16.6 136.096 -16.1 QT
136.893 -15.6 137.361 -14.834 QT
137.83 -14.069 137.83 -13.1 QT
137.83 -12.131 137.494 -11.413 QT
137.158 -10.694 136.557 -10.217 QT
135.955 -9.741 135.135 -9.522 QT
134.314 -9.303 133.424 -9.303 QT
131.736 -9.303 130.533 -10.428 QT
129.549 -9.366 L
129.549 -9.303 129.408 -9.303 QT
129.252 -9.303 L
129.002 -9.303 129.002 -9.522 QT
cp
f
GR
GS
[0.6 0 0 0.6 219.7986 151.8] CT
N
1.667 0 M
1.667 0.92 0.92 1.667 0 1.667 C
-0.92 1.667 -1.667 0.92 -1.667 0 C
-1.667 -0.92 -0.92 -1.667 0 -1.667 C
0.92 -1.667 1.667 -0.92 1.667 0 C
cp
f
GR
GS
[0.6 0 0 0.6 211.36168 151.8] CT
N
/f954680962{1.667 0 M
1.667 0.92 0.92 1.667 0 1.667 C
-0.92 1.667 -1.667 0.92 -1.667 0 C
-1.667 -0.92 -0.92 -1.667 0 -1.667 C
0.92 -1.667 1.667 -0.92 1.667 0 C
cp}def
f954680962
f
GR
GS
[0.6 0 0 0.6 203.25729 151.8] CT
N
f954680962
f
GR
GS
[0.6 0 0 0.6 193.94951 151.8] CT
N
f954680962
f
GR
GS
[0.6 0 0 0.6 187.45549 151.8] CT
N
f954680962
f
GR
GS
[0.6 0 0 0.6 176.03871 151.8] CT
N
f954680962
f
GR
GS
[0.6 0 0 0.6 171.35953 151.8] CT
N
f954680962
f
GR
GS
[0.6 0 0 0.6 159.92574 151.8] CT
N
f954680962
f
GR
GS
[0.6 0 0 0.6 153.49988 151.8] CT
N
f954680962
f
GR
GS
[0.6 0 0 0.6 144.08621 151.8] CT
N
f954680962
f
GR
GS
[0.6 0 0 0.6 136.07769 151.8] CT
N
f954680962
f
GR
GS
[0.6 0 0 0.6 127.58703 151.8] CT
N
f954680962
f
GR
GS
[0.6 0 0 0.6 119.22865 151.8] CT
N
f954680962
f
GR
GS
[0.6 0 0 0.6 110.84493 151.8] CT
N
f954680962
f
GR
GS
[0.6 0 0 0.6 102.46452 151.8] CT
N
f954680962
f
GR
GS
[0.6 0 0 0.6 94.08387 151.8] CT
N
f954680962
f
GR
GS
[0.6 0 0 0.6 85.70323 151.8] CT
N
f954680962
f
GR
GS
[0.6 0 0 0.6 77.32258 151.8] CT
N
f954680962
f
GR
GS
[0.6 0 0 0.6 68.94194 151.8] CT
N
f954680962
f
GR
GS
[0.6 0 0 0.6 60.56129 151.8] CT
N
f954680962
f
GR
GS
[0.6 0 0 0.6 219.7986 151.8] CT
1 0 0 RC
10.0 ML
N
4.5 -0.5 M
4.5 -3.261 2.261 -5.5 -0.5 -5.5 C
-3.261 -5.5 -5.5 -3.261 -5.5 -0.5 C
-5.5 2.261 -3.261 4.5 -0.5 4.5 C
2.261 4.5 4.5 2.261 4.5 -0.5 C
S
GR
GS
[0.6 0 0 0.6 211.36168 151.8] CT
1 0 0 RC
10.0 ML
N
4.5 -0.5 M
4.5 -3.261 2.261 -5.5 -0.5 -5.5 C
-3.261 -5.5 -5.5 -3.261 -5.5 -0.5 C
-5.5 2.261 -3.261 4.5 -0.5 4.5 C
2.261 4.5 4.5 2.261 4.5 -0.5 C
S
GR
GS
[0.6 0 0 0.6 203.25729 151.8] CT
1 0 0 RC
10.0 ML
N
4.5 -0.5 M
4.5 -3.261 2.261 -5.5 -0.5 -5.5 C
-3.261 -5.5 -5.5 -3.261 -5.5 -0.5 C
-5.5 2.261 -3.261 4.5 -0.5 4.5 C
2.261 4.5 4.5 2.261 4.5 -0.5 C
S
GR
GS
[0.6 0 0 0.6 193.94951 151.8] CT
1 0 0 RC
10.0 ML
N
4.5 -0.5 M
4.5 -3.261 2.261 -5.5 -0.5 -5.5 C
-3.261 -5.5 -5.5 -3.261 -5.5 -0.5 C
-5.5 2.261 -3.261 4.5 -0.5 4.5 C
2.261 4.5 4.5 2.261 4.5 -0.5 C
S
GR
GS
[0.6 0 0 0.6 187.45549 151.8] CT
1 0 0 RC
10.0 ML
N
4.5 -0.5 M
4.5 -3.261 2.261 -5.5 -0.5 -5.5 C
-3.261 -5.5 -5.5 -3.261 -5.5 -0.5 C
-5.5 2.261 -3.261 4.5 -0.5 4.5 C
2.261 4.5 4.5 2.261 4.5 -0.5 C
S
GR
GS
[0.6 0 0 0.6 176.03871 151.8] CT
1 0 0 RC
10.0 ML
N
4.5 -0.5 M
4.5 -3.261 2.261 -5.5 -0.5 -5.5 C
-3.261 -5.5 -5.5 -3.261 -5.5 -0.5 C
-5.5 2.261 -3.261 4.5 -0.5 4.5 C
2.261 4.5 4.5 2.261 4.5 -0.5 C
S
GR
GS
[0.6 0 0 0.6 171.35953 151.8] CT
1 0 0 RC
10.0 ML
N
4.5 -0.5 M
4.5 -3.261 2.261 -5.5 -0.5 -5.5 C
-3.261 -5.5 -5.5 -3.261 -5.5 -0.5 C
-5.5 2.261 -3.261 4.5 -0.5 4.5 C
2.261 4.5 4.5 2.261 4.5 -0.5 C
S
GR
GS
[0.6 0 0 0.6 159.92574 151.8] CT
1 0 0 RC
10.0 ML
N
4.5 -0.5 M
4.5 -3.261 2.261 -5.5 -0.5 -5.5 C
-3.261 -5.5 -5.5 -3.261 -5.5 -0.5 C
-5.5 2.261 -3.261 4.5 -0.5 4.5 C
2.261 4.5 4.5 2.261 4.5 -0.5 C
S
GR
GS
[0.6 0 0 0.6 153.49988 151.8] CT
1 0 0 RC
10.0 ML
N
4.5 -0.5 M
4.5 -3.261 2.261 -5.5 -0.5 -5.5 C
-3.261 -5.5 -5.5 -3.261 -5.5 -0.5 C
-5.5 2.261 -3.261 4.5 -0.5 4.5 C
2.261 4.5 4.5 2.261 4.5 -0.5 C
S
GR
GS
[0.6 0 0 0.6 144.08621 151.8] CT
1 0 0 RC
10.0 ML
N
4.5 -0.5 M
4.5 -3.261 2.261 -5.5 -0.5 -5.5 C
-3.261 -5.5 -5.5 -3.261 -5.5 -0.5 C
-5.5 2.261 -3.261 4.5 -0.5 4.5 C
2.261 4.5 4.5 2.261 4.5 -0.5 C
S
GR
GS
[0.6 0 0 0.6 136.07769 151.8] CT
1 0 0 RC
10.0 ML
N
4.5 -0.5 M
4.5 -3.261 2.261 -5.5 -0.5 -5.5 C
-3.261 -5.5 -5.5 -3.261 -5.5 -0.5 C
-5.5 2.261 -3.261 4.5 -0.5 4.5 C
2.261 4.5 4.5 2.261 4.5 -0.5 C
S
GR
GS
[0.6 0 0 0.6 127.58703 151.8] CT
1 0 0 RC
10.0 ML
N
4.5 -0.5 M
4.5 -3.261 2.261 -5.5 -0.5 -5.5 C
-3.261 -5.5 -5.5 -3.261 -5.5 -0.5 C
-5.5 2.261 -3.261 4.5 -0.5 4.5 C
2.261 4.5 4.5 2.261 4.5 -0.5 C
S
GR
GS
[0.6 0 0 0.6 119.22865 151.8] CT
1 0 0 RC
10.0 ML
N
4.5 -0.5 M
4.5 -3.261 2.261 -5.5 -0.5 -5.5 C
-3.261 -5.5 -5.5 -3.261 -5.5 -0.5 C
-5.5 2.261 -3.261 4.5 -0.5 4.5 C
2.261 4.5 4.5 2.261 4.5 -0.5 C
S
GR
GS
[0.6 0 0 0.6 110.84493 151.8] CT
1 0 0 RC
10.0 ML
N
4.5 -0.5 M
4.5 -3.261 2.261 -5.5 -0.5 -5.5 C
-3.261 -5.5 -5.5 -3.261 -5.5 -0.5 C
-5.5 2.261 -3.261 4.5 -0.5 4.5 C
2.261 4.5 4.5 2.261 4.5 -0.5 C
S
GR
GS
[0.6 0 0 0.6 102.46452 151.8] CT
1 0 0 RC
10.0 ML
N
4.5 -0.5 M
4.5 -3.261 2.261 -5.5 -0.5 -5.5 C
-3.261 -5.5 -5.5 -3.261 -5.5 -0.5 C
-5.5 2.261 -3.261 4.5 -0.5 4.5 C
2.261 4.5 4.5 2.261 4.5 -0.5 C
S
GR
GS
[0.6 0 0 0.6 94.08387 151.8] CT
1 0 0 RC
10.0 ML
N
4.5 -0.5 M
4.5 -3.261 2.261 -5.5 -0.5 -5.5 C
-3.261 -5.5 -5.5 -3.261 -5.5 -0.5 C
-5.5 2.261 -3.261 4.5 -0.5 4.5 C
2.261 4.5 4.5 2.261 4.5 -0.5 C
S
GR
GS
[0.6 0 0 0.6 85.70323 151.8] CT
1 0 0 RC
10.0 ML
N
4.5 -0.5 M
4.5 -3.261 2.261 -5.5 -0.5 -5.5 C
-3.261 -5.5 -5.5 -3.261 -5.5 -0.5 C
-5.5 2.261 -3.261 4.5 -0.5 4.5 C
2.261 4.5 4.5 2.261 4.5 -0.5 C
S
GR
GS
[0.6 0 0 0.6 77.32258 151.8] CT
1 0 0 RC
10.0 ML
N
4.5 -0.5 M
4.5 -3.261 2.261 -5.5 -0.5 -5.5 C
-3.261 -5.5 -5.5 -3.261 -5.5 -0.5 C
-5.5 2.261 -3.261 4.5 -0.5 4.5 C
2.261 4.5 4.5 2.261 4.5 -0.5 C
S
GR
GS
[0.6 0 0 0.6 68.94194 151.8] CT
1 0 0 RC
10.0 ML
N
4.5 -0.5 M
4.5 -3.261 2.261 -5.5 -0.5 -5.5 C
-3.261 -5.5 -5.5 -3.261 -5.5 -0.5 C
-5.5 2.261 -3.261 4.5 -0.5 4.5 C
2.261 4.5 4.5 2.261 4.5 -0.5 C
S
GR
GS
[0.6 0 0 0.6 60.56129 151.8] CT
1 0 0 RC
10.0 ML
N
4.5 -0.5 M
4.5 -3.261 2.261 -5.5 -0.5 -5.5 C
-3.261 -5.5 -5.5 -3.261 -5.5 -0.5 C
-5.5 2.261 -3.261 4.5 -0.5 4.5 C
2.261 4.5 4.5 2.261 4.5 -0.5 C
S
GR
GS
[0.6 0 0 0.6 218.70128 147.74837] CT
0 1 0 RC
10.0 ML
N
4.5 -0.5 M
4.5 -3.261 2.261 -5.5 -0.5 -5.5 C
-3.261 -5.5 -5.5 -3.261 -5.5 -0.5 C
-5.5 2.261 -3.261 4.5 -0.5 4.5 C
2.261 4.5 4.5 2.261 4.5 -0.5 C
S
GR
GS
[0.6 0 0 0.6 218.70128 155.85163] CT
0 1 0 RC
10.0 ML
N
4.5 -0.5 M
4.5 -3.261 2.261 -5.5 -0.5 -5.5 C
-3.261 -5.5 -5.5 -3.261 -5.5 -0.5 C
-5.5 2.261 -3.261 4.5 -0.5 4.5 C
2.261 4.5 4.5 2.261 4.5 -0.5 C
S
GR
GS
[0.6 0 0 0.6 202.00574 139.00515] CT
0 1 0 RC
10.0 ML
N
4.5 -0.5 M
4.5 -3.261 2.261 -5.5 -0.5 -5.5 C
-3.261 -5.5 -5.5 -3.261 -5.5 -0.5 C
-5.5 2.261 -3.261 4.5 -0.5 4.5 C
2.261 4.5 4.5 2.261 4.5 -0.5 C
S
GR
GS
[0.6 0 0 0.6 202.00574 164.59486] CT
0 1 0 RC
10.0 ML
N
4.5 -0.5 M
4.5 -3.261 2.261 -5.5 -0.5 -5.5 C
-3.261 -5.5 -5.5 -3.261 -5.5 -0.5 C
-5.5 2.261 -3.261 4.5 -0.5 4.5 C
2.261 4.5 4.5 2.261 4.5 -0.5 C
S
GR
GS
[0.6 0 0 0.6 181.27916 137.10737] CT
0 1 0 RC
10.0 ML
N
4.5 -0.5 M
4.5 -3.261 2.261 -5.5 -0.5 -5.5 C
-3.261 -5.5 -5.5 -3.261 -5.5 -0.5 C
-5.5 2.261 -3.261 4.5 -0.5 4.5 C
2.261 4.5 4.5 2.261 4.5 -0.5 C
S
GR
GS
[0.6 0 0 0.6 181.27916 166.49262] CT
0 1 0 RC
10.0 ML
N
4.5 -0.5 M
4.5 -3.261 2.261 -5.5 -0.5 -5.5 C
-3.261 -5.5 -5.5 -3.261 -5.5 -0.5 C
-5.5 2.261 -3.261 4.5 -0.5 4.5 C
2.261 4.5 4.5 2.261 4.5 -0.5 C
S
GR
GS
[0.6 0 0 0.6 135.38503 151.8] CT
0 1 0 RC
10.0 ML
N
4.5 -0.5 M
4.5 -3.261 2.261 -5.5 -0.5 -5.5 C
-3.261 -5.5 -5.5 -3.261 -5.5 -0.5 C
-5.5 2.261 -3.261 4.5 -0.5 4.5 C
2.261 4.5 4.5 2.261 4.5 -0.5 C
S
GR
GS
[0.6 0 0 0.6 162.22701 141.03023] CT
0 1 0 RC
10.0 ML
N
4.5 -0.5 M
4.5 -3.261 2.261 -5.5 -0.5 -5.5 C
-3.261 -5.5 -5.5 -3.261 -5.5 -0.5 C
-5.5 2.261 -3.261 4.5 -0.5 4.5 C
2.261 4.5 4.5 2.261 4.5 -0.5 C
S
GR
GS
[0.6 0 0 0.6 162.22701 162.56977] CT
0 1 0 RC
10.0 ML
N
4.5 -0.5 M
4.5 -3.261 2.261 -5.5 -0.5 -5.5 C
-3.261 -5.5 -5.5 -3.261 -5.5 -0.5 C
-5.5 2.261 -3.261 4.5 -0.5 4.5 C
2.261 4.5 4.5 2.261 4.5 -0.5 C
S
GR
GS
[0.6 0 0 0.6 146.45219 147.69597] CT
0 1 0 RC
10.0 ML
N
4.5 -0.5 M
4.5 -3.261 2.261 -5.5 -0.5 -5.5 C
-3.261 -5.5 -5.5 -3.261 -5.5 -0.5 C
-5.5 2.261 -3.261 4.5 -0.5 4.5 C
2.261 4.5 4.5 2.261 4.5 -0.5 C
S
GR
GS
[0.6 0 0 0.6 146.45219 155.90403] CT
0 1 0 RC
10.0 ML
N
4.5 -0.5 M
4.5 -3.261 2.261 -5.5 -0.5 -5.5 C
-3.261 -5.5 -5.5 -3.261 -5.5 -0.5 C
-5.5 2.261 -3.261 4.5 -0.5 4.5 C
2.261 4.5 4.5 2.261 4.5 -0.5 C
S
GR
GS
[0.6 0 0 0.6 127.69079 151.8] CT
0 1 0 RC
10.0 ML
N
4.5 -0.5 M
4.5 -3.261 2.261 -5.5 -0.5 -5.5 C
-3.261 -5.5 -5.5 -3.261 -5.5 -0.5 C
-5.5 2.261 -3.261 4.5 -0.5 4.5 C
2.261 4.5 4.5 2.261 4.5 -0.5 C
S
GR
GS
[0.6 0 0 0.6 119.21879 151.8] CT
0 1 0 RC
10.0 ML
N
4.5 -0.5 M
4.5 -3.261 2.261 -5.5 -0.5 -5.5 C
-3.261 -5.5 -5.5 -3.261 -5.5 -0.5 C
-5.5 2.261 -3.261 4.5 -0.5 4.5 C
2.261 4.5 4.5 2.261 4.5 -0.5 C
S
GR
GS
[0.6 0 0 0.6 110.8456 151.8] CT
0 1 0 RC
10.0 ML
N
4.5 -0.5 M
4.5 -3.261 2.261 -5.5 -0.5 -5.5 C
-3.261 -5.5 -5.5 -3.261 -5.5 -0.5 C
-5.5 2.261 -3.261 4.5 -0.5 4.5 C
2.261 4.5 4.5 2.261 4.5 -0.5 C
S
GR
GS
[0.6 0 0 0.6 102.4645 151.8] CT
0 1 0 RC
10.0 ML
N
4.5 -0.5 M
4.5 -3.261 2.261 -5.5 -0.5 -5.5 C
-3.261 -5.5 -5.5 -3.261 -5.5 -0.5 C
-5.5 2.261 -3.261 4.5 -0.5 4.5 C
2.261 4.5 4.5 2.261 4.5 -0.5 C
S
GR
GS
[0.6 0 0 0.6 94.08387 151.8] CT
0 1 0 RC
10.0 ML
N
4.5 -0.5 M
4.5 -3.261 2.261 -5.5 -0.5 -5.5 C
-3.261 -5.5 -5.5 -3.261 -5.5 -0.5 C
-5.5 2.261 -3.261 4.5 -0.5 4.5 C
2.261 4.5 4.5 2.261 4.5 -0.5 C
S
GR
GS
[0.6 0 0 0.6 85.70323 151.8] CT
0 1 0 RC
10.0 ML
N
4.5 -0.5 M
4.5 -3.261 2.261 -5.5 -0.5 -5.5 C
-3.261 -5.5 -5.5 -3.261 -5.5 -0.5 C
-5.5 2.261 -3.261 4.5 -0.5 4.5 C
2.261 4.5 4.5 2.261 4.5 -0.5 C
S
GR
GS
[0.6 0 0 0.6 77.32258 151.8] CT
0 1 0 RC
10.0 ML
N
4.5 -0.5 M
4.5 -3.261 2.261 -5.5 -0.5 -5.5 C
-3.261 -5.5 -5.5 -3.261 -5.5 -0.5 C
-5.5 2.261 -3.261 4.5 -0.5 4.5 C
2.261 4.5 4.5 2.261 4.5 -0.5 C
S
GR
GS
[0.6 0 0 0.6 68.94194 151.8] CT
0 1 0 RC
10.0 ML
N
4.5 -0.5 M
4.5 -3.261 2.261 -5.5 -0.5 -5.5 C
-3.261 -5.5 -5.5 -3.261 -5.5 -0.5 C
-5.5 2.261 -3.261 4.5 -0.5 4.5 C
2.261 4.5 4.5 2.261 4.5 -0.5 C
S
GR
GS
[0.6 0 0 0.6 60.56129 151.8] CT
0 1 0 RC
10.0 ML
N
4.5 -0.5 M
4.5 -3.261 2.261 -5.5 -0.5 -5.5 C
-3.261 -5.5 -5.5 -3.261 -5.5 -0.5 C
-5.5 2.261 -3.261 4.5 -0.5 4.5 C
2.261 4.5 4.5 2.261 4.5 -0.5 C
S
GR
GS
[0.6 0 0 0.6 257.04271 123.52066] CT
0 0 1 RC
10.0 ML
N
4.5 -0.5 M
4.5 -3.261 2.261 -5.5 -0.5 -5.5 C
-3.261 -5.5 -5.5 -3.261 -5.5 -0.5 C
-5.5 2.261 -3.261 4.5 -0.5 4.5 C
2.261 4.5 4.5 2.261 4.5 -0.5 C
S
GR
GS
[0.6 0 0 0.6 257.04271 180.07934] CT
0 0 1 RC
10.0 ML
N
4.5 -0.5 M
4.5 -3.261 2.261 -5.5 -0.5 -5.5 C
-3.261 -5.5 -5.5 -3.261 -5.5 -0.5 C
-5.5 2.261 -3.261 4.5 -0.5 4.5 C
2.261 4.5 4.5 2.261 4.5 -0.5 C
S
GR
GS
[0.6 0 0 0.6 213.80035 94.7422] CT
0 0 1 RC
10.0 ML
N
4.5 -0.5 M
4.5 -3.261 2.261 -5.5 -0.5 -5.5 C
-3.261 -5.5 -5.5 -3.261 -5.5 -0.5 C
-5.5 2.261 -3.261 4.5 -0.5 4.5 C
2.261 4.5 4.5 2.261 4.5 -0.5 C
S
GR
GS
[0.6 0 0 0.6 213.80035 208.85779] CT
0 0 1 RC
10.0 ML
N
4.5 -0.5 M
4.5 -3.261 2.261 -5.5 -0.5 -5.5 C
-3.261 -5.5 -5.5 -3.261 -5.5 -0.5 C
-5.5 2.261 -3.261 4.5 -0.5 4.5 C
2.261 4.5 4.5 2.261 4.5 -0.5 C
S
GR
GS
[0.6 0 0 0.6 173.64716 99.00376] CT
0 0 1 RC
10.0 ML
N
4.5 -0.5 M
4.5 -3.261 2.261 -5.5 -0.5 -5.5 C
-3.261 -5.5 -5.5 -3.261 -5.5 -0.5 C
-5.5 2.261 -3.261 4.5 -0.5 4.5 C
2.261 4.5 4.5 2.261 4.5 -0.5 C
S
GR
GS
[0.6 0 0 0.6 173.64716 204.59625] CT
0 0 1 RC
10.0 ML
N
4.5 -0.5 M
4.5 -3.261 2.261 -5.5 -0.5 -5.5 C
-3.261 -5.5 -5.5 -3.261 -5.5 -0.5 C
-5.5 2.261 -3.261 4.5 -0.5 4.5 C
2.261 4.5 4.5 2.261 4.5 -0.5 C
S
GR
GS
[0.6 0 0 0.6 148.12494 113.21363] CT
0 0 1 RC
10.0 ML
N
4.5 -0.5 M
4.5 -3.261 2.261 -5.5 -0.5 -5.5 C
-3.261 -5.5 -5.5 -3.261 -5.5 -0.5 C
-5.5 2.261 -3.261 4.5 -0.5 4.5 C
2.261 4.5 4.5 2.261 4.5 -0.5 C
S
GR
GS
[0.6 0 0 0.6 148.12494 190.38638] CT
0 0 1 RC
10.0 ML
N
4.5 -0.5 M
4.5 -3.261 2.261 -5.5 -0.5 -5.5 C
-3.261 -5.5 -5.5 -3.261 -5.5 -0.5 C
-5.5 2.261 -3.261 4.5 -0.5 4.5 C
2.261 4.5 4.5 2.261 4.5 -0.5 C
S
GR
GS
[0.6 0 0 0.6 131.99464 127.32654] CT
0 0 1 RC
10.0 ML
N
4.5 -0.5 M
4.5 -3.261 2.261 -5.5 -0.5 -5.5 C
-3.261 -5.5 -5.5 -3.261 -5.5 -0.5 C
-5.5 2.261 -3.261 4.5 -0.5 4.5 C
2.261 4.5 4.5 2.261 4.5 -0.5 C
S
GR
GS
[0.6 0 0 0.6 131.99464 176.27347] CT
0 0 1 RC
10.0 ML
N
4.5 -0.5 M
4.5 -3.261 2.261 -5.5 -0.5 -5.5 C
-3.261 -5.5 -5.5 -3.261 -5.5 -0.5 C
-5.5 2.261 -3.261 4.5 -0.5 4.5 C
2.261 4.5 4.5 2.261 4.5 -0.5 C
S
GR
GS
[0.6 0 0 0.6 102.41686 151.8] CT
0 0 1 RC
10.0 ML
N
4.5 -0.5 M
4.5 -3.261 2.261 -5.5 -0.5 -5.5 C
-3.261 -5.5 -5.5 -3.261 -5.5 -0.5 C
-5.5 2.261 -3.261 4.5 -0.5 4.5 C
2.261 4.5 4.5 2.261 4.5 -0.5 C
S
GR
GS
[0.6 0 0 0.6 120.7767 139.27169] CT
0 0 1 RC
10.0 ML
N
4.5 -0.5 M
4.5 -3.261 2.261 -5.5 -0.5 -5.5 C
-3.261 -5.5 -5.5 -3.261 -5.5 -0.5 C
-5.5 2.261 -3.261 4.5 -0.5 4.5 C
2.261 4.5 4.5 2.261 4.5 -0.5 C
S
GR
GS
[0.6 0 0 0.6 120.7767 164.32831] CT
0 0 1 RC
10.0 ML
N
4.5 -0.5 M
4.5 -3.261 2.261 -5.5 -0.5 -5.5 C
-3.261 -5.5 -5.5 -3.261 -5.5 -0.5 C
-5.5 2.261 -3.261 4.5 -0.5 4.5 C
2.261 4.5 4.5 2.261 4.5 -0.5 C
S
GR
GS
[0.6 0 0 0.6 111.87215 149.1015] CT
0 0 1 RC
10.0 ML
N
4.5 -0.5 M
4.5 -3.261 2.261 -5.5 -0.5 -5.5 C
-3.261 -5.5 -5.5 -3.261 -5.5 -0.5 C
-5.5 2.261 -3.261 4.5 -0.5 4.5 C
2.261 4.5 4.5 2.261 4.5 -0.5 C
S
GR
GS
[0.6 0 0 0.6 111.87215 154.4985] CT
0 0 1 RC
10.0 ML
N
4.5 -0.5 M
4.5 -3.261 2.261 -5.5 -0.5 -5.5 C
-3.261 -5.5 -5.5 -3.261 -5.5 -0.5 C
-5.5 2.261 -3.261 4.5 -0.5 4.5 C
2.261 4.5 4.5 2.261 4.5 -0.5 C
S
GR
GS
[0.6 0 0 0.6 94.08438 151.8] CT
0 0 1 RC
10.0 ML
N
4.5 -0.5 M
4.5 -3.261 2.261 -5.5 -0.5 -5.5 C
-3.261 -5.5 -5.5 -3.261 -5.5 -0.5 C
-5.5 2.261 -3.261 4.5 -0.5 4.5 C
2.261 4.5 4.5 2.261 4.5 -0.5 C
S
GR
GS
[0.6 0 0 0.6 85.70322 151.8] CT
0 0 1 RC
10.0 ML
N
4.5 -0.5 M
4.5 -3.261 2.261 -5.5 -0.5 -5.5 C
-3.261 -5.5 -5.5 -3.261 -5.5 -0.5 C
-5.5 2.261 -3.261 4.5 -0.5 4.5 C
2.261 4.5 4.5 2.261 4.5 -0.5 C
S
GR
GS
[0.6 0 0 0.6 77.32258 151.8] CT
0 0 1 RC
10.0 ML
N
4.5 -0.5 M
4.5 -3.261 2.261 -5.5 -0.5 -5.5 C
-3.261 -5.5 -5.5 -3.261 -5.5 -0.5 C
-5.5 2.261 -3.261 4.5 -0.5 4.5 C
2.261 4.5 4.5 2.261 4.5 -0.5 C
S
GR
GS
[0.6 0 0 0.6 68.94194 151.8] CT
0 0 1 RC
10.0 ML
N
4.5 -0.5 M
4.5 -3.261 2.261 -5.5 -0.5 -5.5 C
-3.261 -5.5 -5.5 -3.261 -5.5 -0.5 C
-5.5 2.261 -3.261 4.5 -0.5 4.5 C
2.261 4.5 4.5 2.261 4.5 -0.5 C
S
GR
GS
[0.6 0 0 0.6 60.56129 151.8] CT
0 0 1 RC
10.0 ML
N
4.5 -0.5 M
4.5 -3.261 2.261 -5.5 -0.5 -5.5 C
-3.261 -5.5 -5.5 -3.261 -5.5 -0.5 C
-5.5 2.261 -3.261 4.5 -0.5 4.5 C
2.261 4.5 4.5 2.261 4.5 -0.5 C
S
GR
GS
[0.6 0 0 0.6 0 0] CT
1 GC
N
532 421 M
532 322 L
647 322 L
647 421 L
cp
f
GR
GS
[0.6 0 0 0.6 354.6 204.6] CT
N
3 0.234 M
2.484 0.234 2.039 0.039 QT
1.594 -0.156 1.258 -0.523 QT
0.922 -0.891 0.758 -1.344 QT
0.594 -1.797 0.594 -2.328 QT
0.594 -3.266 1.039 -4.148 QT
1.484 -5.031 2.25 -5.672 QT
3.016 -6.313 3.922 -6.547 QT
3.484 -7.359 3.25 -7.945 QT
3.016 -8.531 3.016 -9.141 QT
3.016 -9.609 3.227 -9.953 QT
3.438 -10.297 3.813 -10.492 QT
4.188 -10.688 4.656 -10.688 QT
5.094 -10.688 6.422 -10.391 QT
6.766 -10.313 6.766 -9.984 QT
6.766 -9.734 6.586 -9.531 QT
6.406 -9.328 6.156 -9.328 QT
5.969 -9.328 5.82 -9.414 QT
5.672 -9.5 5.359 -9.711 QT
5.047 -9.922 4.797 -10.039 QT
4.547 -10.156 4.281 -10.156 QT
3.969 -10.156 3.727 -9.969 QT
3.484 -9.781 3.484 -9.484 QT
3.484 -9 3.906 -8.383 QT
4.328 -7.766 5.094 -6.797 QT
5.984 -5.672 5.984 -4.313 QT
5.984 -3.641 5.789 -2.852 QT
5.594 -2.063 5.227 -1.367 QT
4.859 -0.672 4.281 -0.219 QT
3.703 0.234 3 0.234 QT
cp
3.031 -0.188 M
3.625 -0.188 4.039 -0.797 QT
4.453 -1.406 4.672 -2.242 QT
4.891 -3.078 4.891 -3.641 QT
4.891 -4.766 4.109 -6.172 QT
3.313 -5.953 2.742 -5.25 QT
2.172 -4.547 1.883 -3.625 QT
1.594 -2.703 1.594 -1.891 QT
1.594 -1.172 1.969 -0.68 QT
2.344 -0.188 3.031 -0.188 QT
cp
f
GR
GS
[0.6 0 0 0.6 358.8 204.6] CT
/Helvetica 15 F
GS
[1 0 0 1 0 0] CT
0 0 moveto 
1 -1 scale
(=0) t 
GR
GR
GS
[0.6 0 0 0.6 337.23922 200.70948] CT
N
f954680962
f
GR
GS
[0.6 0 0 0.6 354.6 219] CT
N
/f2010411879{3 0.234 M
2.484 0.234 2.039 0.039 QT
1.594 -0.156 1.258 -0.523 QT
0.922 -0.891 0.758 -1.344 QT
0.594 -1.797 0.594 -2.328 QT
0.594 -3.266 1.039 -4.148 QT
1.484 -5.031 2.25 -5.672 QT
3.016 -6.313 3.922 -6.547 QT
3.484 -7.359 3.25 -7.945 QT
3.016 -8.531 3.016 -9.141 QT
3.016 -9.609 3.227 -9.953 QT
3.438 -10.297 3.813 -10.492 QT
4.188 -10.688 4.656 -10.688 QT
5.094 -10.688 6.422 -10.391 QT
6.766 -10.313 6.766 -9.984 QT
6.766 -9.734 6.586 -9.531 QT
6.406 -9.328 6.156 -9.328 QT
5.969 -9.328 5.82 -9.414 QT
5.672 -9.5 5.359 -9.711 QT
5.047 -9.922 4.797 -10.039 QT
4.547 -10.156 4.281 -10.156 QT
3.969 -10.156 3.727 -9.969 QT
3.484 -9.781 3.484 -9.484 QT
3.484 -9 3.906 -8.383 QT
4.328 -7.766 5.094 -6.797 QT
5.984 -5.672 5.984 -4.313 QT
5.984 -3.641 5.789 -2.852 QT
5.594 -2.063 5.227 -1.367 QT
4.859 -0.672 4.281 -0.219 QT
3.703 0.234 3 0.234 QT
cp
3.031 -0.188 M
3.625 -0.188 4.039 -0.797 QT
4.453 -1.406 4.672 -2.242 QT
4.891 -3.078 4.891 -3.641 QT
4.891 -4.766 4.109 -6.172 QT
3.313 -5.953 2.742 -5.25 QT
2.172 -4.547 1.883 -3.625 QT
1.594 -2.703 1.594 -1.891 QT
1.594 -1.172 1.969 -0.68 QT
2.344 -0.188 3.031 -0.188 QT
cp}def
f2010411879
f
GR
GS
[0.6 0 0 0.6 358.8 219] CT
/Helvetica 15 F
GS
[1 0 0 1 0 0] CT
0 0 moveto 
1 -1 scale
(=10) t 
GR
GR
GS
[0.6 0 0 0.6 374.4 214.8] CT
/Helvetica 12 F
GS
[1 0 0 1 0 0] CT
0 0 moveto 
1 -1 scale
(-16) t 
GR
GR
GS
[0.6 0 0 0.6 337.23922 214.30164] CT
1 0 0 RC
10.0 ML
N
4.5 -0.5 M
4.5 -3.261 2.261 -5.5 -0.5 -5.5 C
-3.261 -5.5 -5.5 -3.261 -5.5 -0.5 C
-5.5 2.261 -3.261 4.5 -0.5 4.5 C
2.261 4.5 4.5 2.261 4.5 -0.5 C
S
GR
GS
[0.6 0 0 0.6 354.6 234] CT
N
f2010411879
f
GR
GS
[0.6 0 0 0.6 358.8 234] CT
/Helvetica 15 F
GS
[1 0 0 1 0 0] CT
0 0 moveto 
1 -1 scale
(=10) t 
GR
GR
GS
[0.6 0 0 0.6 374.4 229.8] CT
/Helvetica 12 F
GS
[1 0 0 1 0 0] CT
0 0 moveto 
1 -1 scale
(-8) t 
GR
GR
GS
[0.6 0 0 0.6 337.23922 229.09532] CT
0 1 0 RC
10.0 ML
N
4.5 -0.5 M
4.5 -3.261 2.261 -5.5 -0.5 -5.5 C
-3.261 -5.5 -5.5 -3.261 -5.5 -0.5 C
-5.5 2.261 -3.261 4.5 -0.5 4.5 C
2.261 4.5 4.5 2.261 4.5 -0.5 C
S
GR
GS
[0.6 0 0 0.6 354.6 248.4] CT
N
f2010411879
f
GR
GS
[0.6 0 0 0.6 358.8 248.4] CT
/Helvetica 15 F
GS
[1 0 0 1 0 0] CT
0 0 moveto 
1 -1 scale
(=10) t 
GR
GR
GS
[0.6 0 0 0.6 374.4 244.2] CT
/Helvetica 12 F
GS
[1 0 0 1 0 0] CT
0 0 moveto 
1 -1 scale
(-4) t 
GR
GR
GS
[0.6 0 0 0.6 337.23922 243.889] CT
0 0 1 RC
10.0 ML
N
4.5 -0.5 M
4.5 -3.261 2.261 -5.5 -0.5 -5.5 C
-3.261 -5.5 -5.5 -3.261 -5.5 -0.5 C
-5.5 2.261 -3.261 4.5 -0.5 4.5 C
2.261 4.5 4.5 2.261 4.5 -0.5 C
S
GR
GS
[0.6 0 0 0.6 0 0] CT
0.149 GC
10.0 ML
0.833 LW
N
532 421 M
532 322 L
647 322 L
647 421 L
cp
S
GR
%%Trailer
%%Pages: 1
%%EOF
