{
    "entityId": "2022-6BET24",
    "academicalYear": "2022",
    "code": "6BET24",
    "title": "A Ciel Ouvert - Expérience(s) et vérité",
    "facultyId": "267",
    "facultyLabel": "Faculté autonome de théologie protestante",
    "studyLevel": "Bachelor / Master",
    "credits": 3.0,
    "type": "Cours",
    "duration": null,
    "periodicity": "Automne",
    "objective": "A la fin du cours, les étudiant·e·s connaîtront les changements de paradigmes majeurs qui ont ponctué l'histoire des sciences astronomiques et seront capables d'en analyser les enjeux philosophiques et théologiques.",
    "description": "Cet enseignement interfacultaire se caractérise par un ensemble de 12 séances polyphoniques comprenant une alternance entre professeur-es issu-es de la Faculté de théologie et du Département d'astronomie de la Faculté des sciences, ainsi que des professeur-es issu-es d'autres Facultés. Certaines séances seront données par un binôme théologien-e et scientifique, afin que le dialogue interdisciplinaire qui fonde l'esprit du programme « A Ciel Ouvert ' Science et spiritualité » soit présent d'emblée. D'autres séances proposeront soit un approfondissement par une de ces deux disciplines, soit une échappée vers un autre champ.\n\nLe cours se compose de trois moments autour des questions suivantes : Qu'entend-on par « recherche de la vérité » ? Pourquoi mettre en relation les notions d'expérience et de vérité ? La vérité ne se manifeste-t-elle que dans l'expérience ? Les termes d'« expérience » et de « vérité » nous sont communs, mais nous les interprétons de manière différente. Nous examinerons comment nous appréhendons ces notions et quelles sont les répercussions sur nos recherches.\n\nInscription via ce lien: https://www.unige.ch/theologie/a_ciel_ouvert/accueil/enseignement/cours-interfacultaire-automne-2022-experiences-et-verite/",
    "codeLanguage": "FR",
    "language": "français",
    "day": "Jeudi",
    "startHour": 16,
    "endHour": 18,
    "frequency": "hebdo",
    "building": "SCII",
    "room": "223",
    "personId": "637160",
    "teacherId": "2022-637160",
    "displayFirstName": "Ghislain",
    "displayLastName": "Waterlot",
    "displayFonction": "Professeur-e ordinaire",
    "listStudyPlan": [
        {
            "planCredits": "3",
            "studyPlanGroupId": "76971",
            "studyPlanPath": "Baccalauréat universitaire en théologie/Seconde partie/Options d'ouverture",
            "studyPlanId": "76945",
            "studyPlanLabel": "Baccalauréat universitaire en théologie",
            "facultyId": "267"
        },
        {
            "planCredits": "3",
            "studyPlanGroupId": "76989",
            "studyPlanPath": "Maîtrise universitaire en théologie/Divers (module à options)",
            "studyPlanId": "76947",
            "studyPlanLabel": "Maîtrise universitaire en théologie",
            "facultyId": "267"
        },
        {
            "planCredits": "2",
            "studyPlanGroupId": "73738",
            "studyPlanPath": "Maîtrise universitaire en chimie (MSc chimie)",
            "studyPlanId": "73738",
            "studyPlanLabel": "Maîtrise universitaire en chimie (MSc chimie)",
            "facultyId": "547"
        },
        {
            "planCredits": "2",
            "studyPlanGroupId": "73739",
            "studyPlanPath": "Maîtrise universitaire en biochimie (MSc biochimie)",
            "studyPlanId": "73739",
            "studyPlanLabel": "Maîtrise universitaire en biochimie (MSc biochimie)",
            "facultyId": "547"
        }
    ]
}