{
    "_data": [
        {
            "creation": {
                "when": null,
                "who": null
            },
            "lastUpdate": {
                "when": null,
                "who": null
            },
            "entityId": "2022-32J0472",
            "academicalYear": "2022",
            "code": "32J0472",
            "title": "« A Cologne, chez Pierre Marteau ». Pratiques éditoriales, dynamiques confessionnelles et livres interdits dans l'Europe de Louis XIV",
            "facultyId": "23",
            "shortFaculty": "L",
            "facultyLabel": "Faculté des lettres",
            "studyLevel": "Bachelor",
            "credits": null,
            "activities": [
                {
                    "creation": {
                        "when": null,
                        "who": null
                    },
                    "lastUpdate": {
                        "when": null,
                        "who": null
                    },
                    "entityId": "144125",
                    "code": "32J0472",
                    "title": "« A Cologne, chez Pierre Marteau ». Pratiques éditoriales, dynamiques confessionnelles et livres interdits dans l'Europe de Louis XIV",
                    "englishTitle": null,
                    "type": "Séminaire",
                    "shortType": "SE",
                    "duration": "2h",
                    "given": true,
                    "displayNotGiven": null,
                    "displayDuration": "2h de séminaire, automne",
                    "scheduleText": null,
                    "periodicity": "Automne",
                    "shortPeriodicity": "A",
                    "codeLanguage": "FR",
                    "language": "français",
                    "languageForSearch": "français",
                    "shortEvaluation": null,
                    "evaluation": null,
                    "evaluationComment": null,
                    "teachingId": "2022-32J0472",
                    "comment": null,
                    "courses": [
                        {
                            "creation": {
                                "when": null,
                                "who": null
                            },
                            "lastUpdate": {
                                "when": null,
                                "who": null
                            },
                            "entityId": "58469",
                            "activityId": "144125",
                            "shortDay": "Lu",
                            "day": "Lundi",
                            "startHour": 16,
                            "endHour": 18,
                            "time": "16-18",
                            "frequency": "hebdo",
                            "comment": null,
                            "building": "Les Philosophes",
                            "room": "011",
                            "teachingId": "2022-32J0472",
                            "periodicity": "Automne",
                            "shortPeriodicity": "A",
                            "duration": null,
                            "participantCount": 14,
                            "resId": "58469"
                        }
                    ],
                    "activityTeachers": [
                        {
                            "creation": {
                                "when": null,
                                "who": null
                            },
                            "lastUpdate": {
                                "when": null,
                                "who": null
                            },
                            "entityId": "144125-2022-731521",
                            "activityId": "144125",
                            "personId": "731521",
                            "teacherId": "2022-731521",
                            "teachingId": "2022-32J0472",
                            "displayFirstName": "Hadrien",
                            "displayLastName": "Dami",
                            "displayFonction": "Assistant-e",
                            "contactInfos": null,
                            "resId": "144125-2022-731521"
                        }
                    ],
                    "resId": "144125"
                }
            ],
            "resId": "2022-32J0472",
            "_links": {
                "self": {
                    "href": "https://pgc.unige.ch/main/api/teachings/2022-32J0472"
                },
                "list": {
                    "href": "https://pgc.unige.ch/main/api/teachings"
                },
                "module": {
                    "href": "https://pgc.unige.ch/main/api"
                }
            }
        }
    ]
}