%!PS-Adobe-3.0 EPSF-3.0
%%Title: C:/Users/gomel/Documents/Intentos en python/EE indicators/Simulations with pdfs to test/pdf and metrics tests/pareto_shift_explanation.eps
%%Creator: matplotlib version 3.2.1, http://matplotlib.org/
%%CreationDate: Wed Aug 26 13:48:50 2020
%%Orientation: portrait
%%BoundingBox: -234.0 217.44 846.0 574.56
%%EndComments
%%BeginProlog
/mpldict 9 dict def
mpldict begin
/m { moveto } bind def
/l { lineto } bind def
/r { rlineto } bind def
/c { curveto } bind def
/cl { closepath } bind def
/box {
m
1 index 0 r
0 exch r
neg 0 r
cl
} bind def
/clipbox {
box
clip
newpath
} bind def
%!PS-Adobe-3.0 Resource-Font
%%Title: DejaVu Sans
%%Copyright: Copyright (c) 2003 by Bitstream, Inc. All Rights Reserved. Copyright (c) 2006 by Tavmjong Bah. All Rights Reserved. DejaVu changes are in public domain 
%%Creator: Converted from TrueType to type 3 by PPR
25 dict begin
/_d{bind def}bind def
/_m{moveto}_d
/_l{lineto}_d
/_cl{closepath eofill}_d
/_c{curveto}_d
/_sc{7 -1 roll{setcachedevice}{pop pop pop pop pop pop}ifelse}_d
/_e{exec}_d
/FontName /DejaVuSans def
/PaintType 0 def
/FontMatrix[.001 0 0 .001 0 0]def
/FontBBox[-1021 -463 1793 1232]def
/FontType 3 def
/Encoding [ /parenleft /parenright /period /zero /two /less /equal /greater /minus ] def
/FontInfo 10 dict dup begin
/FamilyName (DejaVu Sans) def
/FullName (DejaVu Sans) def
/Notice (Copyright (c) 2003 by Bitstream, Inc. All Rights Reserved. Copyright (c) 2006 by Tavmjong Bah. All Rights Reserved. DejaVu changes are in public domain ) def
/Weight (Book) def
/Version (Version 2.35) def
/ItalicAngle 0.0 def
/isFixedPitch false def
/UnderlinePosition -130 def
/UnderlineThickness 90 def
end readonly def
/CharStrings 10 dict dup begin
/.notdef 0 def
/parenleft{390 0 86 -131 310 759 _sc
310 759 _m
266 683 234 609 213 536 _c
191 463 181 389 181 314 _c
181 238 191 164 213 91 _c
234 17 266 -56 310 -131 _c
232 -131 _l
183 -54 146 20 122 94 _c
98 168 86 241 86 314 _c
86 386 98 459 122 533 _c
146 607 182 682 232 759 _c
310 759 _l
_cl}_d
/parenright{390 0 80 -131 304 759 _sc
80 759 _m
158 759 _l
206 682 243 607 267 533 _c
291 459 304 386 304 314 _c
304 241 291 168 267 94 _c
243 20 206 -54 158 -131 _c
80 -131 _l
123 -56 155 17 177 91 _c
198 164 209 238 209 314 _c
209 389 198 463 177 536 _c
155 609 123 683 80 759 _c
_cl}_d
/period{318 0 107 0 210 124 _sc
107 124 _m
210 124 _l
210 0 _l
107 0 _l
107 124 _l
_cl}_d
/zero{636 0 66 -13 570 742 _sc
318 664 _m
267 664 229 639 203 589 _c
177 539 165 464 165 364 _c
165 264 177 189 203 139 _c
229 89 267 64 318 64 _c
369 64 407 89 433 139 _c
458 189 471 264 471 364 _c
471 464 458 539 433 589 _c
407 639 369 664 318 664 _c
318 742 _m
399 742 461 709 505 645 _c
548 580 570 486 570 364 _c
570 241 548 147 505 83 _c
461 19 399 -13 318 -13 _c
236 -13 173 19 130 83 _c
87 147 66 241 66 364 _c
66 486 87 580 130 645 _c
173 709 236 742 318 742 _c
_cl}_d
/two{{636 0 73 0 536 742 _sc
192 83 _m
536 83 _l
536 0 _l
73 0 _l
73 83 _l
110 121 161 173 226 239 _c
290 304 331 346 348 365 _c
380 400 402 430 414 455 _c
426 479 433 504 433 528 _c
433 566 419 598 392 622 _c
365 646 330 659 286 659 _c
255 659 222 653 188 643 _c
154 632 117 616 78 594 _c
78 694 _l
118 710 155 722 189 730 _c
223 738 255 742 284 742 _c
}_e{359 742 419 723 464 685 _c
509 647 532 597 532 534 _c
532 504 526 475 515 449 _c
504 422 484 390 454 354 _c
446 344 420 317 376 272 _c
332 227 271 164 192 83 _c
_cl}_e}_d
/less{838 0 106 46 732 581 _sc
732 492 _m
228 313 _l
732 135 _l
732 46 _l
106 273 _l
106 354 _l
732 581 _l
732 492 _l
_cl}_d
/equal{838 0 106 172 732 454 _sc
106 454 _m
732 454 _l
732 372 _l
106 372 _l
106 454 _l
106 255 _m
732 255 _l
732 172 _l
106 172 _l
106 255 _l
_cl}_d
/greater{838 0 106 46 732 581 _sc
106 492 _m
106 581 _l
732 354 _l
732 273 _l
106 46 _l
106 135 _l
609 313 _l
106 492 _l
_cl}_d
/minus{838 0 106 272 732 355 _sc
106 355 _m
732 355 _l
732 272 _l
106 272 _l
106 355 _l
_cl}_d
end readonly def

/BuildGlyph
 {exch begin
 CharStrings exch
 2 copy known not{pop /.notdef}if
 true 3 1 roll get exec
 end}_d

/BuildChar {
 1 index /Encoding get exch get
 1 index /BuildGlyph get exec
}_d

FontName currentdict end definefont pop
%!PS-Adobe-3.0 Resource-Font
%%Title: DejaVu Sans Oblique
%%Copyright: Copyright (c) 2003 by Bitstream, Inc. All Rights Reserved. Copyright (c) 2006 by Tavmjong Bah. All Rights Reserved. DejaVu changes are in public domain 
%%Creator: Converted from TrueType to type 3 by PPR
25 dict begin
/_d{bind def}bind def
/_m{moveto}_d
/_l{lineto}_d
/_cl{closepath eofill}_d
/_c{curveto}_d
/_sc{7 -1 roll{setcachedevice}{pop pop pop pop pop pop}ifelse}_d
/_e{exec}_d
/FontName /DejaVuSans-Oblique def
/PaintType 0 def
/FontMatrix[.001 0 0 .001 0 0]def
/FontBBox[-1016 -350 1659 1068]def
/FontType 3 def
/Encoding [ /I /k /p ] def
/FontInfo 10 dict dup begin
/FamilyName (DejaVu Sans) def
/FullName (DejaVu Sans Oblique) def
/Notice (Copyright (c) 2003 by Bitstream, Inc. All Rights Reserved. Copyright (c) 2006 by Tavmjong Bah. All Rights Reserved. DejaVu changes are in public domain ) def
/Weight (Oblique) def
/Version (Version 2.35) def
/ItalicAngle -11.0 def
/isFixedPitch false def
/UnderlinePosition -130 def
/UnderlineThickness 90 def
end readonly def
/CharStrings 4 dict dup begin
/.notdef 0 def
/I{295 0 27 0 268 729 _sc
169 729 _m
268 729 _l
126 0 _l
27 0 _l
169 729 _l
_cl}_d
/k{579 0 35 0 612 760 _sc
183 760 _m
273 760 _l
187 317 _l
495 547 _l
612 547 _l
268 285 _l
519 0 _l
410 0 _l
177 267 _l
125 0 _l
35 0 _l
183 760 _l
_cl}_d
/p{{635 0 -2 -207 589 560 _sc
496 337 _m
496 385 485 421 465 447 _c
444 472 414 485 375 485 _c
348 485 322 478 298 464 _c
274 450 252 431 234 405 _c
215 379 200 347 189 311 _c
178 275 173 239 173 203 _c
173 157 183 122 204 98 _c
224 73 254 61 293 61 _c
321 61 347 67 371 81 _c
395 94 416 113 434 139 _c
452 165 467 197 479 233 _c
490 269 496 304 496 337 _c
218 464 _m
}_e{242 495 270 519 303 535 _c
335 551 372 560 412 560 _c
468 560 511 541 542 505 _c
573 468 589 417 589 351 _c
589 297 579 245 560 196 _c
540 147 513 103 477 65 _c
453 39 425 19 395 6 _c
365 -6 333 -13 300 -13 _c
261 -13 228 -5 202 10 _c
176 26 156 50 143 82 _c
87 -207 _l
-2 -207 _l
144 547 _l
234 547 _l
218 464 _l
_cl}_e}_d
end readonly def

/BuildGlyph
 {exch begin
 CharStrings exch
 2 copy known not{pop /.notdef}if
 true 3 1 roll get exec
 end}_d

/BuildChar {
 1 index /Encoding get exch get
 1 index /BuildGlyph get exec
}_d

FontName currentdict end definefont pop
end
%%EndProlog
mpldict begin
-234 217.44 translate
1080 357.12 0 0 clipbox
gsave
0 0 m
1080 0 l
1080 357.12 l
0 357.12 l
cl
1.000 setgray
fill
grestore
gsave
135 39.2832 m
972 39.2832 l
972 314.2656 l
135 314.2656 l
cl
1.000 setgray
fill
grestore
gsave
837 275 135 39.28 clipbox
97.295213 39.2832 m
109.130748 39.2832 l
109.130748 39.658398 l
97.295213 39.658398 l
cl
0.502 setgray
fill
grestore
gsave
837 275 135 39.28 clipbox
109.130748 39.2832 m
120.966282 39.2832 l
120.966282 39.2832 l
109.130748 39.2832 l
cl
0.502 setgray
fill
grestore
gsave
837 275 135 39.28 clipbox
120.966282 39.2832 m
132.801816 39.2832 l
132.801816 39.2832 l
120.966282 39.2832 l
cl
0.502 setgray
fill
grestore
gsave
837 275 135 39.28 clipbox
132.801816 39.2832 m
144.63735 39.2832 l
144.63735 40.408793 l
132.801816 40.408793 l
cl
0.502 setgray
fill
grestore
gsave
837 275 135 39.28 clipbox
144.63735 39.2832 m
156.472884 39.2832 l
156.472884 40.783991 l
144.63735 40.783991 l
cl
0.502 setgray
fill
grestore
gsave
837 275 135 39.28 clipbox
156.472884 39.2832 m
168.308418 39.2832 l
168.308418 41.909584 l
156.472884 41.909584 l
cl
0.502 setgray
fill
grestore
gsave
837 275 135 39.28 clipbox
168.308418 39.2832 m
180.143952 39.2832 l
180.143952 44.535968 l
168.308418 44.535968 l
cl
0.502 setgray
fill
grestore
gsave
837 275 135 39.28 clipbox
180.143952 39.2832 m
191.979486 39.2832 l
191.979486 44.911166 l
180.143952 44.911166 l
cl
0.502 setgray
fill
grestore
gsave
837 275 135 39.28 clipbox
191.979486 39.2832 m
203.81502 39.2832 l
203.81502 47.53755 l
191.979486 47.53755 l
cl
0.502 setgray
fill
grestore
gsave
837 275 135 39.28 clipbox
203.81502 39.2832 m
215.650555 39.2832 l
215.650555 52.039922 l
203.81502 52.039922 l
cl
0.502 setgray
fill
grestore
gsave
837 275 135 39.28 clipbox
215.650555 39.2832 m
227.486089 39.2832 l
227.486089 55.416701 l
215.650555 55.416701 l
cl
0.502 setgray
fill
grestore
gsave
837 275 135 39.28 clipbox
227.486089 39.2832 m
239.321623 39.2832 l
239.321623 62.17026 l
227.486089 62.17026 l
cl
0.502 setgray
fill
grestore
gsave
837 275 135 39.28 clipbox
239.321623 39.2832 m
251.157157 39.2832 l
251.157157 70.42461 l
239.321623 70.42461 l
cl
0.502 setgray
fill
grestore
gsave
837 275 135 39.28 clipbox
251.157157 39.2832 m
262.992691 39.2832 l
262.992691 82.055739 l
251.157157 82.055739 l
cl
0.502 setgray
fill
grestore
gsave
837 275 135 39.28 clipbox
262.992691 39.2832 m
274.828225 39.2832 l
274.828225 103.06681 l
262.992691 103.06681 l
cl
0.502 setgray
fill
grestore
gsave
837 275 135 39.28 clipbox
274.828225 39.2832 m
286.663759 39.2832 l
286.663759 125.578673 l
274.828225 125.578673 l
cl
0.502 setgray
fill
grestore
gsave
837 275 135 39.28 clipbox
286.663759 39.2832 m
298.499293 39.2832 l
298.499293 130.831441 l
286.663759 130.831441 l
cl
0.502 setgray
fill
grestore
gsave
837 275 135 39.28 clipbox
298.499293 39.2832 m
310.334827 39.2832 l
310.334827 165.34963 l
298.499293 165.34963 l
cl
0.502 setgray
fill
grestore
gsave
837 275 135 39.28 clipbox
310.334827 39.2832 m
322.170362 39.2832 l
322.170362 197.99183 l
310.334827 197.99183 l
cl
0.502 setgray
fill
grestore
gsave
837 275 135 39.28 clipbox
322.170362 39.2832 m
334.005896 39.2832 l
334.005896 200.993412 l
322.170362 200.993412 l
cl
0.502 setgray
fill
grestore
gsave
837 275 135 39.28 clipbox
334.005896 39.2832 m
345.84143 39.2832 l
345.84143 234.386008 l
334.005896 234.386008 l
cl
0.502 setgray
fill
grestore
gsave
837 275 135 39.28 clipbox
345.84143 39.2832 m
357.676964 39.2832 l
357.676964 246.017137 l
345.84143 246.017137 l
cl
0.502 setgray
fill
grestore
gsave
837 275 135 39.28 clipbox
357.676964 39.2832 m
369.512498 39.2832 l
369.512498 278.28414 l
357.676964 278.28414 l
cl
0.502 setgray
fill
grestore
gsave
837 275 135 39.28 clipbox
369.512498 39.2832 m
381.348032 39.2832 l
381.348032 275.657756 l
369.512498 275.657756 l
cl
0.502 setgray
fill
grestore
gsave
837 275 135 39.28 clipbox
381.348032 39.2832 m
393.183566 39.2832 l
393.183566 301.1712 l
381.348032 301.1712 l
cl
0.502 setgray
fill
grestore
gsave
837 275 135 39.28 clipbox
393.183566 39.2832 m
405.0191 39.2832 l
405.0191 280.910524 l
393.183566 280.910524 l
cl
0.502 setgray
fill
grestore
gsave
837 275 135 39.28 clipbox
405.0191 39.2832 m
416.854635 39.2832 l
416.854635 269.654593 l
405.0191 269.654593 l
cl
0.502 setgray
fill
grestore
gsave
837 275 135 39.28 clipbox
416.854635 39.2832 m
428.690169 39.2832 l
428.690169 256.147475 l
416.854635 256.147475 l
cl
0.502 setgray
fill
grestore
gsave
837 275 135 39.28 clipbox
428.690169 39.2832 m
440.525703 39.2832 l
440.525703 244.516346 l
428.690169 244.516346 l
cl
0.502 setgray
fill
grestore
gsave
837 275 135 39.28 clipbox
440.525703 39.2832 m
452.361237 39.2832 l
452.361237 193.489458 l
440.525703 193.489458 l
cl
0.502 setgray
fill
grestore
gsave
837 275 135 39.28 clipbox
452.361237 39.2832 m
464.196771 39.2832 l
464.196771 187.486295 l
452.361237 187.486295 l
cl
0.502 setgray
fill
grestore
gsave
837 275 135 39.28 clipbox
464.196771 39.2832 m
476.032305 39.2832 l
476.032305 178.106352 l
464.196771 178.106352 l
cl
0.502 setgray
fill
grestore
gsave
837 275 135 39.28 clipbox
476.032305 39.2832 m
487.867839 39.2832 l
487.867839 138.710593 l
476.032305 138.710593 l
cl
0.502 setgray
fill
grestore
gsave
837 275 135 39.28 clipbox
487.867839 39.2832 m
499.703373 39.2832 l
499.703373 130.081045 l
487.867839 130.081045 l
cl
0.502 setgray
fill
grestore
gsave
837 275 135 39.28 clipbox
499.703373 39.2832 m
511.538907 39.2832 l
511.538907 110.945962 l
499.703373 110.945962 l
cl
0.502 setgray
fill
grestore
gsave
837 275 135 39.28 clipbox
511.538907 39.2832 m
523.374442 39.2832 l
523.374442 94.062065 l
511.538907 94.062065 l
cl
0.502 setgray
fill
grestore
gsave
837 275 135 39.28 clipbox
523.374442 39.2832 m
535.209976 39.2832 l
535.209976 74.926982 l
523.374442 74.926982 l
cl
0.502 setgray
fill
grestore
gsave
837 275 135 39.28 clipbox
535.209976 39.2832 m
547.04551 39.2832 l
547.04551 66.672633 l
535.209976 66.672633 l
cl
0.502 setgray
fill
grestore
gsave
837 275 135 39.28 clipbox
547.04551 39.2832 m
558.881044 39.2832 l
558.881044 66.672633 l
547.04551 66.672633 l
cl
0.502 setgray
fill
grestore
gsave
837 275 135 39.28 clipbox
558.881044 39.2832 m
570.716578 39.2832 l
570.716578 49.788736 l
558.881044 49.788736 l
cl
0.502 setgray
fill
grestore
gsave
837 275 135 39.28 clipbox
570.716578 39.2832 m
582.552112 39.2832 l
582.552112 47.162352 l
570.716578 47.162352 l
cl
0.502 setgray
fill
grestore
gsave
837 275 135 39.28 clipbox
582.552112 39.2832 m
594.387646 39.2832 l
594.387646 45.286363 l
582.552112 45.286363 l
cl
0.502 setgray
fill
grestore
gsave
837 275 135 39.28 clipbox
594.387646 39.2832 m
606.22318 39.2832 l
606.22318 42.659979 l
594.387646 42.659979 l
cl
0.502 setgray
fill
grestore
gsave
837 275 135 39.28 clipbox
606.22318 39.2832 m
618.058714 39.2832 l
618.058714 40.783991 l
606.22318 40.783991 l
cl
0.502 setgray
fill
grestore
gsave
837 275 135 39.28 clipbox
618.058714 39.2832 m
629.894249 39.2832 l
629.894249 41.534386 l
618.058714 41.534386 l
cl
0.502 setgray
fill
grestore
gsave
837 275 135 39.28 clipbox
629.894249 39.2832 m
641.729783 39.2832 l
641.729783 39.2832 l
629.894249 39.2832 l
cl
0.502 setgray
fill
grestore
gsave
837 275 135 39.28 clipbox
641.729783 39.2832 m
653.565317 39.2832 l
653.565317 39.2832 l
641.729783 39.2832 l
cl
0.502 setgray
fill
grestore
gsave
837 275 135 39.28 clipbox
653.565317 39.2832 m
665.400851 39.2832 l
665.400851 39.2832 l
653.565317 39.2832 l
cl
0.502 setgray
fill
grestore
gsave
837 275 135 39.28 clipbox
665.400851 39.2832 m
677.236385 39.2832 l
677.236385 39.2832 l
665.400851 39.2832 l
cl
0.502 setgray
fill
grestore
gsave
837 275 135 39.28 clipbox
677.236385 39.2832 m
689.071919 39.2832 l
689.071919 39.2832 l
677.236385 39.2832 l
cl
0.502 setgray
fill
grestore
gsave
837 275 135 39.28 clipbox
689.071919 39.2832 m
700.907453 39.2832 l
700.907453 39.2832 l
689.071919 39.2832 l
cl
0.502 setgray
fill
grestore
gsave
837 275 135 39.28 clipbox
700.907453 39.2832 m
712.742987 39.2832 l
712.742987 39.658398 l
700.907453 39.658398 l
cl
0.502 setgray
fill
grestore
gsave
837 275 135 39.28 clipbox
426.130435 39.2832 m
437.965969 39.2832 l
437.965969 39.658398 l
426.130435 39.658398 l
cl
0.502 setgray
fill
grestore
gsave
837 275 135 39.28 clipbox
437.965969 39.2832 m
449.801503 39.2832 l
449.801503 39.2832 l
437.965969 39.2832 l
cl
0.502 setgray
fill
grestore
gsave
837 275 135 39.28 clipbox
449.801503 39.2832 m
461.637037 39.2832 l
461.637037 39.2832 l
449.801503 39.2832 l
cl
0.502 setgray
fill
grestore
gsave
837 275 135 39.28 clipbox
461.637037 39.2832 m
473.472571 39.2832 l
473.472571 40.408793 l
461.637037 40.408793 l
cl
0.502 setgray
fill
grestore
gsave
837 275 135 39.28 clipbox
473.472571 39.2832 m
485.308105 39.2832 l
485.308105 40.783991 l
473.472571 40.783991 l
cl
0.502 setgray
fill
grestore
gsave
837 275 135 39.28 clipbox
485.308105 39.2832 m
497.143639 39.2832 l
497.143639 41.909584 l
485.308105 41.909584 l
cl
0.502 setgray
fill
grestore
gsave
837 275 135 39.28 clipbox
497.143639 39.2832 m
508.979174 39.2832 l
508.979174 44.535968 l
497.143639 44.535968 l
cl
0.502 setgray
fill
grestore
gsave
837 275 135 39.28 clipbox
508.979174 39.2832 m
520.814708 39.2832 l
520.814708 44.911166 l
508.979174 44.911166 l
cl
0.502 setgray
fill
grestore
gsave
837 275 135 39.28 clipbox
520.814708 39.2832 m
532.650242 39.2832 l
532.650242 47.53755 l
520.814708 47.53755 l
cl
0.502 setgray
fill
grestore
gsave
837 275 135 39.28 clipbox
532.650242 39.2832 m
544.485776 39.2832 l
544.485776 52.039922 l
532.650242 52.039922 l
cl
0.502 setgray
fill
grestore
gsave
837 275 135 39.28 clipbox
544.485776 39.2832 m
556.32131 39.2832 l
556.32131 55.416701 l
544.485776 55.416701 l
cl
0.502 setgray
fill
grestore
gsave
837 275 135 39.28 clipbox
556.32131 39.2832 m
568.156844 39.2832 l
568.156844 62.17026 l
556.32131 62.17026 l
cl
0.502 setgray
fill
grestore
gsave
837 275 135 39.28 clipbox
568.156844 39.2832 m
579.992378 39.2832 l
579.992378 70.42461 l
568.156844 70.42461 l
cl
0.502 setgray
fill
grestore
gsave
837 275 135 39.28 clipbox
579.992378 39.2832 m
591.827912 39.2832 l
591.827912 82.055739 l
579.992378 82.055739 l
cl
0.502 setgray
fill
grestore
gsave
837 275 135 39.28 clipbox
591.827912 39.2832 m
603.663446 39.2832 l
603.663446 103.06681 l
591.827912 103.06681 l
cl
0.502 setgray
fill
grestore
gsave
837 275 135 39.28 clipbox
603.663446 39.2832 m
615.498981 39.2832 l
615.498981 125.578673 l
603.663446 125.578673 l
cl
0.502 setgray
fill
grestore
gsave
837 275 135 39.28 clipbox
615.498981 39.2832 m
627.334515 39.2832 l
627.334515 130.831441 l
615.498981 130.831441 l
cl
0.502 setgray
fill
grestore
gsave
837 275 135 39.28 clipbox
627.334515 39.2832 m
639.170049 39.2832 l
639.170049 165.34963 l
627.334515 165.34963 l
cl
0.502 setgray
fill
grestore
gsave
837 275 135 39.28 clipbox
639.170049 39.2832 m
651.005583 39.2832 l
651.005583 197.99183 l
639.170049 197.99183 l
cl
0.502 setgray
fill
grestore
gsave
837 275 135 39.28 clipbox
651.005583 39.2832 m
662.841117 39.2832 l
662.841117 200.993412 l
651.005583 200.993412 l
cl
0.502 setgray
fill
grestore
gsave
837 275 135 39.28 clipbox
662.841117 39.2832 m
674.676651 39.2832 l
674.676651 234.386008 l
662.841117 234.386008 l
cl
0.502 setgray
fill
grestore
gsave
837 275 135 39.28 clipbox
674.676651 39.2832 m
686.512185 39.2832 l
686.512185 246.017137 l
674.676651 246.017137 l
cl
0.502 setgray
fill
grestore
gsave
837 275 135 39.28 clipbox
686.512185 39.2832 m
698.347719 39.2832 l
698.347719 278.28414 l
686.512185 278.28414 l
cl
0.502 setgray
fill
grestore
gsave
837 275 135 39.28 clipbox
698.347719 39.2832 m
710.183254 39.2832 l
710.183254 275.657756 l
698.347719 275.657756 l
cl
0.502 setgray
fill
grestore
gsave
837 275 135 39.28 clipbox
710.183254 39.2832 m
722.018788 39.2832 l
722.018788 301.1712 l
710.183254 301.1712 l
cl
0.502 setgray
fill
grestore
gsave
837 275 135 39.28 clipbox
722.018788 39.2832 m
733.854322 39.2832 l
733.854322 280.910524 l
722.018788 280.910524 l
cl
0.502 setgray
fill
grestore
gsave
837 275 135 39.28 clipbox
733.854322 39.2832 m
745.689856 39.2832 l
745.689856 269.654593 l
733.854322 269.654593 l
cl
0.502 setgray
fill
grestore
gsave
837 275 135 39.28 clipbox
745.689856 39.2832 m
757.52539 39.2832 l
757.52539 256.147475 l
745.689856 256.147475 l
cl
0.502 setgray
fill
grestore
gsave
837 275 135 39.28 clipbox
757.52539 39.2832 m
769.360924 39.2832 l
769.360924 244.516346 l
757.52539 244.516346 l
cl
0.502 setgray
fill
grestore
gsave
837 275 135 39.28 clipbox
769.360924 39.2832 m
781.196458 39.2832 l
781.196458 193.489458 l
769.360924 193.489458 l
cl
0.502 setgray
fill
grestore
gsave
837 275 135 39.28 clipbox
781.196458 39.2832 m
793.031992 39.2832 l
793.031992 187.486295 l
781.196458 187.486295 l
cl
0.502 setgray
fill
grestore
gsave
837 275 135 39.28 clipbox
793.031992 39.2832 m
804.867526 39.2832 l
804.867526 178.106352 l
793.031992 178.106352 l
cl
0.502 setgray
fill
grestore
gsave
837 275 135 39.28 clipbox
804.867526 39.2832 m
816.703061 39.2832 l
816.703061 138.710593 l
804.867526 138.710593 l
cl
0.502 setgray
fill
grestore
gsave
837 275 135 39.28 clipbox
816.703061 39.2832 m
828.538595 39.2832 l
828.538595 130.081045 l
816.703061 130.081045 l
cl
0.502 setgray
fill
grestore
gsave
837 275 135 39.28 clipbox
828.538595 39.2832 m
840.374129 39.2832 l
840.374129 110.945962 l
828.538595 110.945962 l
cl
0.502 setgray
fill
grestore
gsave
837 275 135 39.28 clipbox
840.374129 39.2832 m
852.209663 39.2832 l
852.209663 94.062065 l
840.374129 94.062065 l
cl
0.502 setgray
fill
grestore
gsave
837 275 135 39.28 clipbox
852.209663 39.2832 m
864.045197 39.2832 l
864.045197 74.926982 l
852.209663 74.926982 l
cl
0.502 setgray
fill
grestore
gsave
837 275 135 39.28 clipbox
864.045197 39.2832 m
875.880731 39.2832 l
875.880731 66.672633 l
864.045197 66.672633 l
cl
0.502 setgray
fill
grestore
gsave
837 275 135 39.28 clipbox
875.880731 39.2832 m
887.716265 39.2832 l
887.716265 66.672633 l
875.880731 66.672633 l
cl
0.502 setgray
fill
grestore
gsave
837 275 135 39.28 clipbox
887.716265 39.2832 m
899.551799 39.2832 l
899.551799 49.788736 l
887.716265 49.788736 l
cl
0.502 setgray
fill
grestore
gsave
837 275 135 39.28 clipbox
899.551799 39.2832 m
911.387333 39.2832 l
911.387333 47.162352 l
899.551799 47.162352 l
cl
0.502 setgray
fill
grestore
gsave
837 275 135 39.28 clipbox
911.387333 39.2832 m
923.222868 39.2832 l
923.222868 45.286363 l
911.387333 45.286363 l
cl
0.502 setgray
fill
grestore
gsave
837 275 135 39.28 clipbox
923.222868 39.2832 m
935.058402 39.2832 l
935.058402 42.659979 l
923.222868 42.659979 l
cl
0.502 setgray
fill
grestore
gsave
837 275 135 39.28 clipbox
935.058402 39.2832 m
946.893936 39.2832 l
946.893936 40.783991 l
935.058402 40.783991 l
cl
0.502 setgray
fill
grestore
gsave
837 275 135 39.28 clipbox
946.893936 39.2832 m
958.72947 39.2832 l
958.72947 41.534386 l
946.893936 41.534386 l
cl
0.502 setgray
fill
grestore
gsave
837 275 135 39.28 clipbox
958.72947 39.2832 m
970.565004 39.2832 l
970.565004 39.2832 l
958.72947 39.2832 l
cl
0.502 setgray
fill
grestore
gsave
837 275 135 39.28 clipbox
970.565004 39.2832 m
982.400538 39.2832 l
982.400538 39.2832 l
970.565004 39.2832 l
cl
0.502 setgray
fill
grestore
gsave
837 275 135 39.28 clipbox
982.400538 39.2832 m
994.236072 39.2832 l
994.236072 39.2832 l
982.400538 39.2832 l
cl
0.502 setgray
fill
grestore
gsave
837 275 135 39.28 clipbox
994.236072 39.2832 m
1006.071606 39.2832 l
1006.071606 39.2832 l
994.236072 39.2832 l
cl
0.502 setgray
fill
grestore
gsave
837 275 135 39.28 clipbox
1006.071606 39.2832 m
1017.90714 39.2832 l
1017.90714 39.2832 l
1006.071606 39.2832 l
cl
0.502 setgray
fill
grestore
gsave
837 275 135 39.28 clipbox
1017.90714 39.2832 m
1029.742675 39.2832 l
1029.742675 39.2832 l
1017.90714 39.2832 l
cl
0.502 setgray
fill
grestore
gsave
837 275 135 39.28 clipbox
1029.742675 39.2832 m
1041.578209 39.2832 l
1041.578209 39.658398 l
1029.742675 39.658398 l
cl
0.502 setgray
fill
grestore
gsave
837 275 135 39.28 clipbox
781.196458 39.2832 m
793.031992 39.2832 l
793.031992 187.486295 l
781.196458 187.486295 l
cl
1.000 0.000 1.000 setrgbcolor
fill
grestore
gsave
837 275 135 39.28 clipbox
793.031992 39.2832 m
804.867526 39.2832 l
804.867526 178.106352 l
793.031992 178.106352 l
cl
1.000 0.000 1.000 setrgbcolor
fill
grestore
gsave
837 275 135 39.28 clipbox
804.867526 39.2832 m
816.703061 39.2832 l
816.703061 138.710593 l
804.867526 138.710593 l
cl
1.000 0.000 1.000 setrgbcolor
fill
grestore
gsave
837 275 135 39.28 clipbox
816.703061 39.2832 m
828.538595 39.2832 l
828.538595 130.081045 l
816.703061 130.081045 l
cl
1.000 0.000 1.000 setrgbcolor
fill
grestore
gsave
837 275 135 39.28 clipbox
828.538595 39.2832 m
840.374129 39.2832 l
840.374129 110.945962 l
828.538595 110.945962 l
cl
1.000 0.000 1.000 setrgbcolor
fill
grestore
gsave
837 275 135 39.28 clipbox
840.374129 39.2832 m
852.209663 39.2832 l
852.209663 94.062065 l
840.374129 94.062065 l
cl
1.000 0.000 1.000 setrgbcolor
fill
grestore
gsave
837 275 135 39.28 clipbox
852.209663 39.2832 m
864.045197 39.2832 l
864.045197 74.926982 l
852.209663 74.926982 l
cl
1.000 0.000 1.000 setrgbcolor
fill
grestore
gsave
837 275 135 39.28 clipbox
864.045197 39.2832 m
875.880731 39.2832 l
875.880731 66.672633 l
864.045197 66.672633 l
cl
1.000 0.000 1.000 setrgbcolor
fill
grestore
gsave
837 275 135 39.28 clipbox
875.880731 39.2832 m
887.716265 39.2832 l
887.716265 66.672633 l
875.880731 66.672633 l
cl
1.000 0.000 1.000 setrgbcolor
fill
grestore
gsave
837 275 135 39.28 clipbox
887.716265 39.2832 m
899.551799 39.2832 l
899.551799 49.788736 l
887.716265 49.788736 l
cl
1.000 0.000 1.000 setrgbcolor
fill
grestore
gsave
837 275 135 39.28 clipbox
899.551799 39.2832 m
911.387333 39.2832 l
911.387333 47.162352 l
899.551799 47.162352 l
cl
1.000 0.000 1.000 setrgbcolor
fill
grestore
gsave
837 275 135 39.28 clipbox
911.387333 39.2832 m
923.222868 39.2832 l
923.222868 45.286363 l
911.387333 45.286363 l
cl
1.000 0.000 1.000 setrgbcolor
fill
grestore
gsave
837 275 135 39.28 clipbox
923.222868 39.2832 m
935.058402 39.2832 l
935.058402 42.659979 l
923.222868 42.659979 l
cl
1.000 0.000 1.000 setrgbcolor
fill
grestore
gsave
837 275 135 39.28 clipbox
935.058402 39.2832 m
946.893936 39.2832 l
946.893936 40.783991 l
935.058402 40.783991 l
cl
1.000 0.000 1.000 setrgbcolor
fill
grestore
gsave
837 275 135 39.28 clipbox
946.893936 39.2832 m
958.72947 39.2832 l
958.72947 41.534386 l
946.893936 41.534386 l
cl
1.000 0.000 1.000 setrgbcolor
fill
grestore
gsave
837 275 135 39.28 clipbox
958.72947 39.2832 m
970.565004 39.2832 l
970.565004 39.2832 l
958.72947 39.2832 l
cl
1.000 0.000 1.000 setrgbcolor
fill
grestore
gsave
837 275 135 39.28 clipbox
970.565004 39.2832 m
982.400538 39.2832 l
982.400538 39.2832 l
970.565004 39.2832 l
cl
1.000 0.000 1.000 setrgbcolor
fill
grestore
gsave
837 275 135 39.28 clipbox
982.400538 39.2832 m
994.236072 39.2832 l
994.236072 39.2832 l
982.400538 39.2832 l
cl
1.000 0.000 1.000 setrgbcolor
fill
grestore
gsave
837 275 135 39.28 clipbox
994.236072 39.2832 m
1006.071606 39.2832 l
1006.071606 39.2832 l
994.236072 39.2832 l
cl
1.000 0.000 1.000 setrgbcolor
fill
grestore
gsave
837 275 135 39.28 clipbox
1006.071606 39.2832 m
1017.90714 39.2832 l
1017.90714 39.2832 l
1006.071606 39.2832 l
cl
1.000 0.000 1.000 setrgbcolor
fill
grestore
gsave
837 275 135 39.28 clipbox
1017.90714 39.2832 m
1029.742675 39.2832 l
1029.742675 39.2832 l
1017.90714 39.2832 l
cl
1.000 0.000 1.000 setrgbcolor
fill
grestore
gsave
837 275 135 39.28 clipbox
1029.742675 39.2832 m
1041.578209 39.2832 l
1041.578209 39.658398 l
1029.742675 39.658398 l
cl
1.000 0.000 1.000 setrgbcolor
fill
grestore
0.800 setlinewidth
1 setlinejoin
0 setlinecap
[] 0 setdash
0.000 setgray
gsave
/o {
gsave
newpath
translate
0.8 setlinewidth
1 setlinejoin
0 setlinecap
0 0 m
0 -3.5 l

gsave
0.000 setgray
fill
grestore
stroke
grestore
} bind def
389.007 39.2832 o
grestore
gsave
375.506830 23.923825 translate
0.000000 rotate
/DejaVuSans findfont
11.0 scalefont
setfont
2.143066 0.984375 moveto
/less glyphshow
/DejaVuSans-Oblique findfont
11.0 scalefont
setfont
11.717005 0.984375 moveto
/I glyphshow
/DejaVuSans findfont
11.0 scalefont
setfont
15.318288 0.984375 moveto
/greater glyphshow

grestore
gsave
/o {
gsave
newpath
translate
0.8 setlinewidth
1 setlinejoin
0 setlinecap
0 0 m
0 -3.5 l

gsave
0.000 setgray
fill
grestore
stroke
grestore
} bind def
426.13 39.2832 o
grestore
gsave
422.630435 23.923825 translate
0.000000 rotate
/DejaVuSans findfont
11.0 scalefont
setfont
0.000000 0.828125 moveto
/zero glyphshow

grestore
gsave
/o {
gsave
newpath
translate
0.8 setlinewidth
1 setlinejoin
0 setlinecap
0 0 m
0 -3.5 l

gsave
0.000 setgray
fill
grestore
stroke
grestore
} bind def
717.842 39.2832 o
grestore
gsave
688.842052 23.564450 translate
0.000000 rotate
/DejaVuSans findfont
11.0 scalefont
setfont
2.143066 0.656250 moveto
/less glyphshow
11.717005 0.656250 moveto
/parenleft glyphshow
/DejaVuSans-Oblique findfont
11.0 scalefont
setfont
16.008509 0.656250 moveto
/I glyphshow
/DejaVuSans findfont
11.0 scalefont
setfont
21.395716 0.656250 moveto
/minus glyphshow
/DejaVuSans-Oblique findfont
11.0 scalefont
setfont
32.755580 0.656250 moveto
/I glyphshow
/DejaVuSans findfont
7.699999999999999 scalefont
setfont
35.999720 -1.148438 moveto
/zero glyphshow
/DejaVuSans findfont
11.0 scalefont
setfont
41.199476 0.656250 moveto
/parenright glyphshow
45.848122 0.656250 moveto
/greater glyphshow

grestore
gsave
/o {
gsave
newpath
translate
0.8 setlinewidth
1 setlinejoin
0 setlinecap
0 0 m
0 -3.5 l

gsave
0.000 setgray
fill
grestore
stroke
grestore
} bind def
779.222 39.2832 o
grestore
gsave
752.722104 23.283200 translate
0.000000 rotate
/DejaVuSans-Oblique findfont
11.0 scalefont
setfont
0.000000 0.640625 moveto
/p glyphshow
/DejaVuSans findfont
11.0 scalefont
setfont
6.982422 0.640625 moveto
/parenleft glyphshow
/DejaVuSans-Oblique findfont
11.0 scalefont
setfont
11.273926 0.640625 moveto
/k glyphshow
/DejaVuSans findfont
11.0 scalefont
setfont
19.787109 0.640625 moveto
/equal glyphshow
31.146973 0.640625 moveto
/zero glyphshow
38.145508 0.640625 moveto
/period glyphshow
41.017090 0.640625 moveto
/two glyphshow
48.015625 0.640625 moveto
/parenright glyphshow

grestore
1.500 setlinewidth
[5.55 2.4] 0 setdash
gsave
837 275 135 39.28 clipbox
426.130435 39.2832 m
426.130435 274.9824 l
stroke
grestore
0.800 setlinewidth
0 setlinejoin
2 setlinecap
[] 0 setdash
gsave
135 39.2832 m
135 314.2656 l
stroke
grestore
gsave
972 39.2832 m
972 314.2656 l
stroke
grestore
gsave
135 39.2832 m
972 39.2832 l
stroke
grestore
gsave
135 314.2656 m
972 314.2656 l
stroke
grestore
1.000 setlinewidth
1 setlinejoin
1 setlinecap
[] 0 setdash
gsave
714.724493 301.1712 m
607.191228 301.1712 499.285285 301.1712 391.006664 301.1712 c
stroke
grestore
gsave
708.964493 304.0512 m
714.724493 301.1712 l
708.964493 298.2912 l
stroke
grestore

end
showpage
