Parameters for button dialog case 1
Date	2021.11.22	Local Time	17:14:15.851

Frequency	1.500
kh	30.000
Lx	400.000
Lt	500.000
nt	12.000
Nx	128.000
Steepness	0.050
FOD	0.000
Export	0.000
Wm_factor	1.830
Output_time	100.000
