[
  {
    "_id": "5e89d4177102d892504be284",
    "index": 0,
    "guid": "73aa4982-11a7-40a7-a303-44916bf1606e",
    "isActive": true,
    "picture": "http://placehold.it/32x32",
    "age": 53,
    "name": "Kidder",
    "gender": "female",
    "about": "Ad commodo consequat ipsum et deserunt pariatur exercitation dolore dolor sit. Nisi nisi irure tempor voluptate.",
    "messages": [
      {
        "id": 0,
        "text": "Est amet non et magna eu qui ea exercitation esse."
      },
      {
        "id": 1,
        "text": "Anim voluptate ullamco ipsum qui deserunt consectetur laboris minim sint incididunt."
      },
      {
        "id": 2,
        "text": "Sint cillum cillum incididunt minim consequat excepteur cillum minim."
      },
      {
        "id": 3,
        "text": "Quis non sunt Lorem occaecat et id."
      },
      {
        "id": 4,
        "text": "Voluptate sunt velit aliqua exercitation dolor ullamco tempor enim dolore consequat."
      },
      {
        "id": 5,
        "text": "Enim veniam excepteur magna consectetur minim laborum occaecat pariatur reprehenderit qui reprehenderit pariatur."
      },
      {
        "id": 6,
        "text": "Enim deserunt amet commodo exercitation ad magna aliqua aliquip tempor."
      }
    ],
    "greeting": "Hello, Kidder! You have 3 unread messages.",
    "favoriteFruit": "apple"
  },
  {
    "_id": "5e89d417f8598d7e4f09face",
    "index": 1,
    "guid": "e1cc3d38-f093-4dcd-8545-1b7e9c84738d",
    "isActive": true,
    "picture": "http://placehold.it/32x32",
    "age": 33,
    "name": "Cedarville",
    "gender": "female",
    "about": "Incididunt quis ullamco nulla qui qui ipsum laboris commodo irure incididunt sit.",
    "messages": [
      {
        "id": 0,
        "text": "Deserunt laborum labore nisi excepteur duis eu esse adipisicing do amet dolore voluptate."
      },
      {
        "id": 1,
        "text": "Adipisicing aliquip non reprehenderit nisi magna Lorem amet ad esse occaecat occaecat."
      },
      {
        "id": 2,
        "text": "In aliqua consectetur commodo amet magna Lorem Lorem ut."
      },
      {
        "id": 3,
        "text": "Veniam pariatur ea ipsum reprehenderit proident laboris proident dolore."
      },
      {
        "id": 4,
        "text": "In velit nulla exercitation excepteur."
      },
      {
        "id": 5,
        "text": "Est eu sint ea deserunt aliquip id laborum dolore."
      }
    ],
    "greeting": "Hello, Cedarville! You have 3 unread messages.",
    "favoriteFruit": "banana"
  },
  {
    "_id": "5e89d41730540c4971d02bb2",
    "index": 2,
    "guid": "c5616b05-4c3e-4bb7-aa24-fbdb578b7d9a",
    "isActive": false,
    "picture": "http://placehold.it/32x32",
    "age": 43,
    "name": "Muir",
    "gender": "male",
    "about": "Ex occaecat aliqua elit sunt occaecat commodo officia mollit duis occaecat aute. Exercitation sint ea et enim ut mollit nisi.",
    "messages": [
      {
        "id": 0,
        "text": "Occaecat mollit sunt do ex."
      },
      {
        "id": 1,
        "text": "Qui consequat dolore proident id."
      },
      {
        "id": 2,
        "text": "Pariatur duis deserunt officia adipisicing esse laborum."
      },
      {
        "id": 3,
        "text": "Sunt aliquip qui aute elit."
      },
      {
        "id": 4,
        "text": "Consectetur deserunt reprehenderit qui do proident ipsum Lorem cillum velit."
      },
      {
        "id": 5,
        "text": "Sint dolor nulla velit cillum exercitation eiusmod elit."
      }
    ],
    "greeting": "Hello, Muir! You have 10 unread messages.",
    "favoriteFruit": "banana"
  },
  {
    "_id": "5e89d41757ea17a109626897",
    "index": 3,
    "guid": "bcf8ea0a-3f8e-4c82-8880-ed5a943f1a86",
    "isActive": false,
    "picture": "http://placehold.it/32x32",
    "age": 9,
    "name": "Nile",
    "gender": "male",
    "about": "Lorem aliquip reprehenderit ut aliqua aute officia esse eiusmod ut Lorem pariatur. Consectetur minim adipisicing adipisicing qui enim Lorem nisi reprehenderit. Deserunt officia sint qui sit pariatur et et fugiat qui ea tempor. Velit labore elit exercitation velit deserunt excepteur.",
    "messages": [
      {
        "id": 0,
        "text": "In quis ullamco consectetur veniam deserunt dolore esse irure ad dolore in."
      },
      {
        "id": 1,
        "text": "Eiusmod quis tempor in consectetur Lorem laborum proident sunt labore labore fugiat consectetur elit irure."
      }
    ],
    "greeting": "Hello, Nile! You have 6 unread messages.",
    "favoriteFruit": "apple"
  },
  {
    "_id": "5e89d417b47e29bb9ada3086",
    "index": 4,
    "guid": "16806717-66a5-49b0-a939-d116b82a93d8",
    "isActive": false,
    "picture": "http://placehold.it/32x32",
    "age": 11,
    "name": "Westboro",
    "gender": "male",
    "about": "Consequat anim incididunt mollit qui nisi mollit laboris adipisicing aute sit sunt proident nostrud do. Nulla anim voluptate consectetur aute veniam mollit qui consectetur adipisicing. Voluptate dolore sit do magna laborum quis dolore veniam aliqua id velit. Pariatur magna irure sint ea laborum elit magna commodo minim. Lorem ea incididunt labore mollit.",
    "messages": [
      {
        "id": 0,
        "text": "Nisi Lorem pariatur veniam anim aliqua ex laborum veniam laboris."
      },
      {
        "id": 1,
        "text": "Labore nostrud velit mollit nostrud enim do ullamco."
      },
      {
        "id": 2,
        "text": "Irure nostrud irure ut non in culpa exercitation proident duis ea velit minim excepteur non."
      },
      {
        "id": 3,
        "text": "Aliquip consectetur Lorem amet sint consectetur cillum mollit aliquip dolore officia reprehenderit sit."
      },
      {
        "id": 4,
        "text": "Irure ea id anim nostrud nulla reprehenderit esse quis ipsum reprehenderit adipisicing labore quis amet."
      }
    ],
    "greeting": "Hello, Westboro! You have 8 unread messages.",
    "favoriteFruit": "banana"
  },
  {
    "_id": "5e89d417639a112fb9154594",
    "index": 5,
    "guid": "7bbebdf9-2e95-405c-8440-6428b0553423",
    "isActive": false,
    "picture": "http://placehold.it/32x32",
    "age": 19,
    "name": "Vandiver",
    "gender": "male",
    "about": "Proident veniam ipsum velit enim esse voluptate ipsum aute esse elit tempor culpa. Ut magna ipsum qui proident tempor deserunt ad eiusmod est ipsum ullamco ea. Lorem ea consequat et ipsum sit adipisicing elit. Reprehenderit ut ullamco reprehenderit magna qui dolore.",
    "messages": [
      {
        "id": 0,
        "text": "Tempor excepteur nulla ullamco commodo commodo eu duis incididunt amet ad esse sit esse aliqua."
      },
      {
        "id": 1,
        "text": "Et enim enim quis minim consectetur occaecat enim do cupidatat."
      },
      {
        "id": 2,
        "text": "Id commodo reprehenderit consectetur magna pariatur reprehenderit id pariatur ex dolor labore sunt sunt magna."
      },
      {
        "id": 3,
        "text": "Pariatur nostrud non aliqua anim consequat laborum quis officia."
      },
      {
        "id": 4,
        "text": "Cupidatat enim cupidatat fugiat duis veniam occaecat irure enim anim."
      },
      {
        "id": 5,
        "text": "Amet dolor in consectetur sit eu aute consequat non exercitation sint irure nisi."
      },
      {
        "id": 6,
        "text": "Commodo proident enim elit cupidatat cillum in eiusmod."
      },
      {
        "id": 7,
        "text": "Eu id et veniam voluptate est commodo cillum."
      },
      {
        "id": 8,
        "text": "Et commodo aute eiusmod quis Lorem nulla in ad labore ullamco aliquip anim."
      },
      {
        "id": 9,
        "text": "Eu est consequat dolore excepteur duis sit aute magna incididunt est dolor."
      }
    ],
    "greeting": "Hello, Vandiver! You have 4 unread messages.",
    "favoriteFruit": "banana"
  }
]