<?xml version="1.0" encoding="UTF-8"?>
<svg width="700pt"
     height="700pt"
     version="1.1"
     viewBox="0 0 700 550"
     xmlns="http://www.w3.org/2000/svg"
>
  <path
      d="m441.61 29.949c-1.3867-1.3867-3.2617-2.1641-5.2227-2.1641h-276.27c-1.9609 0-3.8398 0.77734-5.2266 2.1641-1.3828 1.3867-2.1602 3.2656-2.1602 5.2266v17.5l-67.426 7.6406c-4.0508 0.46484-6.9609 4.1172-6.5117 8.168l51.824 457.16c0.42188 3.7305 3.5781 6.5508 7.332 6.5547 0.28125 0 0.5625-0.015625 0.83984-0.050781l260.34-29.512h115.95c1.9609 0 3.8398-0.77734 5.2266-2.1641 1.3828-1.3867 2.1602-3.2656 2.1602-5.2266v-381.38c0.003906-1.9688-0.77344-3.8594-2.1641-5.25zm2.1641 23.066 53.461 53.461h-53.461zm-299.31 463.64-50.168-442.48 58.434-6.6211v427.7c0 4.0781 3.3047 7.3867 7.3867 7.3867h107.82zm23.043-28.777v-445.29h261.49v71.285c0 1.9609 0.78125 3.8398 2.1641 5.2227 1.3867 1.3867 3.2695 2.1641 5.2266 2.1602h71.301v366.62zm41.418-268.92-0.003907 0.003907c0-4.082 3.3086-7.3906 7.3906-7.3906h242.55c1.9961-0.058593 3.9297 0.69531 5.3594 2.0859 1.4336 1.3945 2.2383 3.3047 2.2383 5.3008 0 1.9961-0.80469 3.9062-2.2383 5.3008-1.4297 1.3906-3.3633 2.1445-5.3594 2.0859h-242.54c-1.9609 0.003906-3.8438-0.77734-5.2305-2.1641-1.3867-1.3867-2.1641-3.2695-2.1602-5.2305zm0 44.07-0.003907 0.003906c0-4.082 3.3086-7.3906 7.3906-7.3906h242.55c1.9961-0.058594 3.9297 0.69531 5.3594 2.0898 1.4336 1.3906 2.2383 3.3008 2.2383 5.2969s-0.80469 3.9062-2.2383 5.3008c-1.4297 1.3906-3.3633 2.1445-5.3594 2.0859h-242.54c-1.9609 0.003907-3.8438-0.77734-5.2305-2.1641s-2.1641-3.2695-2.1602-5.2305zm0 44.07-0.003907 0.003906c0-1.9609 0.78125-3.8398 2.1641-5.2227 1.3867-1.3867 3.2695-2.1641 5.2266-2.1641h242.55c1.9961-0.054688 3.9297 0.69922 5.3594 2.0898 1.4336 1.3906 2.2383 3.3047 2.2383 5.3008 0 1.9961-0.80469 3.9062-2.2383 5.2969-1.4297 1.3945-3.3633 2.1445-5.3594 2.0898h-242.54c-1.9648 0-3.8438-0.78125-5.2305-2.168-1.3867-1.3906-2.1641-3.2734-2.1602-5.2344zm249.94 51.461-242.55 0.003906c-1.9961 0.058594-3.9297-0.69531-5.3594-2.0898-1.4336-1.3906-2.2383-3.3008-2.2383-5.2969 0-1.9961 0.80469-3.9062 2.2383-5.3008 1.4297-1.3906 3.3633-2.1445 5.3594-2.0859h242.55c1.9922-0.058593 3.9258 0.69531 5.3594 2.0859 1.4297 1.3945 2.2383 3.3047 2.2383 5.3008 0 1.9961-0.80859 3.9062-2.2383 5.2969-1.4336 1.3945-3.3672 2.1484-5.3594 2.0898zm-249.94-180.93c0-1.957 0.77734-3.8359 2.1641-5.2227 1.3867-1.3828 3.2656-2.1602 5.2266-2.1602h128.86c1.9961-0.054688 3.9297 0.69531 5.3594 2.0898 1.4297 1.3906 2.2383 3.3008 2.2383 5.2969 0 1.9961-0.80859 3.9102-2.2383 5.3008s-3.3633 2.1445-5.3594 2.0898h-128.86c-1.9609 0-3.8398-0.78125-5.2266-2.168-1.3867-1.3828-2.1641-3.2656-2.1641-5.2266zm0-32.871v0.003907c0-1.9609 0.77734-3.8398 2.1641-5.2266 1.3867-1.3828 3.2656-2.1602 5.2266-2.1602h77.996c1.9961-0.054688 3.9297 0.69922 5.3594 2.0898 1.4336 1.3906 2.2383 3.3008 2.2383 5.2969 0 1.9961-0.80469 3.9102-2.2383 5.3008-1.4297 1.3906-3.3633 2.1445-5.3594 2.0898h-77.996c-1.9609 0-3.8398-0.78125-5.2266-2.168-1.3867-1.3828-2.1641-3.2656-2.1641-5.2227zm256.97 265.63c-1.2539 3.8828-5.418 6.0117-9.2969 4.7578-4.6211-1.4883-9.6562-0.91797-13.828 1.5625-20.02 8.3867-28.398 5.2891-34.68 1.75l-0.15625-0.085938v-0.003906c-2.1992 1.5078-4.7656 2.3906-7.4258 2.5664-2.6602 0.17188-5.3203-0.37109-7.6992-1.5781-3.8516-3.5781-5.2891-9.0547-3.6914-14.059l0.058594-0.44922-2.457 1.6328c-18.668 12.426-26.25 16.875-31.473 17.121h-0.35156 0.003906c-3.9609 0.027343-7.2383-3.0742-7.4297-7.0312-0.1875-3.957 2.7773-7.3594 6.7227-7.7109 8.4805-4.2695 16.617-9.1797 24.348-14.688 12.762-8.4883 14.402-9.5859 18.234-8.7109h0.003906c1.9961 0.46484 3.7227 1.7109 4.7812 3.4688 2.4375 4.5781 3.3477 9.8164 2.5977 14.949 3.8125-1.1719 7.9531-0.52734 11.227 1.75 2.6523 1.5039 6.6719 3.7852 21.676-2.5039 7.4414-3.8516 16.109-4.5703 24.082-1.9922 3.8594 1.25 5.9844 5.3867 4.7539 9.2539zm133.81-233.06v-30.332c0-4.7539-3.1562-30.574-17.086-30.574h-19.391c-13.93 0-17.078 25.816-17.078 30.574l-0.003906 277.15c0.007812 0.97656 0.20703 1.9414 0.58594 2.8398l19.391 46.543h-0.003906c1.1523 2.75 3.8398 4.543 6.8203 4.543s5.6719-1.793 6.8203-4.543l19.371-46.531c0.37891-0.89844 0.57812-1.8633 0.58594-2.8398v-230.03c3.5625 2.1992 6.7617 4.7539 6.7617 6.9062v54.25h-0.003906c0.11328 4 3.3867 7.1836 7.3906 7.1836 4 0 7.2734-3.1836 7.3867-7.1836v-54.25c-0.011719-12.379-12.672-19.383-21.547-23.707zm-38.781 239.43v-254.09h24v254.09zm4.1602-285.55h15.68c2.4922 4.9102 3.9102 10.297 4.1602 15.797v0.88672h-24v-0.88672c0.24609-5.5 1.6641-10.887 4.1602-15.797zm7.8398 320.25-8.3086-19.945h16.613z"
  />
</svg>
