<?xml version="1.0" encoding="utf-8"?>
<!-- Generator: Adobe Illustrator 24.0.1, SVG Export Plug-In . SVG Version: 6.00 Build 0)  -->
<svg version="1.1"
     id="Calque_1"
     xmlns="http://www.w3.org/2000/svg"
     x="0px"
     y="0px"
     viewBox="0 0 304.5 304.5"
     style="enable-background:new 0 0 304.5 304.5;"
     xml:space="preserve"
>
<style type="text/css">
	.st0 {
      fill: #E7E7E7;
  }

  .st1 {
      fill: #2E2D2C;
  }
</style>
  <g>
	<g>
		<g id="XMLID_1_">
			<g>
				<path class="st0"
              d="M-65.55,156.59c0.08,72.75-57.56,132-128.48,132.07c-70.93,0.08-128.7-59.04-128.78-131.79
					c-0.08-72.75,57.56-132,128.49-132.07C-123.4,24.72-65.63,83.84-65.55,156.59z M-81.18,200.07c4.96-13.53,7.66-28.18,7.65-43.47
					c-0.02-15.29-2.76-29.94-7.74-43.46l-225.91,0.25c-4.95,13.53-7.66,28.18-7.65,43.47c0.03,15.29,2.76,29.94,7.74,43.46
					L-81.18,200.07z M-84.51,208.27l-53.08,0.06c-6.17,31.92-17.68,56.38-31.89,69.53C-131.65,269.76-100.28,243.42-84.51,208.27z
					 M-137.7,105.01l53.08-0.06c-15.85-35.12-47.27-61.38-85.12-69.4C-155.5,48.66-143.95,73.11-137.7,105.01z M-145.74,208.34
					l-96.76,0.11c8.81,43.31,27.99,72.05,48.46,72.02C-173.58,280.45-154.45,251.67-145.74,208.34z M-242.62,105.12l96.77-0.11
					c-8.81-43.31-28-72.04-48.47-72.02C-214.78,33.01-233.9,61.79-242.62,105.12z M-218.62,277.91
					c-14.23-13.11-25.79-37.55-32.03-69.46l-53.08,0.06C-287.89,243.63-256.47,269.9-218.62,277.91z M-250.77,105.13
					c6.17-31.92,17.68-56.38,31.88-69.53c-37.83,8.1-69.19,34.44-84.96,69.59L-250.77,105.13z"
        />
        <path class="st0"
              d="M-95.12,164.71v0.53c0,2.22-0.44,4.24-1.32,6.01c-0.87,1.76-2.09,3.28-3.62,4.52
					c-1.52,1.23-3.39,2.17-5.56,2.82c-2.14,0.63-4.51,0.95-7.02,0.95c-3.39,0.01-6.35-0.46-8.8-1.39c-2.45-0.94-4.52-2.2-6.16-3.75
					c-1.64-1.56-2.9-3.36-3.74-5.35c-0.83-1.98-1.32-4-1.44-6.01l-0.03-0.6l7.7-1.93l0.07,0.83c0.28,3.14,1.48,5.69,3.56,7.58
					c2.1,1.9,4.95,2.87,8.48,2.86c3,0,5.44-0.61,7.23-1.79c1.72-1.14,2.56-2.69,2.56-4.74c-0.01-2.21-0.82-3.73-2.49-4.66
					c-1.78-1-4.78-1.65-8.91-1.94c-5.04-0.35-8.98-1.58-11.71-3.64c-2.81-2.13-4.24-5.25-4.24-9.3v-0.52c0-2.18,0.45-4.12,1.37-5.78
					c0.91-1.65,2.15-3.05,3.68-4.16c1.52-1.1,3.25-1.93,5.15-2.48c1.88-0.55,3.88-0.83,5.94-0.83c2.88,0,5.45,0.41,7.63,1.22
					c2.19,0.82,4.06,1.9,5.55,3.21c1.5,1.33,2.68,2.87,3.49,4.59c0.8,1.7,1.33,3.43,1.57,5.14l0.09,0.64l-7.74,1.95l-0.09-0.82
					c-0.27-2.65-1.27-4.65-3.05-6.12c-1.79-1.48-4.18-2.22-7.09-2.22c-1.15,0-2.26,0.13-3.33,0.38c-1.03,0.25-1.97,0.63-2.76,1.12
					c-0.76,0.47-1.38,1.06-1.84,1.76c-0.44,0.68-0.66,1.46-0.65,2.38c0,1.88,0.75,3.26,2.29,4.25c1.65,1.04,4.77,1.74,9.27,2.09
					c5.1,0.41,9.06,1.69,11.76,3.78C-96.54,157.45-95.13,160.62-95.12,164.71z"
        />
        <path class="st0"
              d="M-143.86,155.25v1.06c0,3.71-0.6,7.06-1.81,9.93c-1.19,2.87-2.82,5.32-4.83,7.29
					c-2,1.97-4.38,3.49-7.06,4.52c-2.68,1.03-5.49,1.55-8.36,1.56c-2.94,0-5.76-0.52-8.42-1.54c-2.65-1.03-5.01-2.54-7.02-4.51
					c-2.01-1.96-3.64-4.41-4.85-7.28c-1.21-2.86-1.83-6.2-1.83-9.92v-1.07c0-3.66,0.6-6.97,1.81-9.84c1.19-2.86,2.84-5.33,4.87-7.34
					c2.04-2,4.41-3.53,7.06-4.56c5.29-2.06,11.35-2.06,16.65-0.02c2.66,1.03,5.03,2.55,7.07,4.55c2.04,2,3.68,4.46,4.89,7.32
					C-144.47,148.27-143.86,151.58-143.86,155.25z M-152.12,156.32v-1.06c0-2.26-0.36-4.34-1.08-6.23
					c-0.71-1.87-1.71-3.49-2.95-4.82c-1.25-1.33-2.74-2.39-4.42-3.14c-1.69-0.75-3.5-1.13-5.4-1.13c-1.9,0-3.71,0.38-5.39,1.14
					c-1.68,0.75-3.16,1.81-4.42,3.15c-1.24,1.33-2.23,2.96-2.94,4.84c-0.7,1.87-1.06,3.96-1.06,6.22v1.06
					c0.01,2.37,0.37,4.52,1.08,6.39c0.71,1.87,1.7,3.5,2.95,4.83s2.72,2.35,4.36,3.05c3.31,1.38,7.6,1.38,10.9-0.02
					c1.65-0.69,3.12-1.72,4.37-3.05c1.24-1.33,2.23-2.96,2.94-4.84C-152.48,160.83-152.12,158.68-152.12,156.32z"
        />
        <path class="st0"
              d="M-242.5,208.45l96.76-0.11c-8.71,43.33-27.84,72.11-48.3,72.13C-214.51,280.5-233.69,251.76-242.5,208.45z"
        />
        <path class="st0"
              d="M-145.85,105.01l-96.77,0.11c8.72-43.33,27.84-72.11,48.3-72.13C-173.85,32.97-154.66,61.7-145.85,105.01z"
        />
        <polygon class="st0"
                 points="-199.01,170.64 -199.01,178.4 -238.03,178.45 -238.04,170.68 -222.57,170.67 -222.61,139.83
					-237.56,139.85 -237.57,132.08 -214.52,132.05 -214.48,170.66 				"
        />
        <path class="st0"
              d="M-249.04,156.43c0.01,3.71-0.61,7.05-1.81,9.93c-1.2,2.87-2.83,5.32-4.83,7.29
					c-2.01,1.97-4.38,3.49-7.06,4.52c-2.68,1.02-5.49,1.55-8.37,1.55c-2.93,0-5.76-0.51-8.41-1.54c-2.65-1.02-5.02-2.53-7.03-4.5
					c-2.01-1.96-3.64-4.41-4.84-7.28c-1.21-2.87-1.83-6.21-1.83-9.93v-1.06c-0.01-3.66,0.6-6.97,1.8-9.85
					c1.2-2.86,2.84-5.33,4.88-7.33c2.03-2,4.41-3.54,7.06-4.57c5.29-2.05,11.35-2.06,16.64-0.01c2.66,1.02,5.04,2.55,7.08,4.54
					c2.04,2,3.68,4.47,4.89,7.33c1.21,2.87,1.82,6.18,1.83,9.84V156.43z M-257.31,156.43v-1.06c0-2.25-0.36-4.34-1.07-6.22
					c-0.72-1.86-1.7-3.49-2.96-4.83c-1.25-1.33-2.74-2.38-4.42-3.14c-1.68-0.75-3.5-1.12-5.4-1.12c-1.89,0-3.7,0.38-5.39,1.13
					c-1.68,0.76-3.16,1.82-4.41,3.15c-1.25,1.34-2.24,2.97-2.94,4.84c-0.71,1.87-1.07,3.97-1.07,6.22l0.01,1.06
					c0,2.37,0.36,4.52,1.07,6.39c0.71,1.87,1.7,3.5,2.96,4.83c1.24,1.34,2.71,2.36,4.36,3.05c3.31,1.39,7.59,1.39,10.91-0.01
					c1.64-0.69,3.11-1.72,4.35-3.06c1.25-1.33,2.23-2.96,2.94-4.83C-257.66,160.95-257.31,158.8-257.31,156.43z"
        />
			</g>
      <g>
			</g>
		</g>
	</g>
</g>
  <g>
	<g>
		<g id="XMLID_4_">
			<g>
				<path class="st0"
              d="M627.45,156.59c0.08,72.75-57.56,132-128.48,132.07c-70.93,0.08-128.7-59.04-128.78-131.79
					c-0.08-72.75,57.56-132,128.49-132.07C569.6,24.72,627.37,83.84,627.45,156.59z M611.82,200.07
					c4.96-13.53,7.66-28.18,7.65-43.47c-0.02-15.29-2.76-29.94-7.74-43.46l-225.91,0.25c-4.95,13.53-7.66,28.18-7.65,43.47
					c0.03,15.29,2.76,29.94,7.74,43.46L611.82,200.07z M608.49,208.27l-53.08,0.06c-6.17,31.92-17.68,56.38-31.89,69.53
					C561.35,269.76,592.72,243.42,608.49,208.27z M555.3,105.01l53.08-0.06c-15.85-35.12-47.27-61.38-85.12-69.4
					C537.5,48.66,549.05,73.11,555.3,105.01z M547.26,208.34l-96.76,0.11c8.81,43.31,27.99,72.05,48.46,72.02
					C519.42,280.45,538.55,251.67,547.26,208.34z M450.38,105.12l96.77-0.11c-8.81-43.31-28-72.04-48.47-72.02
					C478.22,33.01,459.1,61.79,450.38,105.12z M474.38,277.91c-14.23-13.11-25.79-37.55-32.03-69.46l-53.08,0.06
					C405.11,243.63,436.53,269.9,474.38,277.91z M442.23,105.13c6.17-31.92,17.68-56.38,31.88-69.53
					c-37.83,8.1-69.19,34.44-84.96,69.59L442.23,105.13z"
        />
        <path class="st0"
              d="M555.41,208.33l53.08-0.06c-15.77,35.15-47.14,61.49-84.97,69.59
					C537.73,264.71,549.24,240.25,555.41,208.33z"
        />
        <path class="st0"
              d="M608.38,104.95l-53.08,0.06c-6.25-31.9-17.8-56.35-32.04-69.46C561.11,43.57,592.53,69.83,608.38,104.95z"
        />
        <path class="st0"
              d="M597.88,164.71v0.53c0,2.22-0.44,4.24-1.32,6.01c-0.87,1.76-2.09,3.28-3.62,4.52
					c-1.52,1.23-3.39,2.17-5.56,2.82c-2.14,0.63-4.51,0.95-7.02,0.95c-3.39,0.01-6.35-0.46-8.8-1.39c-2.45-0.94-4.52-2.2-6.16-3.75
					c-1.64-1.56-2.9-3.36-3.74-5.35c-0.83-1.98-1.32-4-1.44-6.01l-0.03-0.6l7.7-1.93l0.07,0.83c0.28,3.14,1.48,5.69,3.56,7.58
					c2.1,1.9,4.95,2.87,8.48,2.86c3,0,5.44-0.61,7.23-1.79c1.72-1.14,2.56-2.69,2.56-4.74c-0.01-2.21-0.82-3.73-2.49-4.66
					c-1.78-1-4.78-1.65-8.91-1.94c-5.04-0.35-8.98-1.58-11.71-3.64c-2.81-2.13-4.24-5.25-4.24-9.3v-0.52c0-2.18,0.45-4.12,1.37-5.78
					c0.91-1.65,2.15-3.05,3.68-4.16c1.52-1.1,3.25-1.93,5.15-2.48c1.88-0.55,3.88-0.83,5.94-0.83c2.88,0,5.45,0.41,7.63,1.22
					c2.19,0.82,4.06,1.9,5.55,3.21c1.5,1.33,2.68,2.87,3.49,4.59c0.8,1.7,1.33,3.43,1.57,5.14l0.09,0.64l-7.74,1.95l-0.09-0.82
					c-0.27-2.65-1.27-4.65-3.05-6.12c-1.79-1.48-4.18-2.22-7.09-2.22c-1.15,0-2.26,0.13-3.33,0.38c-1.03,0.25-1.97,0.63-2.76,1.12
					c-0.76,0.47-1.38,1.06-1.84,1.76c-0.44,0.68-0.66,1.46-0.65,2.38c0,1.88,0.75,3.26,2.29,4.25c1.65,1.04,4.77,1.74,9.27,2.09
					c5.1,0.41,9.06,1.69,11.76,3.78C596.46,157.45,597.87,160.62,597.88,164.71z"
        />
        <path class="st0"
              d="M549.14,155.25v1.06c0,3.71-0.6,7.06-1.81,9.93c-1.19,2.87-2.82,5.32-4.83,7.29
					c-2,1.97-4.38,3.49-7.06,4.52s-5.49,1.55-8.36,1.56c-2.94,0-5.76-0.52-8.42-1.54c-2.65-1.03-5.01-2.54-7.02-4.51
					c-2.01-1.96-3.64-4.41-4.85-7.28c-1.21-2.86-1.83-6.2-1.83-9.92v-1.07c0-3.66,0.6-6.97,1.81-9.84c1.19-2.86,2.84-5.33,4.87-7.34
					c2.04-2,4.41-3.53,7.06-4.56c5.29-2.06,11.35-2.06,16.65-0.02c2.66,1.03,5.03,2.55,7.07,4.55c2.04,2,3.68,4.46,4.89,7.32
					C548.53,148.27,549.14,151.58,549.14,155.25z M540.88,156.32v-1.06c0-2.26-0.36-4.34-1.08-6.23c-0.71-1.87-1.71-3.49-2.95-4.82
					c-1.25-1.33-2.74-2.39-4.42-3.14c-1.69-0.75-3.5-1.13-5.4-1.13c-1.9,0-3.71,0.38-5.39,1.14c-1.68,0.75-3.16,1.81-4.42,3.15
					c-1.24,1.33-2.23,2.96-2.94,4.84c-0.7,1.87-1.06,3.96-1.06,6.22v1.06c0.01,2.37,0.37,4.52,1.08,6.39
					c0.71,1.87,1.7,3.5,2.95,4.83s2.72,2.35,4.36,3.05c3.31,1.38,7.6,1.38,10.9-0.02c1.65-0.69,3.12-1.72,4.37-3.05
					c1.24-1.33,2.23-2.96,2.94-4.84C540.52,160.83,540.88,158.68,540.88,156.32z"
        />
        <polygon class="st0"
                 points="493.99,170.64 493.99,178.4 454.97,178.45 454.96,170.68 470.43,170.67 470.39,139.83
					455.44,139.85 455.43,132.08 478.48,132.05 478.52,170.66 				"
        />
        <path class="st0"
              d="M442.35,208.45c6.24,31.91,17.8,56.35,32.03,69.46c-37.85-8.01-69.27-34.28-85.11-69.4L442.35,208.45z"
        />
        <path class="st0"
              d="M474.11,35.6c-14.2,13.15-25.71,37.61-31.88,69.53l-53.08,0.06C404.92,70.04,436.28,43.7,474.11,35.6z"
        />
        <path class="st0"
              d="M443.96,156.43c0.01,3.71-0.61,7.05-1.81,9.93c-1.2,2.87-2.83,5.32-4.83,7.29
					c-2.01,1.97-4.38,3.49-7.06,4.52c-2.68,1.02-5.49,1.55-8.37,1.55c-2.93,0-5.76-0.51-8.41-1.54c-2.65-1.02-5.02-2.53-7.03-4.5
					c-2.01-1.96-3.64-4.41-4.84-7.28c-1.21-2.87-1.83-6.21-1.83-9.93v-1.06c-0.01-3.66,0.6-6.97,1.8-9.85
					c1.2-2.86,2.84-5.33,4.88-7.33c2.03-2,4.41-3.54,7.06-4.57c5.29-2.05,11.35-2.06,16.64-0.01c2.66,1.02,5.04,2.55,7.08,4.54
					c2.04,2,3.68,4.47,4.89,7.33c1.21,2.87,1.82,6.18,1.83,9.84V156.43z M435.69,156.43v-1.06c0-2.25-0.36-4.34-1.07-6.22
					c-0.72-1.86-1.7-3.49-2.96-4.83c-1.25-1.33-2.74-2.38-4.42-3.14c-1.68-0.75-3.5-1.12-5.4-1.12c-1.89,0-3.7,0.38-5.39,1.13
					c-1.68,0.76-3.16,1.82-4.41,3.15c-1.25,1.34-2.24,2.97-2.94,4.84c-0.71,1.87-1.07,3.97-1.07,6.22l0.01,1.06
					c0,2.37,0.36,4.52,1.07,6.39c0.71,1.87,1.7,3.5,2.96,4.83c1.24,1.34,2.71,2.36,4.36,3.05c3.31,1.39,7.59,1.39,10.91-0.01
					c1.64-0.69,3.11-1.72,4.35-3.06c1.25-1.33,2.23-2.96,2.94-4.83C435.34,160.95,435.69,158.8,435.69,156.43z"
        />
			</g>
      <g>
			</g>
		</g>
	</g>
</g>
  <g>
	<g>
		<path class="st0"
          d="M235.43-197.44c48.36-44.76,87.53-128.02,108.53-236.65l180.66-0.21
			C470.95-314.65,364.18-225.02,235.43-197.44 M151.82-188.55C82.16-188.46,16.85-286.29-13.13-433.7l329.35-0.37
			C286.55-286.57,221.45-188.62,151.82-188.55 M-221.54-433.47l180.66-0.21c21.26,108.6,60.59,191.77,109.03,236.42
			C-60.66-224.54-167.61-313.94-221.54-433.47 M-233.26-757.25l768.9-0.85c16.95,46.04,26.27,95.89,26.34,147.93
			c0.05,52.04-9.16,101.91-26.02,147.98l-768.9,0.85c-16.95-46.04-26.27-95.89-26.34-147.93
			C-259.33-661.32-250.12-711.18-233.26-757.25 M67.25-1022c-48.33,44.76-87.5,128.02-108.51,236.67l-180.66,0.18
			C-168.25-904.79-61.51-994.42,67.25-1022 M150.88-1030.89c69.66-0.07,134.96,97.74,164.95,245.14l-329.35,0.37
			C16.14-932.85,81.24-1030.82,150.88-1030.89 M524.23-785.97l-180.66,0.21c-21.26-108.58-60.59-191.77-109.03-236.42
			C363.36-994.88,470.31-905.5,524.23-785.97 M150.85-1058.77c-241.41,0.25-437.58,201.92-437.31,449.54
			c0.27,247.6,196.88,448.83,438.29,448.55c241.41-0.25,437.58-201.92,437.31-449.52C588.87-857.81,392.27-1059.04,150.85-1058.77"
    />
    <path class="st0"
          d="M-157.66-614.24c0-7.67,1.21-14.8,3.62-21.17c2.41-6.39,5.77-11.93,10.01-16.47
			c4.26-4.56,9.3-8.15,15.03-10.72c5.73-2.57,11.89-3.87,18.35-3.87s12.64,1.28,18.37,3.83c5.73,2.57,10.79,6.14,15.05,10.7
			c4.26,4.54,7.63,10.08,10.06,16.42c2.43,6.39,3.64,13.51,3.67,21.17v3.62c0,8.06-1.21,15.37-3.62,21.76
			c-2.41,6.39-5.77,11.91-10.01,16.47c-4.24,4.54-9.23,8.04-14.82,10.4c-11.27,4.76-25.84,4.76-37.11,0.05
			c-5.61-2.36-10.63-5.84-14.87-10.38c-4.26-4.54-7.63-10.08-10.06-16.45c-2.41-6.37-3.64-13.7-3.64-21.76L-157.66-614.24z
			 M-163.04-552.03c6.85,6.69,14.89,11.84,23.91,15.32c9.03,3.48,18.65,5.25,28.63,5.25c9.78-0.02,19.36-1.81,28.47-5.29
			c9.12-3.5,17.2-8.68,24.03-15.39c6.83-6.71,12.37-15.05,16.45-24.81c4.1-9.78,6.18-21.17,6.16-33.81v-3.62
			c-0.02-12.46-2.11-23.73-6.23-33.49s-9.71-18.14-16.65-24.95c-6.94-6.78-15.03-11.98-24.07-15.46
			c-18.03-6.99-38.64-6.94-56.65,0.05c-9.03,3.5-17.11,8.73-24.03,15.53c-6.94,6.83-12.53,15.23-16.61,24.97
			c-4.1,9.78-6.16,21.05-6.14,33.51v3.62c0,12.67,2.11,24.03,6.23,33.79C-175.43-567.05-169.89-558.71-163.04-552.03"
    />
	</g>
    <polygon class="st0"
             points="134.9,-562.38 82.26,-562.31 82.1,-693.73 3.67,-693.64 3.69,-667.18 54.59,-667.25 54.7,-562.29
		2.06,-562.24 2.08,-535.79 134.92,-535.95 	"
    />
    <g>
		<path class="st0"
          d="M200.35-614.64c0-7.67,1.21-14.8,3.62-21.17c2.41-6.39,5.77-11.93,10.01-16.47
			c4.26-4.56,9.3-8.15,15.03-10.72c5.73-2.57,11.89-3.87,18.35-3.87s12.64,1.28,18.37,3.83c5.73,2.57,10.79,6.16,15.05,10.7
			c4.24,4.54,7.63,10.06,10.06,16.42c2.43,6.41,3.67,13.51,3.67,21.19v3.6c0,8.06-1.21,15.37-3.62,21.76
			c-2.41,6.39-5.77,11.93-10.01,16.47c-4.24,4.54-9.23,8.04-14.84,10.4c-11.25,4.74-25.84,4.76-37.11,0.05
			c-5.59-2.36-10.61-5.84-14.84-10.38c-4.26-4.54-7.63-10.08-10.06-16.45c-2.41-6.35-3.64-13.68-3.67-21.74V-614.64z M194.97-552.42
			c6.85,6.69,14.89,11.84,23.91,15.32c9.03,3.48,18.65,5.25,28.63,5.25c9.78-0.02,19.36-1.81,28.45-5.29
			c9.14-3.5,17.23-8.68,24.05-15.39c6.83-6.71,12.37-15.05,16.45-24.81c4.1-9.78,6.16-21.17,6.16-33.81v-3.62
			c-0.02-12.46-2.11-23.73-6.23-33.51c-4.12-9.74-9.71-18.12-16.65-24.92c-6.94-6.78-15.03-11.98-24.07-15.46
			c-18.03-6.96-38.64-6.94-56.65,0.05c-9.03,3.5-17.11,8.73-24.03,15.53c-6.94,6.83-12.53,15.23-16.61,24.97
			c-4.1,9.78-6.16,21.05-6.16,33.51l0.02,3.62c0,12.67,2.11,24.03,6.23,33.79C182.58-567.45,188.12-559.11,194.97-552.42"
    />
      <path class="st0"
            d="M452.26-564.59c-6.09,4.03-14.39,6.09-24.6,6.09c-12.03,0.02-21.72-3.25-28.86-9.71
			c-7.1-6.44-11.18-15.14-12.12-25.82l-0.23-2.82l-26.23,6.57l0.11,2.02c0.41,6.85,2.06,13.72,4.9,20.46
			c2.84,6.78,7.12,12.9,12.71,18.21c5.59,5.29,12.64,9.57,20.98,12.76c8.32,3.18,18.39,4.79,29.94,4.76c8.54,0,16.61-1.1,23.89-3.25
			c7.38-2.2,13.74-5.41,18.92-9.6c5.22-4.21,9.37-9.39,12.35-15.37c2.98-6.02,4.47-12.92,4.47-20.46v-1.81
			c-0.02-13.93-4.81-24.72-14.27-32.07c-9.21-7.12-22.68-11.48-40.04-12.87c-15.32-1.17-25.95-3.55-31.54-7.1
			c-5.25-3.37-7.81-8.09-7.81-14.45c-0.02-3.14,0.71-5.8,2.22-8.11c1.56-2.38,3.67-4.4,6.25-6c2.7-1.67,5.89-2.95,9.41-3.8
			c3.62-0.85,7.42-1.28,11.32-1.31c9.92,0,18.03,2.54,24.12,7.56c6.07,4.99,9.48,11.82,10.4,20.84l0.3,2.77l26.34-6.62l-0.3-2.18
			c-0.82-5.82-2.63-11.71-5.36-17.5c-2.75-5.86-6.76-11.11-11.87-15.62c-5.09-4.47-11.43-8.13-18.87-10.93
			c-7.44-2.77-16.19-4.17-25.98-4.17c-7.01,0.02-13.81,0.96-20.23,2.84c-6.46,1.86-12.37,4.7-17.52,8.45
			c-5.22,3.78-9.44,8.54-12.53,14.16c-3.12,5.64-4.67,12.25-4.67,19.65v1.79c0.02,13.77,4.88,24.4,14.45,31.63
			c9.28,7.03,22.7,11.2,39.86,12.42c14.04,0.98,24.26,3.18,30.33,6.6c5.68,3.16,8.43,8.34,8.45,15.85
			C460.96-573.73,458.12-568.47,452.26-564.59"
      />
	</g>
</g>
  <g>
	<g>
		<path class="st1"
          d="M-934.57-197.44c48.36-44.76,87.53-128.02,108.53-236.65l180.66-0.21
			C-699.05-314.65-805.82-225.02-934.57-197.44 M-1018.18-188.55c-69.66,0.09-134.96-97.74-164.95-245.14l329.35-0.37
			C-883.45-286.57-948.55-188.62-1018.18-188.55 M-1391.54-433.47l180.66-0.21c21.26,108.6,60.59,191.77,109.03,236.42
			C-1230.66-224.54-1337.61-313.94-1391.54-433.47 M-1403.26-757.25l768.9-0.85c16.95,46.04,26.27,95.89,26.34,147.93
			c0.05,52.04-9.16,101.91-26.02,147.98l-768.9,0.85c-16.95-46.04-26.27-95.89-26.34-147.93
			C-1429.33-661.32-1420.12-711.18-1403.26-757.25 M-1102.75-1022c-48.33,44.76-87.5,128.02-108.51,236.67l-180.66,0.18
			C-1338.25-904.79-1231.51-994.42-1102.75-1022 M-1019.12-1030.89c69.66-0.07,134.96,97.74,164.95,245.14l-329.35,0.37
			C-1153.86-932.85-1088.76-1030.82-1019.12-1030.89 M-645.77-785.97l-180.66,0.21c-21.26-108.58-60.59-191.77-109.03-236.42
			C-806.64-994.88-699.69-905.5-645.77-785.97 M-1019.15-1058.77c-241.41,0.25-437.58,201.92-437.31,449.54
			c0.27,247.6,196.88,448.83,438.29,448.55c241.41-0.25,437.58-201.92,437.31-449.52C-581.13-857.81-777.73-1059.04-1019.15-1058.77
			"
    />
    <path class="st1"
          d="M-1327.66-614.24c0-7.67,1.21-14.8,3.62-21.17c2.41-6.39,5.77-11.93,10.01-16.47
			c4.26-4.56,9.3-8.15,15.03-10.72c5.73-2.57,11.89-3.87,18.35-3.87s12.64,1.28,18.37,3.83c5.73,2.57,10.79,6.14,15.05,10.7
			c4.26,4.54,7.63,10.08,10.06,16.42c2.43,6.39,3.64,13.51,3.66,21.17v3.62c0,8.06-1.21,15.37-3.62,21.76
			c-2.41,6.39-5.77,11.91-10.01,16.47c-4.24,4.54-9.23,8.04-14.82,10.4c-11.27,4.76-25.84,4.76-37.11,0.05
			c-5.61-2.36-10.63-5.84-14.87-10.38c-4.26-4.54-7.63-10.08-10.06-16.45c-2.41-6.37-3.64-13.7-3.64-21.76L-1327.66-614.24z
			 M-1333.04-552.03c6.85,6.69,14.89,11.84,23.91,15.32c9.03,3.48,18.65,5.25,28.63,5.25c9.78-0.02,19.36-1.81,28.47-5.29
			c9.12-3.5,17.2-8.68,24.03-15.39c6.83-6.71,12.37-15.05,16.45-24.81c4.1-9.78,6.18-21.17,6.16-33.81v-3.62
			c-0.02-12.46-2.11-23.73-6.23-33.49c-4.12-9.76-9.71-18.14-16.65-24.95c-6.94-6.78-15.03-11.98-24.07-15.46
			c-18.03-6.99-38.64-6.94-56.65,0.05c-9.03,3.5-17.11,8.73-24.03,15.53c-6.94,6.83-12.53,15.23-16.61,24.97
			c-4.1,9.78-6.16,21.05-6.14,33.51v3.62c0,12.67,2.11,24.03,6.23,33.79C-1345.43-567.05-1339.89-558.71-1333.04-552.03"
    />
	</g>
    <polygon class="st1"
             points="-1035.1,-562.38 -1087.74,-562.31 -1087.9,-693.73 -1166.33,-693.64 -1166.31,-667.18
		-1115.41,-667.25 -1115.3,-562.29 -1167.94,-562.24 -1167.92,-535.79 -1035.08,-535.95 	"
    />
    <g>
		<path class="st1"
          d="M-969.65-614.64c0-7.67,1.21-14.8,3.62-21.17c2.41-6.39,5.77-11.93,10.01-16.47
			c4.26-4.56,9.3-8.15,15.03-10.72c5.73-2.57,11.89-3.87,18.35-3.87s12.64,1.28,18.37,3.83c5.73,2.57,10.79,6.16,15.05,10.7
			c4.24,4.54,7.63,10.06,10.06,16.42c2.43,6.41,3.67,13.51,3.67,21.19v3.6c0,8.06-1.21,15.37-3.62,21.76
			c-2.41,6.39-5.77,11.93-10.01,16.47c-4.24,4.54-9.23,8.04-14.84,10.4c-11.25,4.74-25.84,4.76-37.11,0.05
			c-5.59-2.36-10.61-5.84-14.84-10.38c-4.26-4.54-7.63-10.08-10.06-16.45c-2.41-6.35-3.64-13.68-3.67-21.74V-614.64z
			 M-975.03-552.42c6.85,6.69,14.89,11.84,23.91,15.32c9.03,3.48,18.65,5.25,28.63,5.25c9.78-0.02,19.36-1.81,28.45-5.29
			c9.14-3.5,17.23-8.68,24.05-15.39c6.83-6.71,12.37-15.05,16.45-24.81c4.1-9.78,6.16-21.17,6.16-33.81v-3.62
			c-0.02-12.46-2.11-23.73-6.23-33.51c-4.12-9.74-9.71-18.12-16.65-24.92c-6.94-6.78-15.03-11.98-24.07-15.46
			c-18.03-6.96-38.64-6.94-56.65,0.05c-9.03,3.5-17.11,8.73-24.03,15.53c-6.94,6.83-12.53,15.23-16.61,24.97
			c-4.1,9.78-6.16,21.05-6.16,33.51l0.02,3.62c0,12.67,2.11,24.03,6.23,33.79C-987.42-567.45-981.88-559.11-975.03-552.42"
    />
      <path class="st1"
            d="M-717.74-564.59c-6.09,4.03-14.39,6.09-24.6,6.09c-12.03,0.02-21.72-3.25-28.86-9.71
			c-7.1-6.44-11.18-15.14-12.12-25.82l-0.23-2.82l-26.23,6.57l0.11,2.02c0.41,6.85,2.06,13.72,4.9,20.46
			c2.84,6.78,7.12,12.9,12.71,18.21c5.59,5.29,12.64,9.57,20.98,12.76c8.32,3.18,18.39,4.79,29.94,4.76c8.54,0,16.61-1.1,23.89-3.25
			c7.38-2.2,13.74-5.41,18.92-9.6c5.22-4.21,9.37-9.39,12.35-15.37c2.98-6.02,4.47-12.92,4.47-20.46v-1.81
			c-0.02-13.93-4.81-24.72-14.27-32.07c-9.21-7.12-22.68-11.48-40.04-12.87c-15.32-1.17-25.95-3.55-31.54-7.1
			c-5.25-3.37-7.81-8.09-7.81-14.45c-0.02-3.14,0.71-5.8,2.22-8.11c1.56-2.38,3.67-4.4,6.25-6c2.7-1.67,5.89-2.95,9.41-3.8
			c3.62-0.85,7.42-1.28,11.32-1.31c9.92,0,18.03,2.54,24.12,7.56c6.07,4.99,9.48,11.82,10.4,20.84l0.3,2.77l26.34-6.62l-0.3-2.18
			c-0.82-5.82-2.63-11.71-5.36-17.5c-2.75-5.86-6.76-11.11-11.87-15.62c-5.09-4.47-11.43-8.13-18.87-10.93
			c-7.44-2.77-16.19-4.17-25.98-4.17c-7.01,0.02-13.81,0.96-20.23,2.84c-6.46,1.86-12.37,4.7-17.52,8.45
			c-5.22,3.78-9.44,8.54-12.53,14.16c-3.12,5.64-4.67,12.25-4.67,19.65v1.79c0.02,13.77,4.88,24.4,14.45,31.63
			c9.28,7.03,22.7,11.2,39.86,12.42c14.04,0.98,24.26,3.18,30.33,6.6c5.68,3.16,8.43,8.34,8.45,15.85
			C-709.04-573.73-711.88-568.47-717.74-564.59"
      />
	</g>
</g>
  <g>
	<path class="st0"
        d="M152.33,24.88C81.49,24.95,23.94,84.13,24.02,156.78c0.08,72.65,57.77,131.69,128.6,131.61
		c70.83-0.07,128.39-59.25,128.31-131.89C280.85,83.84,223.16,24.8,152.33,24.88z M243.37,162.66c-1.79-1-4.78-1.65-8.91-1.94
		c-5.04-0.36-8.98-1.59-11.7-3.65c-2.81-2.13-4.23-5.24-4.23-9.28v-0.53c0-2.17,0.46-4.1,1.38-5.76c0.91-1.64,2.15-3.04,3.68-4.14
		c1.52-1.1,3.25-1.93,5.15-2.47c1.88-0.55,3.88-0.82,5.94-0.82c2.87,0,5.44,0.41,7.62,1.23c2.19,0.82,4.05,1.89,5.54,3.21
		c1.5,1.32,2.67,2.87,3.48,4.58c0.8,1.7,1.33,3.42,1.57,5.13l0.09,0.64l-7.74,1.93l-0.08-0.81c-0.27-2.65-1.27-4.65-3.05-6.12
		c-1.79-1.47-4.17-2.22-7.08-2.22c-1.14,0-2.26,0.13-3.32,0.38c-1.04,0.25-1.97,0.62-2.76,1.11c-0.77,0.47-1.39,1.06-1.84,1.76
		c-0.44,0.68-0.66,1.45-0.66,2.38c0,1.87,0.75,3.25,2.29,4.23c1.64,1.05,4.76,1.75,9.26,2.09c5.1,0.42,9.05,1.7,11.75,3.79
		c2.77,2.16,4.18,5.32,4.18,9.4v0.53c0,2.21-0.44,4.23-1.32,5.99c-0.87,1.75-2.09,3.27-3.63,4.5c-1.52,1.23-3.4,2.17-5.56,2.8
		c-2.14,0.63-4.5,0.95-7.02,0.95c-3.39,0-6.34-0.47-8.79-1.41c-2.45-0.93-4.52-2.19-6.16-3.75c-1.64-1.56-2.89-3.35-3.73-5.34
		c-0.83-1.97-1.31-3.99-1.43-6l-0.04-0.59l7.7-1.92l0.07,0.82c0.27,3.14,1.46,5.68,3.55,7.57c2.09,1.9,4.94,2.86,8.47,2.86
		c3,0,5.43-0.6,7.23-1.78c1.72-1.13,2.56-2.68,2.56-4.72C245.84,165.11,245.03,163.59,243.37,162.66z M205.23,156.29v1.06
		c0,3.71-0.61,7.04-1.82,9.91c-1.21,2.86-2.83,5.3-4.84,7.27c-2.01,1.96-4.39,3.48-7.07,4.5c-2.67,1.02-5.49,1.54-8.36,1.54
		c-2.93,0-5.76-0.52-8.41-1.54c-2.65-1.02-5.01-2.54-7.02-4.5c-2.01-1.96-3.64-4.41-4.84-7.27c-1.21-2.86-1.82-6.19-1.82-9.91v-1.06
		c0-3.66,0.61-6.96,1.82-9.82c1.2-2.85,2.84-5.31,4.88-7.31c2.03-1.99,4.41-3.52,7.06-4.54c5.29-2.05,11.35-2.05,16.64,0
		c2.65,1.02,5.03,2.55,7.06,4.54c2.03,1.99,3.68,4.45,4.88,7.31C204.61,149.33,205.23,152.64,205.23,156.29z M111.59,141.82v-7.75
		h23.03v38.51h15.46v7.75h-39.01v-7.75h15.46v-30.76H111.59z M55.93,157.29c0-3.66,0.61-6.96,1.82-9.82
		c1.2-2.85,2.84-5.31,4.88-7.31c2.03-1.99,4.41-3.52,7.06-4.54c5.29-2.05,11.35-2.05,16.64,0c2.65,1.02,5.03,2.55,7.06,4.54
		c2.03,1.99,3.68,4.45,4.88,7.31c1.21,2.86,1.82,6.17,1.82,9.82v1.06c0,3.71-0.61,7.04-1.82,9.91c-1.2,2.86-2.83,5.3-4.84,7.27
		c-2.01,1.96-4.39,3.48-7.07,4.5c-2.67,1.02-5.49,1.54-8.36,1.54c-2.93,0-5.76-0.52-8.4-1.54c-2.65-1.02-5.01-2.54-7.02-4.5
		c-2.01-1.96-3.64-4.41-4.84-7.27c-1.21-2.86-1.82-6.19-1.82-9.91V157.29z M261.88,104.92l-53.01,0.06
		c-6.24-31.86-17.78-56.27-31.99-69.37C214.68,43.63,246.06,69.85,261.88,104.92z M152.33,33.06c20.44-0.02,39.6,28.68,48.4,71.93
		l-96.63,0.11C112.8,61.83,131.9,33.08,152.33,33.06z M127.8,35.67c-14.18,13.13-25.67,37.56-31.84,69.44l-53.01,0.05
		C58.7,70.06,90.02,43.76,127.8,35.67z M43.06,208.35l53.01-0.06c6.24,31.86,17.78,56.27,31.99,69.37
		C90.27,269.65,58.89,243.42,43.06,208.35z M152.61,280.21c-20.44,0.03-39.6-28.68-48.4-71.93l96.63-0.11
		C192.14,251.45,173.04,280.19,152.61,280.21z M177.14,277.6c14.19-13.13,25.68-37.56,31.84-69.43l53.01-0.06
		C246.25,243.21,214.92,269.51,177.14,277.6z"
  />
    <path class="st0"
          d="M192.95,145.26c-1.25-1.33-2.73-2.39-4.41-3.14c-1.68-0.75-3.5-1.13-5.39-1.13c-1.9,0-3.71,0.38-5.39,1.13
		c-1.68,0.75-3.17,1.8-4.41,3.14s-2.24,2.95-2.95,4.82c-0.71,1.87-1.07,3.96-1.07,6.2v1.06c0,2.36,0.36,4.51,1.07,6.38
		c0.71,1.86,1.7,3.49,2.95,4.82c1.25,1.33,2.71,2.35,4.36,3.04c3.31,1.39,7.59,1.39,10.9,0c1.65-0.69,3.11-1.71,4.36-3.04
		c1.25-1.33,2.24-2.95,2.95-4.82c0.71-1.87,1.07-4.02,1.07-6.38v-1.06c0-2.24-0.36-4.33-1.07-6.21
		C195.19,148.21,194.2,146.59,192.95,145.26z"
    />
    <path class="st0"
          d="M68.2,169.55c1.24,1.33,2.71,2.35,4.36,3.04c3.31,1.39,7.59,1.39,10.9,0c1.64-0.69,3.11-1.71,4.36-3.04
		c1.25-1.33,2.24-2.95,2.95-4.82c0.71-1.87,1.07-4.02,1.07-6.38v-1.06c0-2.24-0.36-4.33-1.07-6.21c-0.71-1.86-1.7-3.49-2.95-4.82
		c-1.25-1.33-2.73-2.39-4.41-3.14c-1.68-0.75-3.5-1.13-5.39-1.13c-1.9,0-3.71,0.38-5.39,1.13c-1.68,0.75-3.17,1.8-4.41,3.14
		s-2.24,2.95-2.95,4.82c-0.71,1.87-1.07,3.96-1.07,6.2v1.06c0,2.36,0.36,4.51,1.07,6.38C65.96,166.59,66.95,168.21,68.2,169.55z"
    />
</g>
  <g>
	<g>
		<g id="XMLID_3_">
			<g>
				<path class="st1"
              d="M-1236.55,156.59c0.08,72.75-57.56,132-128.48,132.07c-70.93,0.08-128.7-59.04-128.78-131.79
					s57.56-132,128.49-132.07C-1294.4,24.72-1236.63,83.84-1236.55,156.59z M-1252.18,200.07c4.96-13.53,7.66-28.18,7.65-43.47
					c-0.02-15.29-2.76-29.94-7.74-43.46l-225.91,0.25c-4.95,13.53-7.66,28.18-7.65,43.47c0.03,15.29,2.76,29.94,7.74,43.46
					L-1252.18,200.07z M-1255.51,208.27l-53.08,0.06c-6.17,31.92-17.68,56.38-31.89,69.53
					C-1302.65,269.76-1271.28,243.42-1255.51,208.27z M-1308.7,105.01l53.08-0.06c-15.85-35.12-47.27-61.38-85.12-69.4
					C-1326.5,48.66-1314.95,73.11-1308.7,105.01z M-1316.74,208.34l-96.76,0.11c8.81,43.31,27.99,72.05,48.46,72.02
					C-1344.58,280.45-1325.45,251.67-1316.74,208.34z M-1413.62,105.12l96.77-0.11c-8.81-43.31-28-72.04-48.47-72.02
					C-1385.78,33.01-1404.9,61.79-1413.62,105.12z M-1389.62,277.91c-14.23-13.11-25.79-37.55-32.03-69.46l-53.08,0.06
					C-1458.89,243.63-1427.47,269.9-1389.62,277.91z M-1421.77,105.13c6.17-31.92,17.68-56.38,31.88-69.53
					c-37.83,8.1-69.19,34.44-84.96,69.59L-1421.77,105.13z"
        />
        <path class="st1"
              d="M-1266.12,164.71v0.53c0,2.22-0.44,4.24-1.32,6.01c-0.87,1.76-2.09,3.28-3.62,4.52
					c-1.52,1.23-3.39,2.17-5.56,2.82c-2.14,0.63-4.51,0.95-7.02,0.95c-3.39,0.01-6.35-0.46-8.8-1.39c-2.45-0.94-4.52-2.2-6.16-3.75
					c-1.64-1.56-2.9-3.36-3.74-5.35c-0.83-1.98-1.32-4-1.44-6.01l-0.03-0.6l7.7-1.93l0.07,0.83c0.28,3.14,1.48,5.69,3.56,7.58
					c2.1,1.9,4.95,2.87,8.48,2.86c3,0,5.44-0.61,7.23-1.79c1.72-1.14,2.56-2.69,2.56-4.74c-0.01-2.21-0.82-3.73-2.49-4.66
					c-1.78-1-4.78-1.65-8.91-1.94c-5.04-0.35-8.98-1.58-11.71-3.64c-2.81-2.13-4.24-5.25-4.24-9.3v-0.52c0-2.18,0.45-4.12,1.37-5.78
					c0.91-1.65,2.15-3.05,3.68-4.16c1.52-1.1,3.25-1.93,5.15-2.48c1.88-0.55,3.88-0.83,5.94-0.83c2.88,0,5.45,0.41,7.63,1.22
					c2.19,0.82,4.06,1.9,5.55,3.21c1.5,1.33,2.68,2.87,3.49,4.59c0.8,1.7,1.33,3.43,1.57,5.14l0.09,0.64l-7.74,1.95l-0.09-0.82
					c-0.27-2.65-1.27-4.65-3.05-6.12c-1.79-1.48-4.18-2.22-7.09-2.22c-1.15,0-2.26,0.13-3.33,0.38c-1.03,0.25-1.97,0.63-2.76,1.12
					c-0.76,0.47-1.38,1.06-1.84,1.76c-0.44,0.68-0.66,1.46-0.65,2.38c0,1.88,0.75,3.26,2.29,4.25c1.65,1.04,4.77,1.74,9.27,2.09
					c5.1,0.41,9.06,1.69,11.76,3.78C-1267.54,157.45-1266.13,160.62-1266.12,164.71z"
        />
        <path class="st1"
              d="M-1314.86,155.25v1.06c0,3.71-0.6,7.06-1.81,9.93c-1.19,2.87-2.82,5.32-4.83,7.29
					c-2,1.97-4.38,3.49-7.06,4.52s-5.49,1.55-8.36,1.56c-2.94,0-5.76-0.52-8.42-1.54c-2.65-1.03-5.01-2.54-7.02-4.51
					c-2.01-1.96-3.64-4.41-4.85-7.28c-1.21-2.86-1.83-6.2-1.83-9.92v-1.07c0-3.66,0.6-6.97,1.81-9.84c1.19-2.86,2.84-5.33,4.87-7.34
					c2.04-2,4.41-3.53,7.06-4.56c5.29-2.06,11.35-2.06,16.65-0.02c2.66,1.03,5.03,2.55,7.07,4.55c2.04,2,3.68,4.46,4.89,7.32
					C-1315.47,148.27-1314.86,151.58-1314.86,155.25z M-1323.12,156.32v-1.06c0-2.26-0.36-4.34-1.08-6.23
					c-0.71-1.87-1.71-3.49-2.95-4.82c-1.25-1.33-2.74-2.39-4.42-3.14c-1.69-0.75-3.5-1.13-5.4-1.13c-1.9,0-3.71,0.38-5.39,1.14
					c-1.68,0.75-3.16,1.81-4.42,3.15c-1.24,1.33-2.23,2.96-2.94,4.84c-0.7,1.87-1.06,3.96-1.06,6.22v1.06
					c0.01,2.37,0.37,4.52,1.08,6.39s1.7,3.5,2.95,4.83s2.72,2.35,4.36,3.05c3.31,1.38,7.6,1.38,10.9-0.02
					c1.65-0.69,3.12-1.72,4.37-3.05c1.24-1.33,2.23-2.96,2.94-4.84C-1323.48,160.83-1323.12,158.68-1323.12,156.32z"
        />
        <path class="st1"
              d="M-1413.5,208.45l96.76-0.11c-8.71,43.33-27.84,72.11-48.3,72.13
					C-1385.51,280.5-1404.69,251.76-1413.5,208.45z"
        />
        <path class="st1"
              d="M-1316.85,105.01l-96.77,0.11c8.72-43.33,27.84-72.11,48.3-72.13
					C-1344.85,32.97-1325.66,61.7-1316.85,105.01z"
        />
        <polygon class="st1"
                 points="-1370.01,170.64 -1370.01,178.4 -1409.03,178.45 -1409.04,170.68 -1393.57,170.67 -1393.61,139.83
					-1408.56,139.85 -1408.57,132.08 -1385.52,132.05 -1385.48,170.66 				"
        />
        <path class="st1"
              d="M-1420.04,156.43c0.01,3.71-0.61,7.05-1.81,9.93c-1.2,2.87-2.83,5.32-4.83,7.29
					c-2.01,1.97-4.38,3.49-7.06,4.52c-2.68,1.02-5.49,1.55-8.37,1.55c-2.93,0-5.76-0.51-8.41-1.54c-2.65-1.02-5.02-2.53-7.03-4.5
					c-2.01-1.96-3.64-4.41-4.84-7.28c-1.21-2.87-1.83-6.21-1.83-9.93v-1.06c-0.01-3.66,0.6-6.97,1.8-9.85
					c1.2-2.86,2.84-5.33,4.88-7.33c2.03-2,4.41-3.54,7.06-4.57c5.29-2.05,11.35-2.06,16.64-0.01c2.66,1.02,5.04,2.55,7.08,4.54
					c2.04,2,3.68,4.47,4.89,7.33c1.21,2.87,1.82,6.18,1.83,9.84V156.43z M-1428.31,156.43v-1.06c0-2.25-0.36-4.34-1.07-6.22
					c-0.72-1.86-1.7-3.49-2.96-4.83c-1.25-1.33-2.74-2.38-4.42-3.14c-1.68-0.75-3.5-1.12-5.4-1.12c-1.89,0-3.7,0.38-5.39,1.13
					c-1.68,0.76-3.16,1.82-4.41,3.15c-1.25,1.34-2.24,2.97-2.94,4.84c-0.71,1.87-1.07,3.97-1.07,6.22l0.01,1.06
					c0,2.37,0.36,4.52,1.07,6.39c0.71,1.87,1.7,3.5,2.96,4.83c1.24,1.34,2.71,2.36,4.36,3.05c3.31,1.39,7.59,1.39,10.91-0.01
					c1.64-0.69,3.11-1.72,4.35-3.06c1.25-1.33,2.23-2.96,2.94-4.83C-1428.66,160.95-1428.31,158.8-1428.31,156.43z"
        />
			</g>
      <g>
			</g>
		</g>
	</g>
</g>
  <g>
	<g>
		<g id="XMLID_2_">
			<g>
				<path class="st1"
              d="M-543.55,156.59c0.08,72.75-57.56,132-128.48,132.07c-70.93,0.08-128.7-59.04-128.78-131.79
					s57.56-132,128.49-132.07C-601.4,24.72-543.63,83.84-543.55,156.59z M-559.18,200.07c4.96-13.53,7.66-28.18,7.65-43.47
					c-0.02-15.29-2.76-29.94-7.74-43.46l-225.91,0.25c-4.95,13.53-7.66,28.18-7.65,43.47c0.03,15.29,2.76,29.94,7.74,43.46
					L-559.18,200.07z M-562.51,208.27l-53.08,0.06c-6.17,31.92-17.68,56.38-31.89,69.53C-609.65,269.76-578.28,243.42-562.51,208.27
					z M-615.7,105.01l53.08-0.06c-15.85-35.12-47.27-61.38-85.12-69.4C-633.5,48.66-621.95,73.11-615.7,105.01z M-623.74,208.34
					l-96.76,0.11c8.81,43.31,27.99,72.05,48.46,72.02C-651.58,280.45-632.45,251.67-623.74,208.34z M-720.62,105.12l96.77-0.11
					c-8.81-43.31-28-72.04-48.47-72.02C-692.78,33.01-711.9,61.79-720.62,105.12z M-696.62,277.91
					c-14.23-13.11-25.79-37.55-32.03-69.46l-53.08,0.06C-765.89,243.63-734.47,269.9-696.62,277.91z M-728.77,105.13
					c6.17-31.92,17.68-56.38,31.88-69.53c-37.83,8.1-69.19,34.44-84.96,69.59L-728.77,105.13z"
        />
        <path class="st1"
              d="M-615.59,208.33l53.08-0.06c-15.77,35.15-47.14,61.49-84.97,69.59
					C-633.27,264.71-621.76,240.25-615.59,208.33z"
        />
        <path class="st1"
              d="M-562.62,104.95l-53.08,0.06c-6.25-31.9-17.8-56.35-32.04-69.46C-609.89,43.57-578.47,69.83-562.62,104.95z
					"
        />
        <path class="st1"
              d="M-573.12,164.71v0.53c0,2.22-0.44,4.24-1.32,6.01c-0.87,1.76-2.09,3.28-3.62,4.52
					c-1.52,1.23-3.39,2.17-5.56,2.82c-2.14,0.63-4.51,0.95-7.02,0.95c-3.39,0.01-6.35-0.46-8.8-1.39c-2.45-0.94-4.52-2.2-6.16-3.75
					c-1.64-1.56-2.9-3.36-3.74-5.35c-0.83-1.98-1.32-4-1.44-6.01l-0.03-0.6l7.7-1.93l0.07,0.83c0.28,3.14,1.48,5.69,3.56,7.58
					c2.1,1.9,4.95,2.87,8.48,2.86c3,0,5.44-0.61,7.23-1.79c1.72-1.14,2.56-2.69,2.56-4.74c-0.01-2.21-0.82-3.73-2.49-4.66
					c-1.78-1-4.78-1.65-8.91-1.94c-5.04-0.35-8.98-1.58-11.71-3.64c-2.81-2.13-4.24-5.25-4.24-9.3v-0.52c0-2.18,0.45-4.12,1.37-5.78
					c0.91-1.65,2.15-3.05,3.68-4.16c1.52-1.1,3.25-1.93,5.15-2.48c1.88-0.55,3.88-0.83,5.94-0.83c2.88,0,5.45,0.41,7.63,1.22
					c2.19,0.82,4.06,1.9,5.55,3.21c1.5,1.33,2.68,2.87,3.49,4.59c0.8,1.7,1.33,3.43,1.57,5.14l0.09,0.64l-7.74,1.95l-0.09-0.82
					c-0.27-2.65-1.27-4.65-3.05-6.12c-1.79-1.48-4.18-2.22-7.09-2.22c-1.15,0-2.26,0.13-3.33,0.38c-1.03,0.25-1.97,0.63-2.76,1.12
					c-0.76,0.47-1.38,1.06-1.84,1.76c-0.44,0.68-0.66,1.46-0.65,2.38c0,1.88,0.75,3.26,2.29,4.25c1.65,1.04,4.77,1.74,9.27,2.09
					c5.1,0.41,9.06,1.69,11.76,3.78C-574.54,157.45-573.13,160.62-573.12,164.71z"
        />
        <path class="st1"
              d="M-621.86,155.25v1.06c0,3.71-0.6,7.06-1.81,9.93c-1.19,2.87-2.82,5.32-4.83,7.29
					c-2,1.97-4.38,3.49-7.06,4.52s-5.49,1.55-8.36,1.56c-2.94,0-5.76-0.52-8.42-1.54c-2.65-1.03-5.01-2.54-7.02-4.51
					c-2.01-1.96-3.64-4.41-4.85-7.28c-1.21-2.86-1.83-6.2-1.83-9.92v-1.07c0-3.66,0.6-6.97,1.81-9.84c1.19-2.86,2.84-5.33,4.87-7.34
					c2.04-2,4.41-3.53,7.06-4.56c5.29-2.06,11.35-2.06,16.65-0.02c2.66,1.03,5.03,2.55,7.07,4.55c2.04,2,3.68,4.46,4.89,7.32
					C-622.47,148.27-621.86,151.58-621.86,155.25z M-630.12,156.32v-1.06c0-2.26-0.36-4.34-1.08-6.23
					c-0.71-1.87-1.71-3.49-2.95-4.82c-1.25-1.33-2.74-2.39-4.42-3.14c-1.69-0.75-3.5-1.13-5.4-1.13c-1.9,0-3.71,0.38-5.39,1.14
					c-1.68,0.75-3.16,1.81-4.42,3.15c-1.24,1.33-2.23,2.96-2.94,4.84c-0.7,1.87-1.06,3.96-1.06,6.22v1.06
					c0.01,2.37,0.37,4.52,1.08,6.39c0.71,1.87,1.7,3.5,2.95,4.83s2.72,2.35,4.36,3.05c3.31,1.38,7.6,1.38,10.9-0.02
					c1.65-0.69,3.12-1.72,4.37-3.05c1.24-1.33,2.23-2.96,2.94-4.84C-630.48,160.83-630.12,158.68-630.12,156.32z"
        />
        <polygon class="st1"
                 points="-677.01,170.64 -677.01,178.4 -716.03,178.45 -716.04,170.68 -700.57,170.67 -700.61,139.83
					-715.56,139.85 -715.57,132.08 -692.52,132.05 -692.48,170.66 				"
        />
        <path class="st1"
              d="M-728.65,208.45c6.24,31.91,17.8,56.35,32.03,69.46c-37.85-8.01-69.27-34.28-85.11-69.4L-728.65,208.45z"
        />
        <path class="st1"
              d="M-696.89,35.6c-14.2,13.15-25.71,37.61-31.88,69.53l-53.08,0.06C-766.08,70.04-734.72,43.7-696.89,35.6z"
        />
        <path class="st1"
              d="M-727.04,156.43c0.01,3.71-0.61,7.05-1.81,9.93c-1.2,2.87-2.83,5.32-4.83,7.29
					c-2.01,1.97-4.38,3.49-7.06,4.52c-2.68,1.02-5.49,1.55-8.37,1.55c-2.93,0-5.76-0.51-8.41-1.54c-2.65-1.02-5.02-2.53-7.03-4.5
					c-2.01-1.96-3.64-4.41-4.84-7.28c-1.21-2.87-1.83-6.21-1.83-9.93v-1.06c-0.01-3.66,0.6-6.97,1.8-9.85
					c1.2-2.86,2.84-5.33,4.88-7.33c2.03-2,4.41-3.54,7.06-4.57c5.29-2.05,11.35-2.06,16.64-0.01c2.66,1.02,5.04,2.55,7.08,4.54
					c2.04,2,3.68,4.47,4.89,7.33c1.21,2.87,1.82,6.18,1.83,9.84V156.43z M-735.31,156.43v-1.06c0-2.25-0.36-4.34-1.07-6.22
					c-0.72-1.86-1.7-3.49-2.96-4.83c-1.25-1.33-2.74-2.38-4.42-3.14c-1.68-0.75-3.5-1.12-5.4-1.12c-1.89,0-3.7,0.38-5.39,1.13
					c-1.68,0.76-3.16,1.82-4.41,3.15c-1.25,1.34-2.24,2.97-2.94,4.84c-0.71,1.87-1.07,3.97-1.07,6.22l0.01,1.06
					c0,2.37,0.36,4.52,1.07,6.39c0.71,1.87,1.7,3.5,2.96,4.83c1.24,1.34,2.71,2.36,4.36,3.05c3.31,1.39,7.59,1.39,10.91-0.01
					c1.64-0.69,3.11-1.72,4.35-3.06c1.25-1.33,2.23-2.96,2.94-4.83C-735.66,160.95-735.31,158.8-735.31,156.43z"
        />
			</g>
      <g>
			</g>
		</g>
	</g>
</g>
  <g>
	<path class="st1"
        d="M-1018.67,24.88c-70.83,0.07-128.39,59.25-128.31,131.9c0.08,72.65,57.77,131.69,128.6,131.61
		c70.83-0.07,128.39-59.25,128.31-131.89C-890.15,83.84-947.84,24.8-1018.67,24.88z M-927.63,162.66c-1.79-1-4.78-1.65-8.91-1.94
		c-5.04-0.36-8.98-1.59-11.7-3.65c-2.81-2.13-4.23-5.24-4.23-9.28v-0.53c0-2.17,0.46-4.1,1.38-5.76c0.91-1.64,2.15-3.04,3.68-4.14
		c1.52-1.1,3.25-1.93,5.15-2.47c1.88-0.55,3.88-0.82,5.94-0.82c2.87,0,5.44,0.41,7.62,1.23c2.19,0.82,4.05,1.89,5.54,3.21
		c1.5,1.32,2.67,2.87,3.48,4.58c0.8,1.7,1.33,3.42,1.57,5.13l0.09,0.64l-7.74,1.93l-0.08-0.81c-0.27-2.65-1.27-4.65-3.05-6.12
		c-1.79-1.47-4.17-2.22-7.08-2.22c-1.14,0-2.26,0.13-3.32,0.38c-1.04,0.25-1.97,0.62-2.76,1.11c-0.77,0.47-1.39,1.06-1.84,1.76
		c-0.44,0.68-0.66,1.45-0.66,2.38c0,1.87,0.75,3.25,2.29,4.23c1.64,1.05,4.76,1.75,9.26,2.09c5.1,0.42,9.05,1.7,11.75,3.79
		c2.77,2.16,4.18,5.32,4.18,9.4v0.53c0,2.21-0.44,4.23-1.32,5.99c-0.87,1.75-2.09,3.27-3.63,4.5c-1.52,1.23-3.4,2.17-5.56,2.8
		c-2.14,0.63-4.5,0.95-7.02,0.95c-3.39,0-6.34-0.47-8.79-1.41c-2.45-0.93-4.52-2.19-6.16-3.75c-1.64-1.56-2.89-3.35-3.73-5.34
		c-0.83-1.97-1.31-3.99-1.43-6l-0.04-0.59l7.7-1.92l0.07,0.82c0.27,3.14,1.46,5.68,3.55,7.57c2.09,1.9,4.94,2.86,8.47,2.86
		c3,0,5.43-0.6,7.23-1.78c1.72-1.13,2.56-2.68,2.56-4.72C-925.16,165.11-925.97,163.59-927.63,162.66z M-965.77,156.29v1.06
		c0,3.71-0.61,7.04-1.82,9.91c-1.21,2.86-2.83,5.3-4.84,7.27c-2.01,1.96-4.39,3.48-7.07,4.5c-2.67,1.02-5.49,1.54-8.36,1.54
		c-2.93,0-5.76-0.52-8.41-1.54c-2.65-1.02-5.01-2.54-7.02-4.5c-2.01-1.96-3.64-4.41-4.84-7.27c-1.21-2.86-1.82-6.19-1.82-9.91v-1.06
		c0-3.66,0.61-6.96,1.82-9.82c1.2-2.85,2.84-5.31,4.88-7.31c2.03-1.99,4.41-3.52,7.06-4.54c5.29-2.05,11.35-2.05,16.64,0
		c2.65,1.02,5.03,2.55,7.06,4.54c2.03,1.99,3.68,4.45,4.88,7.31C-966.39,149.33-965.77,152.64-965.77,156.29z M-1059.41,141.82
		v-7.75h23.03v38.51h15.46v7.75h-39.01v-7.75h15.46v-30.76H-1059.41z M-1115.07,157.29c0-3.66,0.61-6.96,1.82-9.82
		c1.2-2.85,2.84-5.31,4.88-7.31c2.03-1.99,4.41-3.52,7.06-4.54c5.29-2.05,11.35-2.05,16.64,0c2.65,1.02,5.03,2.55,7.06,4.54
		c2.03,1.99,3.68,4.45,4.88,7.31c1.21,2.86,1.82,6.17,1.82,9.82v1.06c0,3.71-0.61,7.04-1.82,9.91c-1.2,2.86-2.83,5.3-4.84,7.27
		c-2.01,1.96-4.39,3.48-7.07,4.5c-2.67,1.02-5.49,1.54-8.36,1.54c-2.93,0-5.76-0.52-8.4-1.54c-2.65-1.02-5.01-2.54-7.02-4.5
		c-2.01-1.96-3.64-4.41-4.84-7.27c-1.21-2.86-1.82-6.19-1.82-9.91V157.29z M-909.12,104.92l-53.01,0.06
		c-6.24-31.86-17.78-56.27-31.99-69.37C-956.32,43.63-924.94,69.85-909.12,104.92z M-1018.67,33.06
		c20.44-0.02,39.6,28.68,48.4,71.93l-96.63,0.11C-1058.2,61.83-1039.1,33.08-1018.67,33.06z M-1043.2,35.67
		c-14.18,13.13-25.67,37.56-31.84,69.44l-53.01,0.05C-1112.3,70.06-1080.98,43.76-1043.2,35.67z M-1127.94,208.35l53.01-0.06
		c6.24,31.86,17.78,56.27,31.99,69.37C-1080.73,269.65-1112.11,243.42-1127.94,208.35z M-1018.39,280.21
		c-20.44,0.03-39.6-28.68-48.4-71.93l96.63-0.11C-978.86,251.45-997.96,280.19-1018.39,280.21z M-993.86,277.6
		c14.19-13.13,25.68-37.56,31.84-69.43l53.01-0.06C-924.75,243.21-956.08,269.51-993.86,277.6z"
  />
    <path class="st1"
          d="M-978.05,145.26c-1.25-1.33-2.73-2.39-4.41-3.14c-1.68-0.75-3.5-1.13-5.39-1.13c-1.9,0-3.71,0.38-5.39,1.13
		c-1.68,0.75-3.17,1.8-4.41,3.14s-2.24,2.95-2.95,4.82c-0.71,1.87-1.07,3.96-1.07,6.2v1.06c0,2.36,0.36,4.51,1.07,6.38
		c0.71,1.86,1.7,3.49,2.95,4.82c1.25,1.33,2.71,2.35,4.36,3.04c3.31,1.39,7.59,1.39,10.9,0c1.65-0.69,3.11-1.71,4.36-3.04
		c1.25-1.33,2.24-2.95,2.95-4.82c0.71-1.87,1.07-4.02,1.07-6.38v-1.06c0-2.24-0.36-4.33-1.07-6.21
		C-975.81,148.21-976.8,146.59-978.05,145.26z"
    />
    <path class="st1"
          d="M-1102.8,169.55c1.24,1.33,2.71,2.35,4.36,3.04c3.31,1.39,7.59,1.39,10.9,0c1.64-0.69,3.11-1.71,4.36-3.04
		c1.25-1.33,2.24-2.95,2.95-4.82c0.71-1.87,1.07-4.02,1.07-6.38v-1.06c0-2.24-0.36-4.33-1.07-6.21c-0.71-1.86-1.7-3.49-2.95-4.82
		c-1.25-1.33-2.73-2.39-4.41-3.14c-1.68-0.75-3.5-1.13-5.39-1.13c-1.9,0-3.71,0.38-5.39,1.13c-1.68,0.75-3.17,1.8-4.41,3.14
		c-1.25,1.33-2.24,2.95-2.95,4.82c-0.71,1.87-1.07,3.96-1.07,6.2v1.06c0,2.36,0.36,4.51,1.07,6.38
		C-1105.04,166.59-1104.05,168.21-1102.8,169.55z"
    />
</g>
</svg>
