<?xml version="1.0" encoding="UTF-8"?>
<svg width="700pt"
     height="700pt"
     version="1.1"
     viewBox="0 0 700 550"
     xmlns="http://www.w3.org/2000/svg"
>
  <path d="m212.71 217.18c0-1.9609 0.78125-3.8398 2.168-5.2266 1.3867-1.3828 3.2656-2.1602 5.2227-2.1602h249.59c4 0.11328 7.1836 3.3867 7.1836 7.3906 0 4-3.1836 7.2734-7.1836 7.3867h-249.59c-1.957 0-3.8398-0.77734-5.2227-2.1641-1.3867-1.3867-2.168-3.2656-2.168-5.2266zm7.3906 52.738h249.59c4-0.11328 7.1836-3.3867 7.1836-7.3867 0-4.0039-3.1836-7.2773-7.1836-7.3906h-249.59c-1.9922-0.054688-3.9258 0.69922-5.3594 2.0898-1.4297 1.3906-2.2383 3.3047-2.2383 5.3008s0.80859 3.9062 2.2383 5.2969c1.4336 1.3906 3.3672 2.1445 5.3594 2.0898zm0 45.348h249.59c4-0.11328 7.1836-3.3867 7.1836-7.3867s-3.1836-7.2773-7.1836-7.3867h-249.59c-1.9922-0.058593-3.9258 0.69531-5.3594 2.0859-1.4297 1.3945-2.2383 3.3047-2.2383 5.3008s0.80859 3.9062 2.2383 5.2969c1.4336 1.3945 3.3672 2.1484 5.3594 2.0898zm0-133.21h132.61c4-0.10938 7.1836-3.3867 7.1836-7.3867s-3.1836-7.2734-7.1836-7.3867h-132.61c-1.9922-0.058594-3.9258 0.69531-5.3594 2.0898-1.4297 1.3906-2.2383 3.3008-2.2383 5.2969 0 1.9961 0.80859 3.9062 2.2383 5.3008 1.4336 1.3906 3.3672 2.1445 5.3594 2.0859zm0-33.832h80.262c4-0.11328 7.1836-3.3867 7.1836-7.3867s-3.1836-7.2773-7.1836-7.3906h-80.262c-1.9922-0.054687-3.9258 0.69922-5.3594 2.0898-1.4297 1.3906-2.2383 3.3047-2.2383 5.3008 0 1.9961 0.80859 3.9062 2.2383 5.2969 1.4336 1.3945 3.3672 2.1445 5.3594 2.0898zm395.38 24.078-13.609 23.566c4.8828 7.3047 11.707 18.977 5.9844 28.887l-24.715 42.824c-2.0469 3.5352-6.5703 4.7422-10.102 2.6953-3.5352-2.0469-4.7422-6.5703-2.6953-10.102l24.715-42.812c0.65234-1.168 0.09375-3.4297-1.6523-6.8438l-58.488 101.36v189.64c0 1.9609-0.78125 3.8398-2.168 5.2266-1.3828 1.3828-3.2656 2.1602-5.2227 2.1602h-119.34l-267.89 30.367c-0.28125 0.03125-0.56641 0.046875-0.84766 0.046875-3.7539-0.003906-6.9062-2.8242-7.3281-6.5547l-53.328-470.41c-0.45312-4.0508 2.4609-7.707 6.5117-8.1641l69.566-7.8984v-18.203c0-1.957 0.78125-3.8359 2.168-5.2227 1.3867-1.3867 3.2656-2.1641 5.2266-2.1602h284.27c1.9609-0.003906 3.8398 0.77734 5.2227 2.1641l80.973 80.977c1.3906 1.3945 2.1719 3.2812 2.1641 5.25v102.57l37.184-64.395h-0.003906c2.8242-4.5312 6.3477-8.5898 10.441-12.02 6.9492-5.832 12.957-7.3906 17.855-4.5625l15.301 8.832c11.457 6.6172 2.0078 28.965-0.20312 32.805zm-30.602-17.664-0.074218 0.13281 17.777 10.316 0.074219-0.13281h0.003906c2.1758-4.2461 3.4766-8.8906 3.8242-13.648l-11.719-6.7656v-0.003906c-3.9375 2.6758-7.3008 6.1172-9.8867 10.117zm10.336 23.203-17.797-10.277-115.1 199.36 17.797 10.277zm-125.68 210.32-11.402-6.5859-2.2031 16.98zm-15.602-286.49h55.75l-55.75-55.75zm-176.93 407.23h-114.73c-1.9609 0-3.8398-0.77734-5.2266-2.1602-1.3867-1.3867-2.168-3.2656-2.168-5.2266v-440.36l-60.559 6.8633 51.66 455.73zm243.13-171.43-30.918 53.527c-0.48438 0.84375-1.1367 1.582-1.9102 2.1758l-15.266 11.668v-0.003907c3.8711 1.2812 5.9766 5.457 4.6953 9.332-1.2773 3.875-5.4531 5.9766-9.3281 4.6992-4.8008-1.5547-10.039-0.96875-14.375 1.6094-1.5039 0.63672-2.918 1.168-4.3281 1.7031h-0.070313c-17.371 6.3828-25.16 3.4297-31.098 0.058594l-0.26172-0.14453c-2.2266 1.5781-4.8477 2.5156-7.5703 2.707-2.7266 0.1875-5.4492-0.375-7.875-1.6289-3.8789-3.6406-5.3203-9.1836-3.6992-14.25 0.039062-0.29688 0.082031-0.58203 0.11719-0.92188l-2.918 1.9375c-19.191 12.758-26.949 17.332-32.277 17.582h-0.35547v-0.003906c-3.9531 0.015625-7.2188-3.0898-7.4023-7.043-0.18359-3.9492 2.7812-7.3438 6.7227-7.6953 8.7539-4.4023 17.156-9.4727 25.129-15.168 13.066-8.6875 14.746-9.8008 18.598-8.9297 2.0039 0.47266 3.7305 1.7344 4.7891 3.5 2.5195 4.7773 3.4375 10.242 2.6055 15.578 3.9414-1.332 8.2773-0.72266 11.695 1.6484 2.2383 1.2734 5.4062 3.0625 14.754 0.26172l5.3125-40.992h0.003907c0.12109-0.96875 0.4375-1.9023 0.92578-2.7461l3.0742-5.3242-228.8-0.003906c-1.9922 0.058594-3.9258-0.69531-5.3594-2.0859-1.4297-1.3945-2.2383-3.3047-2.2383-5.3008 0-1.9961 0.80859-3.9062 2.2383-5.2969 1.4336-1.3945 3.3672-2.1484 5.3594-2.0898h237.33l62.695-108.58v-120.81h-73.582c-4.082 0-7.3906-3.3086-7.3906-7.3906v-73.582h-269.5v458.65h350.47z"
  />
</svg>
