<?xml version="1.0" encoding="UTF-8"?>
<svg width="700pt"
     height="700pt"
     version="1.1"
     viewBox="0 0 700 550"
     xmlns="http://www.w3.org/2000/svg"
>
  <path d="m441.61 29.949c-1.3945-1.3906-3.2812-2.168-5.25-2.1641h-276.24c-1.9609 0-3.8438 0.77734-5.2266 2.1641-1.3867 1.3867-2.168 3.2656-2.168 5.2266v17.5l-67.418 7.6406c-4.0508 0.46484-6.9609 4.1172-6.5117 8.168l20.859 184.04c-3.6992 2.6602-7.6836 4.8984-11.883 6.6719-2.5938 1.0938-4.3398 3.5625-4.5078 6.3711-1.8086 28.348 4.3867 56.633 17.871 81.633 3.2656 5.9062 6.9961 11.543 11.16 16.855l18.324 161.58v0.003907c0.42188 3.7305 3.5781 6.5508 7.332 6.5547 0.28125 0 0.55859-0.015625 0.83984-0.046875l260.34-29.484h115.95c1.9648-0.003906 3.8438-0.78516 5.2305-2.1758 1.3828-1.3906 2.1602-3.2734 2.1562-5.2344v-381.38c0.003906-1.9688-0.77344-3.8594-2.1641-5.25zm2.1641 23.066 53.461 53.461h-53.461zm-291.05 14.527v156.8h-25.199c-2.6602 0.003906-5.1094 1.4375-6.4141 3.7539-2.332 4.1328-5.0078 8.0586-8.0039 11.73l-18.777-165.67zm-54.902 203.29c14.035-7.2109 25.777-18.195 33.91-31.715h56.77c8.1367 13.52 19.883 24.504 33.914 31.715 1.5156 50.855-23.59 96.277-62.293 112.54-38.098-16.086-63.719-62.445-62.301-112.54zm46.668 245.82-15.348-135.19c7.1406 5.9961 15.078 10.973 23.582 14.793v98.992c0 4.082 3.3125 7.3906 7.3945 7.3906h107.82zm23.043-28.777v-91.617c18.32-8.4844 33.938-21.871 45.129-38.676 1.1133 0.64062 2.375 0.97656 3.6602 0.97656h242.55c1.9922 0.054687 3.9258-0.69922 5.3594-2.0898 1.4297-1.3906 2.2383-3.3047 2.2383-5.3008 0-1.9961-0.80859-3.9062-2.2383-5.2969-1.4336-1.3906-3.3672-2.1445-5.3594-2.0898h-237.96c4.793-9.3242 8.5508-19.148 11.207-29.293h226.75c1.9922 0.054688 3.9258-0.69922 5.3594-2.0898 1.4297-1.3906 2.2383-3.3047 2.2383-5.3008s-0.80859-3.9062-2.2383-5.2969c-1.4336-1.3906-3.3672-2.1445-5.3594-2.0898h-223.63c1.5586-9.6836 2.207-19.496 1.9336-29.301h221.7c1.9922 0.054688 3.9258-0.69922 5.3594-2.0898 1.4297-1.3906 2.2383-3.3008 2.2383-5.2969 0-1.9961-0.80859-3.9102-2.2383-5.3008-1.4336-1.3906-3.3672-2.1445-5.3594-2.0898h-233.5c-11.031-6.6914-20.09-16.191-26.25-27.531-1.3047-2.3164-3.7539-3.7539-6.4141-3.7578h-25.199v-181.76h261.49v71.285c0 4.0781 3.3086 7.3828 7.3867 7.3828h71.301v366.62zm298.75-268.92v0.003907c-0.003906 1.9609-0.78906 3.8398-2.1797 5.2227-1.3906 1.3828-3.2734 2.1562-5.2344 2.1484h-242.55c-1.9961 0.058594-3.9297-0.69531-5.3594-2.0859-1.4336-1.3945-2.2383-3.3047-2.2383-5.3008 0-1.9961 0.80469-3.9062 2.2383-5.3008 1.4297-1.3906 3.3633-2.1445 5.3594-2.0859h242.55c4.082 0 7.3906 3.3086 7.3906 7.3906zm-257.36-41.328c0-1.957 0.77734-3.8359 2.1641-5.2227 1.3867-1.3828 3.2656-2.1602 5.2266-2.1602h128.86c1.9961-0.054688 3.9297 0.69531 5.3594 2.0898 1.4297 1.3906 2.2383 3.3008 2.2383 5.2969 0 1.9961-0.80859 3.9102-2.2383 5.3008s-3.3633 2.1445-5.3594 2.0898h-128.86c-1.9609 0-3.8398-0.78125-5.2266-2.168-1.3867-1.3828-2.1641-3.2656-2.1641-5.2266zm0-32.871v0.003907c0-1.9609 0.77734-3.8398 2.1641-5.2266 1.3867-1.3828 3.2656-2.1602 5.2266-2.1602h77.996c1.9961-0.054688 3.9297 0.69922 5.3594 2.0898 1.4336 1.3906 2.2383 3.3008 2.2383 5.2969 0 1.9961-0.80469 3.9102-2.2383 5.3008-1.4297 1.3906-3.3633 2.1445-5.3594 2.0898h-77.996c-1.9609 0-3.8398-0.78125-5.2266-2.168-1.3867-1.3828-2.1641-3.2656-2.1641-5.2227zm256.97 265.63c-1.2539 3.8828-5.418 6.0117-9.2969 4.7578-4.6211-1.4883-9.6562-0.91797-13.828 1.5625-20.02 8.3867-28.398 5.2891-34.68 1.75l-0.15625-0.085938v-0.003906c-2.1992 1.5078-4.7656 2.3906-7.4258 2.5664-2.6602 0.17188-5.3203-0.37109-7.6992-1.5781-3.8516-3.5781-5.2891-9.0547-3.6914-14.059l0.058594-0.44922-2.457 1.6328c-18.668 12.426-26.25 16.875-31.473 17.121h-0.35156 0.003906c-3.9414-0.007813-7.1836-3.1016-7.3711-7.0391-0.1875-3.9336 2.7422-7.3242 6.6641-7.707 8.4766-4.2695 16.617-9.1797 24.344-14.688 12.77-8.4922 14.414-9.5859 18.234-8.7109 2 0.46094 3.7266 1.7109 4.7891 3.4648 2.4375 4.5781 3.3438 9.8203 2.5898 14.949 3.8164-1.168 7.957-0.52344 11.234 1.75 2.6523 1.5039 6.6719 3.7852 21.676-2.5039v0.003906c7.4414-3.8516 16.109-4.5703 24.082-1.9961 3.8633 1.2539 5.9883 5.3945 4.7539 9.2617zm133.8-233.06v-30.332c0-4.7539-3.1484-30.574-17.078-30.574h-19.391c-13.93 0-17.078 25.816-17.078 30.574l-0.003906 277.15c0.007812 0.97656 0.20703 1.9414 0.58594 2.8398l19.391 46.543h-0.003906c1.1523 2.75 3.8398 4.543 6.8203 4.543s5.6719-1.793 6.8203-4.543l19.371-46.531c0.37891-0.89844 0.57812-1.8633 0.58594-2.8398v-230.03c3.5703 2.1992 6.7656 4.7539 6.7656 6.9062v54.25c0.11328 4 3.3867 7.1836 7.3867 7.1836s7.2773-3.1836 7.3867-7.1836v-54.25c-0.015625-12.383-12.676-19.383-21.559-23.707zm-38.773 239.43v-254.09h24v254.09zm4.1602-285.55h15.68c2.4922 4.9102 3.9102 10.297 4.1602 15.797v0.88672h-24v-0.88672c0.24609-5.5 1.6641-10.887 4.1602-15.797zm7.8398 320.25-8.3086-19.945h16.613zm-423.15-113.81-22.27-22.273c-2.7969-2.9023-2.75-7.5078 0.097656-10.355 2.8516-2.8477 7.4531-2.8867 10.355-0.089844l17.047 17.047 36.547-36.547-0.003906-0.003906c2.8867-2.8828 7.5625-2.8828 10.449 0 2.8828 2.8867 2.8828 7.5625 0 10.449l-41.766 41.773h-0.003906c-1.3828 1.3867-3.2656 2.1641-5.2266 2.1641-1.9609 0-3.8398-0.77734-5.2266-2.1641z"
  />
</svg>
