<?xml version="1.0" encoding="UTF-8" standalone="no"?>
<svg
   data-name="Layer 1"
   viewBox="0 0 83.296509 100.57227"
   x="0px"
   y="0px"
   version="1.1"
   id="svg8"
   sodipodi:docname="data-use-policy-none.svg"
   width="83.296509"
   height="100.57227"
   inkscape:version="1.1.2 (0a00cf5339, 2022-02-04)"
   xmlns:inkscape="http://www.inkscape.org/namespaces/inkscape"
   xmlns:sodipodi="http://sodipodi.sourceforge.net/DTD/sodipodi-0.dtd"
   xmlns="http://www.w3.org/2000/svg"
   xmlns:svg="http://www.w3.org/2000/svg">
  <defs
     id="defs12" />
  <sodipodi:namedview
     id="namedview10"
     pagecolor="#ffffff"
     bordercolor="#666666"
     borderopacity="1.0"
     inkscape:pageshadow="2"
     inkscape:pageopacity="0.0"
     inkscape:pagecheckerboard="0"
     showgrid="false"
     inkscape:zoom="5.2416667"
     inkscape:cx="61.90779"
     inkscape:cy="59.236884"
     inkscape:window-width="1920"
     inkscape:window-height="1013"
     inkscape:window-x="0"
     inkscape:window-y="39"
     inkscape:window-maximized="1"
     inkscape:current-layer="svg8" />
  <path
     d="m 81.412114,15.698141 -14.539,-14.5379999 c -0.23709,-0.23781868 -0.559188,-0.37133631 -0.895,-0.37099997 h -51.043 c -0.699745,0 -1.267,0.56725517 -1.267,1.26699997 v 3.321 l -12.5449993,1.422 c -0.69436739,0.078937 -1.19344126,0.7055765 -1.11500002,1.4 L 9.5821147,92.664141 c 0.072697,0.640506 0.6143813,1.124537 1.2589993,1.125 0.04744,-1.73e-4 0.09484,-0.0028 0.142,-0.008 l 48.108,-5.453 h 21.425 c 0.699745,0 1.267,-0.567255 1.267,-1.267 v -70.467 c -2.78e-4,-0.335983 -0.133682,-0.658166 -0.371,-0.896 z m -14.168,-10.5849999 10.214,10.2139999 h -10.214 z M 11.956114,91.121141 2.6671147,9.1731411 13.667114,7.9261411 V 87.061141 c 0,0.699745 0.567255,1.267 1.267,1.267 h 21.664 z m 4.245,-5.326 V 3.3221411 h 48.51 V 16.594141 c 0,0.699745 0.567255,1.267 1.267,1.267 h 13.272 v 67.934 z m 7.851,-49.786 c -5.53e-4,-0.699583 0.566417,-1.267 1.266,-1.267 h 44.814 c 1.736788,-0.04881 1.736788,2.581808 0,2.533 h -44.814 c -0.699192,0 -1.266,-0.566808 -1.266,-1.266 z m 0,8.143 c 0.0017,-0.698021 0.567977,-1.263002 1.266,-1.263 h 44.814 c 1.736788,-0.04881 1.736788,2.581808 0,2.533 h -44.814 c -0.700758,3e-6 -1.268214,-0.569246 -1.266,-1.27 z m 0,8.142 c 0,-0.699192 0.566808,-1.266 1.266,-1.266 h 44.814 c 1.736788,-0.04881 1.736788,2.581808 0,2.533 h -44.814 c -0.699583,0 -1.266553,-0.567417 -1.266,-1.267 z m 46.08,9.409 h -44.814 c -1.641877,-0.04614 -1.641877,-2.48686 0,-2.533 h 44.814 c 1.736788,-0.04881 1.736788,2.581808 0,2.533 z m -46.08,-33.327 c -5.53e-4,-0.699583 0.566417,-1.267 1.266,-1.267 h 23.81 c 1.641877,0.04614 1.641877,2.48686 0,2.533 h -23.81 c -0.699192,0 -1.266,-0.566808 -1.266,-1.266 z m 0,-6.073 c -5.53e-4,-0.699583 0.566417,-1.267 1.266,-1.267 h 14.412 c 1.641877,0.04614 1.641877,2.48686 0,2.533 h -14.412 c -0.699192,0 -1.266,-0.566808 -1.266,-1.266 z"
     id="path2"
     sodipodi:nodetypes="cccsscccccccsscccccccccsscccccsscccccccsccccccccsccccccccccsccsccsccsc" />
  <path
     style="fill:none;stroke:#000000;stroke-width:4;stroke-linecap:butt;stroke-linejoin:miter;stroke-miterlimit:4;stroke-dasharray:none;stroke-opacity:1"
     d="M 4.1867786,99.331996 81.727519,1.2402728"
     id="path953"
     sodipodi:nodetypes="cc" />
</svg>
