creditName;requesterCommuneName;dateCreated
Credits10;Lancy;2026-07-10 00:00:00
Credits11;Vernier;2032-03-20 00:00:00
Credits12;Carouge;2035-03-23 00:00:00
Credits13;Meyrin;2038-03-25 00:00:00
Credits14;Grand-Saconnex;2041-03-27 00:00:00
Credits15;Plan-les-Ouates;2046-12-12 00:00:00
Credits16;Onex;2052-09-03 00:00:00
Credits17;Bernex;2058-05-15 00:00:00
Credits18;Satigny;2061-05-17 00:00:00
Credits19;Saint-Genis-Pouilly;2067-02-07 00:00:00
Credits20;Chene-Bougeries;2070-02-09 00:00:00
Credits21;Veyrier;2073-02-11 00:00:00
Credits22;Thoiry;2076-02-14 00:00:00
Credits23;Thonex;2079-02-16 00:00:00
Credits24;Troinex;2082-02-18 00:00:00
Credits25;Vandoeuvres;2085-02-20 00:00:00
Credits26;Gaillard;2088-02-23 00:00:00
Credits27;Annemasse;2091-02-25 00:00:00
Credits28;Cologny;2094-02-27 00:00:00
