;tramName;tramLine;nPassengers;cycleNo;location
0;Trams146;14;3;6516;(46.21623985899967, 6.1184805828468845)
1;Trams144;14;2;6530;(46.21959258599202, 6.105855945721585)
2;Trams182;18;3;6537;(46.214945898309566, 6.125408578114381)
3;Trams183;18;5;6544;(46.21506553265199, 6.124967309087373)
4;Trams141;14;8;6551;(46.23651293118392, 6.081750773481154)
5;Trams144;14;3;6551;(46.21623985899967, 6.1184805828468845)
6;Trams183;18;6;6556;(46.21651716889963, 6.117756532803255)
7;Trams146;14;2;6557;(46.209619147164844, 6.1418080462799)
8;Trams141;14;14;6563;(46.23295072525259, 6.077983956126664)
9;Trams182;18;2;6568;(46.209619147164844, 6.1418080462799)
10;Trams142;14;6;6569;(46.23651293118392, 6.081750773481154)
11;Trams185;18;7;6571;(46.232058584382386, 6.0604319665284745)
12;Trams141;14;19;6571;(46.23050706038271, 6.081178429003463)
13;Trams148;14;6;6571;(46.21651716889963, 6.117756532803255)
14;Trams181;18;5;6574;(46.21959258599202, 6.105855945721585)
15;Trams183;18;8;6576;(46.21986421490718, 6.105204240236039)
16;Trams142;14;10;6581;(46.23295072525259, 6.077983956126664)
17;Trams185;18;8;6583;(46.23009144236577, 6.0674901771201615)
18;Trams141;14;18;6584;(46.22560056832065, 6.083841398797564)
19;Trams144;14;2;6586;(46.20968635304554, 6.13851231258912)
20;Trams183;18;7;6590;(46.222163869140346, 6.096846229088542)
21;Trams185;18;14;6591;(46.22875340025039, 6.0722781370443135)
22;Trams144;14;1;6592;(46.209619147164844, 6.1418080462799)
23;Trams148;14;5;6592;(46.220033895155204, 6.104576238045008)
24;Trams181;18;7;6595;(46.21623985899967, 6.1184805828468845)
25;Trams185;18;17;6601;(46.227049832271845, 6.078516021202702)
26;Trams143;14;11;6604;(46.23651293118392, 6.081750773481154)
27;Trams147;14;3;6606;(46.21986421490718, 6.105204240236039)
28;Trams185;18;15;6610;(46.22560056832065, 6.083841398797564)
29;Trams146;14;3;6613;(46.218563912516935, 6.11024684749853)
30;Trams181;18;6;6614;(46.21337382227839, 6.130257285731093)
31;Trams143;14;12;6616;(46.23295072525259, 6.077983956126664)
32;Trams141;14;17;6619;(46.21964321390066, 6.105669972291958)
33;Trams141;14;18;6620;(46.21959258599202, 6.105855945721585)
34;Trams147;14;2;6620;(46.222163869140346, 6.096846229088542)
35;Trams183;18;6;6621;(46.22725061595765, 6.078016845858288)
36;Trams143;14;14;6624;(46.23050706038271, 6.081178429003463)
37;Trams141;14;24;6629;(46.2182406935082, 6.111092092025428)
38;Trams182;18;3;6631;(46.21986421490718, 6.105204240236039)
39;Trams183;18;5;6631;(46.22892467602633, 6.071768004605402)
40;Trams183;18;4;6632;(46.229129091577946, 6.071164369673746)
41;Trams185;18;13;6632;(46.221882977508976, 6.097531092195339)
42;Trams181;18;1;6636;(46.209619147164844, 6.1418080462799)
43;Trams144;14;2;6636;(46.21651716889963, 6.117756532803255)
44;Trams184;18;3;6637;(46.23009144236577, 6.0674901771201615)
45;Trams142;14;12;6638;(46.21959258599202, 6.105855945721585)
46;Trams149;14;6;6638;(46.23651293118392, 6.081750773481154)
47;Trams148;14;6;6640;(46.2309061952839, 6.080766699467892)
48;Trams141;14;22;6642;(46.21611750965686, 6.119130967851263)
49;Trams184;18;7;6645;(46.22875340025039, 6.0722781370443135)
50;Trams185;18;15;6646;(46.21959258599202, 6.105855945721585)
51;Trams142;14;14;6647;(46.2182406935082, 6.111092092025428)
52;Trams149;14;9;6650;(46.23295072525259, 6.077983956126664)
53;Trams183;18;3;6651;(46.23221759604077, 6.060000006892894)
54;Trams141;14;24;6652;(46.214945898309566, 6.125408578114381)
55;Trams185;18;14;6654;(46.21829243542764, 6.110901561090927)
56;Trams144;14;1;6657;(46.220033895155204, 6.104576238045008)
57;Trams146;14;2;6658;(46.22609617291946, 6.082751555372259)
58;Trams148;14;7;6658;(46.23651293118392, 6.081750773481154)
59;Trams149;14;10;6658;(46.23050706038271, 6.081178429003463)
60;Trams142;14;20;6659;(46.21623985899967, 6.1184805828468845)
61;Trams143;14;13;6659;(46.221882977508976, 6.097531092195339)
62;Trams183;18;2;6660;(46.233563482052425, 6.055252143299553)
63;Trams141;14;22;6660;(46.21337382227839, 6.130257285731093)
64;Trams141;14;23;6661;(46.21326655114928, 6.130478193228091)
65;Trams185;18;15;6667;(46.21623985899967, 6.1184805828468845)
66;Trams148;14;9;6670;(46.23295072525259, 6.077983956126664)
67;Trams143;14;15;6673;(46.21959258599202, 6.105855945721585)
68;Trams147;14;4;6673;(46.23651293118392, 6.081750773481154)
69;Trams141;14;21;6676;(46.20968635304554, 6.13851231258912)
70;Trams148;14;10;6678;(46.23050706038271, 6.081178429003463)
71;Trams142;14;19;6679;(46.21326655114928, 6.130478193228091)
72;Trams141;14;4;6682;(46.209619147164844, 6.1418080462799)
73;Trams143;14;17;6682;(46.2182406935082, 6.111092092025428)
74;Trams147;14;5;6685;(46.23295072525259, 6.077983956126664)
75;Trams182;18;4;6686;(46.22892467602633, 6.071768004605402)
76;Trams146;14;3;6688;(46.23651293118392, 6.081750773481154)
77;Trams183;18;8;6690;(46.22875340025039, 6.0722781370443135)
78;Trams147;14;6;6693;(46.23050706038271, 6.081178429003463)
79;Trams185;18;14;6694;(46.211576564029954, 6.134066195471819)
80;Trams142;14;18;6694;(46.20968635304554, 6.13851231258912)
81;Trams143;14;20;6694;(46.21623985899967, 6.1184805828468845)
82;Trams142;14;16;6695;(46.20943933268883, 6.13908447762999)
83;Trams184;18;9;6700;(46.21959258599202, 6.105855945721585)
84;Trams142;14;5;6700;(46.209619147164844, 6.1418080462799)
85;Trams146;14;4;6700;(46.23295072525259, 6.077983956126664)
86;Trams142;14;4;6701;(46.209619147164844, 6.1418080462799)
87;Trams143;14;21;6705;(46.214945898309566, 6.125408578114381)
88;Trams149;14;11;6707;(46.21959258599202, 6.105855945721585)
89;Trams185;18;5;6708;(46.209619147164844, 6.1418080462799)
90;Trams184;18;13;6709;(46.2182406935082, 6.111092092025428)
91;Trams185;18;4;6709;(46.209619147164844, 6.1418080462799)
92;Trams184;18;16;6721;(46.21623985899967, 6.1184805828468845)
93;Trams144;14;5;6724;(46.23653687185267, 6.08172148442815)
94;Trams143;14;20;6730;(46.20943933268883, 6.13908447762999)
95;Trams183;18;7;6732;(46.2217295649517, 6.0981675584657875)
96;Trams143;14;9;6735;(46.209619147164844, 6.1418080462799)
97;Trams144;14;7;6735;(46.23295072525259, 6.077983956126664)
98;Trams143;14;6;6736;(46.209619147164844, 6.1418080462799)
99;Trams148;14;11;6736;(46.2182406935082, 6.111092092025428)
100;Trams141;14;5;6738;(46.218563912516935, 6.11024684749853)
101;Trams184;18;15;6741;(46.21326655114928, 6.130478193228091)
102;Trams147;14;5;6741;(46.21964321390066, 6.105669972291958)
103;Trams144;14;9;6743;(46.23050706038271, 6.081178429003463)
104;Trams182;18;5;6745;(46.22875340025039, 6.0722781370443135)
105;Trams184;18;14;6748;(46.211576564029954, 6.134066195471819)
106;Trams148;14;10;6749;(46.21611750965686, 6.119130967851263)
107;Trams147;14;7;6751;(46.2182406935082, 6.111092092025428)
108;Trams182;18;6;6755;(46.227049832271845, 6.078516021202702)
109;Trams184;18;13;6756;(46.20968635304554, 6.13851231258912)
110;Trams184;18;3;6762;(46.209619147164844, 6.1418080462799)
111;Trams184;18;2;6763;(46.209619147164844, 6.1418080462799)
112;Trams183;18;8;6766;(46.21623985899967, 6.1184805828468845)
113;Trams146;14;5;6766;(46.2182406935082, 6.111092092025428)
114;Trams183;18;7;6767;(46.21611750965686, 6.119130967851263)
115;Trams149;14;3;6769;(46.209619147164844, 6.1418080462799)
116;Trams147;14;8;6774;(46.214945898309566, 6.125408578114381)
117;Trams144;14;10;6778;(46.221882977508976, 6.097531092195339)
118;Trams145;14;4;6781;(46.2182406935082, 6.111092092025428)
119;Trams147;14;7;6782;(46.21337382227839, 6.130257285731093)
120;Trams148;14;9;6784;(46.20943933268883, 6.13908447762999)
121;Trams148;14;5;6789;(46.209619147164844, 6.1418080462799)
122;Trams147;14;6;6790;(46.211576564029954, 6.134066195471819)
123;Trams145;14;5;6793;(46.21623985899967, 6.1184805828468845)
124;Trams145;14;4;6794;(46.21611750965686, 6.119130967851263)
125;Trams141;14;4;6796;(46.23126059862631, 6.080326773117102)
126;Trams182;18;7;6800;(46.21959258599202, 6.105855945721585)
127;Trams147;14;1;6804;(46.209619147164844, 6.1418080462799)
128;Trams183;18;1;6807;(46.209619147164844, 6.1418080462799)
129;Trams141;14;8;6813;(46.23651293118392, 6.081750773481154)
130;Trams181;18;5;6814;(46.22875340025039, 6.0722781370443135)
131;Trams141;14;9;6814;(46.23653687185267, 6.08172148442815)
132;Trams184;18;4;6818;(46.218563912516935, 6.11024684749853)
133;Trams146;14;2;6819;(46.209619147164844, 6.1418080462799)
134;Trams181;18;7;6824;(46.227049832271845, 6.078516021202702)
135;Trams141;14;13;6825;(46.23295072525259, 6.077983956126664)
136;Trams184;18;5;6826;(46.21986421490718, 6.105204240236039)
137;Trams142;14;5;6831;(46.23651293118392, 6.081750773481154)
138;Trams182;18;8;6832;(46.214945898309566, 6.125408578114381)
139;Trams181;18;6;6833;(46.22560056832065, 6.083841398797564)
140;Trams141;14;20;6833;(46.23050706038271, 6.081178429003463)
141;Trams145;14;3;6834;(46.209619147164844, 6.1418080462799)
142;Trams145;14;2;6835;(46.209619147164844, 6.1418080462799)
143;Trams182;18;7;6840;(46.21337382227839, 6.130257285731093)
144;Trams142;14;6;6843;(46.23295072525259, 6.077983956126664)
145;Trams185;18;3;6846;(46.232199996112904, 6.060063485647696)
146;Trams142;14;7;6851;(46.23050706038271, 6.081178429003463)
147;Trams144;14;1;6854;(46.209619147164844, 6.1418080462799)
148;Trams181;18;5;6855;(46.221882977508976, 6.097531092195339)
149;Trams182;18;5;6857;(46.20943933268883, 6.13908447762999)
150;Trams182;18;4;6862;(46.209619147164844, 6.1418080462799)
151;Trams184;18;4;6862;(46.225833392644, 6.083285732983272)
152;Trams142;14;6;6865;(46.22544879047648, 6.0844786795063195)
153;Trams185;18;4;6866;(46.232058584382386, 6.0604319665284745)
154;Trams181;18;10;6869;(46.21959258599202, 6.105855945721585)
155;Trams181;18;13;6878;(46.2182406935082, 6.111092092025428)
156;Trams143;14;14;6878;(46.23295072525259, 6.077983956126664)
157;Trams184;18;3;6881;(46.22892467602633, 6.071768004605402)
158;Trams184;18;2;6882;(46.229129091577946, 6.071164369673746)
159;Trams141;14;21;6882;(46.21959258599202, 6.105855945721585)
160;Trams185;18;8;6886;(46.22875340025039, 6.0722781370443135)
161;Trams142;14;7;6886;(46.221882977508976, 6.097531092195339)
162;Trams143;14;20;6886;(46.23050706038271, 6.081178429003463)
163;Trams181;18;16;6890;(46.21623985899967, 6.1184805828468845)
164;Trams141;14;24;6891;(46.2182406935082, 6.111092092025428)
165;Trams185;18;7;6897;(46.22688308551653, 6.079145733581658)
166;Trams142;14;10;6900;(46.21959258599202, 6.105855945721585)
167;Trams143;14;19;6900;(46.22544879047648, 6.0844786795063195)
168;Trams149;14;13;6900;(46.23651293118392, 6.081750773481154)
169;Trams181;18;17;6901;(46.214945898309566, 6.125408578114381)
170;Trams142;14;14;6909;(46.2182406935082, 6.111092092025428)
171;Trams181;18;16;6910;(46.21326655114928, 6.130478193228091)
172;Trams149;14;19;6912;(46.23295072525259, 6.077983956126664)
173;Trams181;18;15;6917;(46.211576564029954, 6.134066195471819)
174;Trams148;14;8;6920;(46.23651293118392, 6.081750773481154)
175;Trams149;14;22;6920;(46.23050706038271, 6.081178429003463)
176;Trams142;14;16;6921;(46.21623985899967, 6.1184805828468845)
177;Trams141;14;22;6923;(46.21326655114928, 6.130478193228091)
178;Trams141;14;20;6929;(46.211686551926505, 6.133818859227282)
179;Trams181;18;1;6931;(46.209619147164844, 6.1418080462799)
180;Trams184;18;5;6932;(46.23009144236577, 6.0674901771201615)
181;Trams142;14;18;6932;(46.214945898309566, 6.125408578114381)
182;Trams148;14;11;6932;(46.23295072525259, 6.077983956126664)
183;Trams143;14;24;6935;(46.21959258599202, 6.105855945721585)
184;Trams147;14;4;6935;(46.23651293118392, 6.081750773481154)
185;Trams1410;14;1;6935;(46.21959258599202, 6.105855945721585)
186;Trams184;18;8;6940;(46.22875340025039, 6.0722781370443135)
187;Trams146;14;1;6940;(46.233663217488996, 6.077579081696816)
188;Trams148;14;14;6940;(46.23050706038271, 6.081178429003463)
189;Trams141;14;5;6944;(46.209619147164844, 6.1418080462799)
190;Trams1410;14;7;6944;(46.2182406935082, 6.111092092025428)
191;Trams141;14;4;6945;(46.209619147164844, 6.1418080462799)
192;Trams142;14;17;6947;(46.211686551926505, 6.133818859227282)
193;Trams147;14;7;6947;(46.23295072525259, 6.077983956126664)
194;Trams142;14;18;6948;(46.211576564029954, 6.134066195471819)
195;Trams184;18;13;6950;(46.227049832271845, 6.078516021202702)
196;Trams185;18;10;6950;(46.2182406935082, 6.111092092025428)
197;Trams146;14;3;6950;(46.23651293118392, 6.081750773481154)
198;Trams148;14;15;6953;(46.22560056832065, 6.083841398797564)
199;Trams147;14;8;6955;(46.23050706038271, 6.081178429003463)
200;Trams149;14;23;6955;(46.221882977508976, 6.097531092195339)
201;Trams1410;14;8;6956;(46.21623985899967, 6.1184805828468845)
202;Trams142;14;4;6962;(46.209619147164844, 6.1418080462799)
203;Trams146;14;7;6962;(46.23295072525259, 6.077983956126664)
204;Trams145;14;8;6965;(46.23651293118392, 6.081750773481154)
205;Trams1410;14;11;6967;(46.214945898309566, 6.125408578114381)
206;Trams149;14;24;6969;(46.21959258599202, 6.105855945721585)
207;Trams146;14;8;6970;(46.23050706038271, 6.081178429003463)
208;Trams182;18;5;6971;(46.22725061595765, 6.078016845858288)
209;Trams185;18;12;6973;(46.214945898309566, 6.125408578114381)
210;Trams145;14;9;6977;(46.23295072525259, 6.077983956126664)
211;Trams183;18;3;6985;(46.22875340025039, 6.0722781370443135)
212;Trams144;14;5;6985;(46.23651293118392, 6.081750773481154)
213;Trams145;14;12;6985;(46.23050706038271, 6.081178429003463)
214;Trams181;18;2;6987;(46.218563912516935, 6.11024684749853)
215;Trams185;18;11;6988;(46.211686551926505, 6.133818859227282)
216;Trams148;14;20;6989;(46.21959258599202, 6.105855945721585)
217;Trams182;18;4;6990;(46.23045492329748, 6.066316836293175)
218;Trams1410;14;10;6991;(46.20968635304554, 6.13851231258912)
219;Trams143;14;23;6992;(46.20943933268883, 6.13908447762999)
220;Trams181;18;3;6995;(46.21986421490718, 6.105204240236039)
221;Trams183;18;7;6995;(46.227049832271845, 6.078516021202702)
222;Trams184;18;14;6995;(46.21959258599202, 6.105855945721585)
223;Trams143;14;3;6997;(46.209619147164844, 6.1418080462799)
224;Trams144;14;6;6997;(46.23295072525259, 6.077983956126664)
225;Trams1410;14;0;6997;(46.209619147164844, 6.1418080462799)
226;Trams148;14;24;6998;(46.2182406935082, 6.111092092025428)
227;Trams185;18;3;7003;(46.209619147164844, 6.1418080462799)
228;Trams184;18;18;7004;(46.2182406935082, 6.111092092025428)
229;Trams185;18;1;7004;(46.209619147164844, 6.1418080462799)
230;Trams147;14;10;7004;(46.21959258599202, 6.105855945721585)
231;Trams144;14;11;7005;(46.23050706038271, 6.081178429003463)
232;Trams147;14;11;7013;(46.2182406935082, 6.111092092025428)
233;Trams184;18;22;7016;(46.21623985899967, 6.1184805828468845)
234;Trams146;14;7;7018;(46.21964321390066, 6.105669972291958)
235;Trams145;14;13;7020;(46.221882977508976, 6.097531092195339)
236;Trams147;14;13;7025;(46.21623985899967, 6.1184805828468845)
237;Trams149;14;23;7025;(46.20968635304554, 6.13851231258912)
238;Trams142;14;5;7026;(46.21986421490718, 6.105204240236039)
239;Trams184;18;23;7027;(46.214945898309566, 6.125408578114381)
240;Trams148;14;23;7030;(46.21326655114928, 6.130478193228091)
241;Trams149;14;0;7031;(46.209619147164844, 6.1418080462799)
242;Trams181;18;1;7032;(46.225959506549515, 6.082637237040163)
243;Trams182;18;5;7032;(46.23009144236577, 6.0674901771201615)
244;Trams145;14;14;7034;(46.21959258599202, 6.105855945721585)
245;Trams147;14;14;7036;(46.214945898309566, 6.125408578114381)
246;Trams182;18;11;7040;(46.22875340025039, 6.0722781370443135)
247;Trams183;18;8;7040;(46.21959258599202, 6.105855945721585)
248;Trams145;14;15;7043;(46.2182406935082, 6.111092092025428)
249;Trams182;18;16;7050;(46.227049832271845, 6.078516021202702)
250;Trams148;14;7;7051;(46.209619147164844, 6.1418080462799)
251;Trams148;14;4;7052;(46.209619147164844, 6.1418080462799)
252;Trams184;18;2;7057;(46.209619147164844, 6.1418080462799)
253;Trams184;18;1;7058;(46.209619147164844, 6.1418080462799)
254;Trams144;14;10;7062;(46.21829243542764, 6.110901561090927)
255;Trams144;14;11;7063;(46.2182406935082, 6.111092092025428)
256;Trams147;14;1;7066;(46.209619147164844, 6.1418080462799)
257;Trams185;18;2;7067;(46.21986421490718, 6.105204240236039)
258;Trams141;14;11;7075;(46.23651293118392, 6.081750773481154)
259;Trams144;14;12;7075;(46.21623985899967, 6.1184805828468845)
260;Trams182;18;17;7081;(46.221882977508976, 6.097531092195339)
261;Trams146;14;1;7081;(46.209619147164844, 6.1418080462799)
262;Trams146;14;0;7082;(46.209619147164844, 6.1418080462799)
263;Trams142;14;4;7083;(46.233663217488996, 6.077579081696816)
264;Trams144;14;13;7086;(46.214945898309566, 6.125408578114381)
265;Trams141;14;24;7087;(46.23295072525259, 6.077983956126664)
266;Trams183;18;7;7088;(46.211576564029954, 6.134066195471819)
267;Trams142;14;7;7093;(46.23651293118392, 6.081750773481154)
268;Trams144;14;12;7094;(46.21337382227839, 6.130257285731093)
269;Trams182;18;24;7095;(46.21959258599202, 6.105855945721585)
270;Trams145;14;0;7096;(46.209619147164844, 6.1418080462799)
271;Trams181;18;2;7101;(46.23009144236577, 6.0674901771201615)
272;Trams183;18;1;7102;(46.209619147164844, 6.1418080462799)
273;Trams182;18;23;7103;(46.21829243542764, 6.110901561090927)
274;Trams182;18;24;7104;(46.2182406935082, 6.111092092025428)
275;Trams142;14;13;7105;(46.23295072525259, 6.077983956126664)
276;Trams141;14;23;7108;(46.22560056832065, 6.083841398797564)
277;Trams181;18;7;7109;(46.22875340025039, 6.0722781370443135)
278;Trams141;14;22;7109;(46.22544879047648, 6.0844786795063195)
279;Trams142;14;24;7113;(46.23050706038271, 6.081178429003463)
280;Trams146;14;1;7113;(46.21506553265199, 6.124967309087373)
281;Trams1411;14;4;7113;(46.23050706038271, 6.081178429003463)
282;Trams144;14;1;7116;(46.209619147164844, 6.1418080462799)
283;Trams181;18;9;7119;(46.227049832271845, 6.078516021202702)
284;Trams143;14;6;7128;(46.23651293118392, 6.081750773481154)
285;Trams141;14;23;7130;(46.221882977508976, 6.097531092195339)
286;Trams182;18;22;7135;(46.21337382227839, 6.130257285731093)
287;Trams143;14;10;7140;(46.23295072525259, 6.077983956126664)
288;Trams185;18;1;7141;(46.232199996112904, 6.060063485647696)
289;Trams182;18;21;7142;(46.211686551926505, 6.133818859227282)
290;Trams185;18;2;7142;(46.23221759604077, 6.060000006892894)
291;Trams141;14;24;7144;(46.21959258599202, 6.105855945721585)
292;Trams143;14;14;7148;(46.23050706038271, 6.081178429003463)
293;Trams182;18;20;7152;(46.20943933268883, 6.13908447762999)
294;Trams182;18;4;7157;(46.209619147164844, 6.1418080462799)
295;Trams182;18;3;7158;(46.209619147164844, 6.1418080462799)
296;Trams146;14;0;7158;(46.22210496740385, 6.097060802216698)
297;Trams149;14;6;7162;(46.23651293118392, 6.081750773481154)
298;Trams1411;14;14;7162;(46.21959258599202, 6.105855945721585)
299;Trams184;18;2;7166;(46.22725061595765, 6.078016845858288)
300;Trams1411;14;24;7171;(46.2182406935082, 6.111092092025428)
301;Trams181;18;21;7173;(46.2182406935082, 6.111092092025428)
302;Trams185;18;5;7173;(46.23009144236577, 6.0674901771201615)
303;Trams149;14;14;7174;(46.23295072525259, 6.077983956126664)
304;Trams144;14;2;7180;(46.21986421490718, 6.105204240236039)
305;Trams185;18;12;7181;(46.22875340025039, 6.0722781370443135)
306;Trams148;14;8;7182;(46.23651293118392, 6.081750773481154)
307;Trams149;14;24;7182;(46.23050706038271, 6.081178429003463)
308;Trams181;18;24;7185;(46.21623985899967, 6.1184805828468845)
309;Trams185;18;16;7191;(46.227049832271845, 6.078516021202702)
310;Trams148;14;13;7194;(46.23295072525259, 6.077983956126664)
311;Trams184;18;1;7196;(46.23221759604077, 6.060000006892894)
312;Trams143;14;17;7197;(46.21959258599202, 6.105855945721585)
313;Trams147;14;4;7197;(46.23651293118392, 6.081750773481154)
314;Trams147;14;5;7198;(46.23653687185267, 6.08172148442815)
315;Trams185;18;15;7200;(46.22560056832065, 6.083841398797564)
316;Trams141;14;23;7200;(46.20968635304554, 6.13851231258912)
317;Trams182;18;4;7201;(46.21651716889963, 6.117756532803255)
318;Trams141;14;22;7201;(46.20943933268883, 6.13908447762999)
319;Trams148;14;14;7202;(46.23050706038271, 6.081178429003463)
320;Trams1411;14;23;7203;(46.21326655114928, 6.130478193228091)
321;Trams181;18;23;7204;(46.21337382227839, 6.130257285731093)
322;Trams181;18;22;7205;(46.21326655114928, 6.130478193228091)
323;Trams141;14;2;7206;(46.209619147164844, 6.1418080462799)
324;Trams143;14;23;7206;(46.2182406935082, 6.111092092025428)
325;Trams147;14;7;7209;(46.23295072525259, 6.077983956126664)
326;Trams1411;14;22;7209;(46.211686551926505, 6.133818859227282)
327;Trams146;14;2;7212;(46.23651293118392, 6.081750773481154)
328;Trams182;18;5;7213;(46.218563912516935, 6.11024684749853)
329;Trams144;14;1;7216;(46.225833392644, 6.083285732983272)
330;Trams147;14;9;7217;(46.23050706038271, 6.081178429003463)
331;Trams142;14;23;7218;(46.20968635304554, 6.13851231258912)
332;Trams143;14;24;7218;(46.21623985899967, 6.1184805828468845)
333;Trams1410;14;8;7218;(46.21623985899967, 6.1184805828468845)
334;Trams1411;14;21;7218;(46.20968635304554, 6.13851231258912)
335;Trams1411;14;19;7219;(46.20943933268883, 6.13908447762999)
336;Trams181;18;23;7220;(46.20968635304554, 6.13851231258912)
337;Trams181;18;21;7221;(46.20943933268883, 6.13908447762999)
338;Trams142;14;5;7224;(46.209619147164844, 6.1418080462799)
339;Trams146;14;5;7224;(46.23295072525259, 6.077983956126664)
340;Trams1411;14;1;7224;(46.209619147164844, 6.1418080462799)
341;Trams142;14;3;7225;(46.209619147164844, 6.1418080462799)
342;Trams1411;14;0;7225;(46.209619147164844, 6.1418080462799)
343;Trams181;18;4;7226;(46.209619147164844, 6.1418080462799)
344;Trams181;18;2;7227;(46.209619147164844, 6.1418080462799)
345;Trams184;18;2;7227;(46.23009144236577, 6.0674901771201615)
346;Trams145;14;2;7227;(46.23651293118392, 6.081750773481154)
347;Trams145;14;3;7228;(46.23653687185267, 6.08172148442815)
348;Trams1410;14;13;7229;(46.214945898309566, 6.125408578114381)
349;Trams146;14;6;7232;(46.23050706038271, 6.081178429003463)
350;Trams184;18;5;7235;(46.22875340025039, 6.0722781370443135)
351;Trams185;18;21;7236;(46.21959258599202, 6.105855945721585)
352;Trams141;14;3;7238;(46.21506553265199, 6.124967309087373)
353;Trams145;14;5;7239;(46.23295072525259, 6.077983956126664)
354;Trams184;18;7;7245;(46.227049832271845, 6.078516021202702)
355;Trams185;18;24;7245;(46.2182406935082, 6.111092092025428)
356;Trams145;14;7;7247;(46.23050706038271, 6.081178429003463)
357;Trams182;18;4;7258;(46.225959506549515, 6.082637237040163)
358;Trams143;14;1;7259;(46.209619147164844, 6.1418080462799)
359;Trams144;14;2;7259;(46.23295072525259, 6.077983956126664)
360;Trams1410;14;2;7259;(46.209619147164844, 6.1418080462799)
361;Trams148;14;18;7260;(46.2182406935082, 6.111092092025428)
362;Trams1410;14;1;7260;(46.209619147164844, 6.1418080462799)
363;Trams147;14;10;7266;(46.21959258599202, 6.105855945721585)
364;Trams144;14;3;7267;(46.23050706038271, 6.081178429003463)
365;Trams146;14;7;7267;(46.221882977508976, 6.097531092195339)
366;Trams185;18;23;7269;(46.21482459601139, 6.126059366346893)
367;Trams148;14;20;7272;(46.21623985899967, 6.1184805828468845)
368;Trams149;14;23;7279;(46.211576564029954, 6.134066195471819)
369;Trams181;18;3;7282;(46.218563912516935, 6.11024684749853)
370;Trams149;14;22;7287;(46.20968635304554, 6.13851231258912)
371;Trams149;14;21;7288;(46.20943933268883, 6.13908447762999)
372;Trams183;18;2;7290;(46.227049832271845, 6.078516021202702)
373;Trams184;18;10;7290;(46.21959258599202, 6.105855945721585)
374;Trams146;14;9;7290;(46.2182406935082, 6.111092092025428)
375;Trams185;18;21;7292;(46.20968635304554, 6.13851231258912)
376;Trams185;18;20;7293;(46.20943933268883, 6.13908447762999)
377;Trams149;14;5;7293;(46.209619147164844, 6.1418080462799)
378;Trams149;14;0;7294;(46.209619147164844, 6.1418080462799)
379;Trams182;18;3;7296;(46.23221759604077, 6.060000006892894)
380;Trams185;18;1;7298;(46.209619147164844, 6.1418080462799)
381;Trams147;14;11;7298;(46.214945898309566, 6.125408578114381)
382;Trams146;14;10;7302;(46.21623985899967, 6.1184805828468845)
383;Trams145;14;8;7305;(46.2182406935082, 6.111092092025428)
384;Trams141;14;2;7306;(46.225833392644, 6.083285732983272)
385;Trams146;14;11;7313;(46.214945898309566, 6.125408578114381)
386;Trams148;14;5;7313;(46.209619147164844, 6.1418080462799)
387;Trams148;14;4;7314;(46.209619147164844, 6.1418080462799)
388;Trams144;14;5;7316;(46.21959258599202, 6.105855945721585)
389;Trams146;14;10;7321;(46.21337382227839, 6.130257285731093)
390;Trams147;14;10;7322;(46.20968635304554, 6.13851231258912)
391;Trams143;14;2;7323;(46.21986421490718, 6.105204240236039)
392;Trams144;14;6;7325;(46.2182406935082, 6.111092092025428)
393;Trams182;18;6;7327;(46.23009144236577, 6.0674901771201615)
394;Trams147;14;1;7328;(46.209619147164844, 6.1418080462799)
395;Trams147;14;0;7329;(46.209619147164844, 6.1418080462799)
396;Trams185;18;2;7330;(46.21506553265199, 6.124967309087373)
397;Trams184;18;9;7331;(46.21326655114928, 6.130478193228091)
398;Trams181;18;2;7335;(46.22725061595765, 6.078016845858288)
399;Trams182;18;8;7335;(46.22875340025039, 6.0722781370443135)
400;Trams183;18;3;7335;(46.21959258599202, 6.105855945721585)
401;Trams141;14;14;7337;(46.23651293118392, 6.081750773481154)
402;Trams144;14;7;7337;(46.21623985899967, 6.1184805828468845)
403;Trams146;14;9;7338;(46.20943933268883, 6.13908447762999)
404;Trams185;18;3;7342;(46.21651716889963, 6.117756532803255)
405;Trams146;14;0;7343;(46.209619147164844, 6.1418080462799)
406;Trams183;18;4;7344;(46.2182406935082, 6.111092092025428)
407;Trams182;18;10;7345;(46.227049832271845, 6.078516021202702)
408;Trams141;14;24;7349;(46.23295072525259, 6.077983956126664)
409;Trams184;18;2;7352;(46.209619147164844, 6.1418080462799)
410;Trams184;18;1;7353;(46.209619147164844, 6.1418080462799)
411;Trams145;14;7;7353;(46.20943933268883, 6.13908447762999)
412;Trams182;18;9;7354;(46.22560056832065, 6.083841398797564)
413;Trams142;14;4;7355;(46.23651293118392, 6.081750773481154)
414;Trams183;18;5;7356;(46.21623985899967, 6.1184805828468845)
415;Trams148;14;5;7357;(46.21651716889963, 6.117756532803255)
416;Trams145;14;1;7358;(46.209619147164844, 6.1418080462799)
417;Trams145;14;0;7359;(46.209619147164844, 6.1418080462799)
418;Trams185;18;4;7362;(46.21986421490718, 6.105204240236039)
419;Trams142;14;14;7367;(46.23295072525259, 6.077983956126664)
420;Trams144;14;5;7372;(46.20968635304554, 6.13851231258912)
421;Trams144;14;4;7373;(46.20943933268883, 6.13908447762999)
422;Trams181;18;3;7374;(46.233563482052425, 6.055252143299553)
423;Trams142;14;22;7375;(46.23050706038271, 6.081178429003463)
424;Trams144;14;1;7378;(46.209619147164844, 6.1418080462799)
425;Trams143;14;1;7379;(46.23326160820353, 6.07761114905184)
426;Trams144;14;0;7379;(46.209619147164844, 6.1418080462799)
427;Trams147;14;1;7384;(46.218563912516935, 6.11024684749853)
428;Trams182;18;14;7390;(46.21959258599202, 6.105855945721585)
429;Trams143;14;3;7390;(46.23651293118392, 6.081750773481154)
430;Trams141;14;23;7392;(46.221882977508976, 6.097531092195339)
431;Trams183;18;1;7397;(46.209619147164844, 6.1418080462799)
432;Trams183;18;0;7398;(46.209619147164844, 6.1418080462799)
433;Trams182;18;18;7399;(46.2182406935082, 6.111092092025428)
434;Trams143;14;7;7402;(46.23295072525259, 6.077983956126664)
435;Trams181;18;7;7404;(46.22875340025039, 6.0722781370443135)
436;Trams141;14;24;7406;(46.21959258599202, 6.105855945721585)
437;Trams184;18;2;7408;(46.218563912516935, 6.11024684749853)
438;Trams143;14;10;7410;(46.23050706038271, 6.081178429003463)
439;Trams182;18;21;7411;(46.21623985899967, 6.1184805828468845)
440;Trams148;14;4;7413;(46.225833392644, 6.083285732983272)
441;Trams181;18;8;7414;(46.227049832271845, 6.078516021202702)
442;Trams184;18;3;7416;(46.21986421490718, 6.105204240236039)
443;Trams185;18;3;7418;(46.229129091577946, 6.071164369673746)
444;Trams181;18;9;7423;(46.22560056832065, 6.083841398797564)
445;Trams182;18;20;7423;(46.21482459601139, 6.126059366346893)
446;Trams142;14;24;7424;(46.21959258599202, 6.105855945721585)
447;Trams1411;14;1;7424;(46.21959258599202, 6.105855945721585)
448;Trams141;14;22;7427;(46.21623985899967, 6.1184805828468845)
449;Trams147;14;0;7428;(46.225833392644, 6.083285732983272)
450;Trams1411;14;3;7433;(46.2182406935082, 6.111092092025428)
451;Trams149;14;2;7436;(46.23295072525259, 6.077983956126664)
452;Trams141;14;21;7439;(46.21482459601139, 6.126059366346893)
453;Trams149;14;5;7444;(46.23050706038271, 6.081178429003463)
454;Trams181;18;8;7446;(46.2217295649517, 6.0981675584657875)
455;Trams185;18;1;7446;(46.233563482052425, 6.055252143299553)
456;Trams141;14;20;7446;(46.21337382227839, 6.130257285731093)
457;Trams182;18;19;7447;(46.20943933268883, 6.13908447762999)
458;Trams182;18;7;7452;(46.209619147164844, 6.1418080462799)
459;Trams182;18;3;7453;(46.209619147164844, 6.1418080462799)
460;Trams183;18;1;7453;(46.218563912516935, 6.11024684749853)
461;Trams141;14;19;7453;(46.211686551926505, 6.133818859227282)
462;Trams148;14;6;7456;(46.23295072525259, 6.077983956126664)
463;Trams143;14;9;7458;(46.21964321390066, 6.105669972291958)
464;Trams141;14;18;7463;(46.20943933268883, 6.13908447762999)
465;Trams181;18;9;7468;(46.2182406935082, 6.111092092025428)
466;Trams141;14;4;7468;(46.209619147164844, 6.1418080462799)
467;Trams141;14;2;7469;(46.209619147164844, 6.1418080462799)
468;Trams147;14;1;7471;(46.23295072525259, 6.077983956126664)
469;Trams184;18;2;7472;(46.229129091577946, 6.071164369673746)
470;Trams142;14;23;7472;(46.211576564029954, 6.134066195471819)
471;Trams146;14;2;7474;(46.23651293118392, 6.081750773481154)
472;Trams185;18;4;7476;(46.22875340025039, 6.0722781370443135)
473;Trams181;18;13;7480;(46.21623985899967, 6.1184805828468845)
474;Trams142;14;21;7480;(46.20968635304554, 6.13851231258912)
475;Trams142;14;20;7481;(46.20943933268883, 6.13908447762999)
476;Trams142;14;2;7486;(46.209619147164844, 6.1418080462799)
477;Trams146;14;3;7486;(46.23295072525259, 6.077983956126664)
478;Trams1411;14;0;7486;(46.209619147164844, 6.1418080462799)
479;Trams145;14;2;7489;(46.23651293118392, 6.081750773481154)
480;Trams184;18;1;7490;(46.232199996112904, 6.060063485647696)
481;Trams149;14;6;7493;(46.21959258599202, 6.105855945721585)
482;Trams146;14;4;7494;(46.23050706038271, 6.081178429003463)
483;Trams181;18;12;7500;(46.21326655114928, 6.130478193228091)
484;Trams184;18;2;7510;(46.232058584382386, 6.0604319665284745)
485;Trams148;14;11;7513;(46.21959258599202, 6.105855945721585)
486;Trams181;18;11;7515;(46.20968635304554, 6.13851231258912)
487;Trams181;18;10;7516;(46.20943933268883, 6.13908447762999)
488;Trams183;18;2;7516;(46.22892467602633, 6.071768004605402)
489;Trams143;14;7;7516;(46.20943933268883, 6.13908447762999)
490;Trams181;18;3;7521;(46.209619147164844, 6.1418080462799)
491;Trams143;14;1;7521;(46.209619147164844, 6.1418080462799)
492;Trams144;14;2;7521;(46.23295072525259, 6.077983956126664)
493;Trams181;18;2;7522;(46.209619147164844, 6.1418080462799)
494;Trams184;18;3;7522;(46.23009144236577, 6.0674901771201615)
495;Trams148;14;13;7522;(46.2182406935082, 6.111092092025428)
496;Trams145;14;1;7523;(46.22544879047648, 6.0844786795063195)
497;Trams144;14;4;7529;(46.23050706038271, 6.081178429003463)
498;Trams146;14;5;7529;(46.221882977508976, 6.097531092195339)
499;Trams184;18;5;7530;(46.22875340025039, 6.0722781370443135)
500;Trams148;14;14;7534;(46.21623985899967, 6.1184805828468845)
501;Trams147;14;2;7537;(46.2182406935082, 6.111092092025428)
502;Trams184;18;6;7540;(46.227049832271845, 6.078516021202702)
503;Trams184;18;5;7541;(46.22688308551653, 6.079145733581658)
504;Trams142;14;3;7542;(46.218563912516935, 6.11024684749853)
505;Trams146;14;7;7543;(46.21959258599202, 6.105855945721585)
506;Trams183;18;1;7545;(46.233563482052425, 6.055252143299553)
507;Trams148;14;15;7545;(46.214945898309566, 6.125408578114381)
508;Trams149;14;8;7549;(46.20968635304554, 6.13851231258912)
509;Trams185;18;6;7552;(46.21623985899967, 6.1184805828468845)
510;Trams146;14;11;7552;(46.2182406935082, 6.111092092025428)
511;Trams181;18;3;7553;(46.21506553265199, 6.124967309087373)
512;Trams148;14;14;7554;(46.21326655114928, 6.130478193228091)
513;Trams149;14;3;7555;(46.209619147164844, 6.1418080462799)
514;Trams149;14;2;7556;(46.209619147164844, 6.1418080462799)
515;Trams142;14;2;7564;(46.222163869140346, 6.096846229088542)
516;Trams181;18;4;7565;(46.21651716889963, 6.117756532803255)
517;Trams183;18;2;7567;(46.23009144236577, 6.0674901771201615)
518;Trams148;14;13;7569;(46.20968635304554, 6.13851231258912)
519;Trams148;14;12;7570;(46.20943933268883, 6.13908447762999)
520;Trams184;18;6;7571;(46.221882977508976, 6.097531092195339)
521;Trams185;18;5;7571;(46.21337382227839, 6.130257285731093)
522;Trams148;14;6;7575;(46.209619147164844, 6.1418080462799)
523;Trams148;14;5;7576;(46.209619147164844, 6.1418080462799)
524;Trams144;14;5;7578;(46.21959258599202, 6.105855945721585)
525;Trams148;14;4;7578;(46.20992574196672, 6.140792879209467)
526;Trams181;18;5;7585;(46.21986421490718, 6.105204240236039)
527;Trams184;18;7;7585;(46.21959258599202, 6.105855945721585)
528;Trams144;14;7;7587;(46.2182406935082, 6.111092092025428)
529;Trams145;14;2;7590;(46.214945898309566, 6.125408578114381)
530;Trams147;14;0;7590;(46.209619147164844, 6.1418080462799)
531;Trams185;18;2;7593;(46.209619147164844, 6.1418080462799)
532;Trams185;18;1;7594;(46.209619147164844, 6.1418080462799)
533;Trams181;18;4;7598;(46.22210496740385, 6.097060802216698)
534;Trams141;14;7;7599;(46.23651293118392, 6.081750773481154)
535;Trams146;14;0;7605;(46.209619147164844, 6.1418080462799)
536;Trams141;14;10;7611;(46.23295072525259, 6.077983956126664)
537;Trams184;18;6;7617;(46.214945898309566, 6.125408578114381)
538;Trams141;14;16;7619;(46.23050706038271, 6.081178429003463)
539;Trams144;14;6;7619;(46.21326655114928, 6.130478193228091)
540;Trams145;14;1;7620;(46.209619147164844, 6.1418080462799)
541;Trams145;14;0;7621;(46.209619147164844, 6.1418080462799)
542;Trams182;18;4;7622;(46.23009144236577, 6.0674901771201615)
543;Trams144;14;5;7626;(46.211576564029954, 6.134066195471819)
544;Trams183;18;1;7629;(46.21964321390066, 6.105669972291958)
545;Trams182;18;5;7630;(46.22875340025039, 6.0722781370443135)
546;Trams181;18;2;7640;(46.22892467602633, 6.071768004605402)
547;Trams144;14;1;7640;(46.209619147164844, 6.1418080462799)
548;Trams184;18;4;7642;(46.20943933268883, 6.13908447762999)
549;Trams184;18;2;7647;(46.209619147164844, 6.1418080462799)
550;Trams184;18;1;7648;(46.209619147164844, 6.1418080462799)
551;Trams141;14;15;7709;(46.21326655114928, 6.130478193228091)
552;Trams141;14;14;7715;(46.211686551926505, 6.133818859227282)
553;Trams141;14;13;7725;(46.20943933268883, 6.13908447762999)
554;Trams141;14;2;7730;(46.209619147164844, 6.1418080462799)
555;Trams182;18;4;7741;(46.20968635304554, 6.13851231258912)
556;Trams142;14;3;7742;(46.20968635304554, 6.13851231258912)
557;Trams182;18;3;7747;(46.209619147164844, 6.1418080462799)
558;Trams143;14;0;7783;(46.209619147164844, 6.1418080462799)
559;Trams143;14;9;10142;(46.209619147164844, 6.1418080462799)
560;Trams142;14;4;10150;(46.21651716889963, 6.117756532803255)
561;Trams143;14;11;10150;(46.21001858728912, 6.137845020249269)
562;Trams183;18;3;10152;(46.225833392644, 6.083285732983272)
563;Trams141;14;4;10152;(46.21986421490718, 6.105204240236039)
564;Trams184;18;2;10157;(46.23331533297464, 6.055999916916414)
565;Trams145;14;1;10164;(46.221882977508976, 6.097531092195339)
566;Trams184;18;3;10165;(46.232058584382386, 6.0604319665284745)
567;Trams143;14;12;10165;(46.21360610540597, 6.129871458171416)
568;Trams183;18;2;10172;(46.229129091577946, 6.071164369673746)
569;Trams143;14;11;10174;(46.215189369790004, 6.124317509329907)
570;Trams149;14;14;10176;(46.209619147164844, 6.1418080462799)
571;Trams181;18;6;10177;(46.209619147164844, 6.1418080462799)
572;Trams145;14;2;10178;(46.21959258599202, 6.105855945721585)
573;Trams142;14;5;10184;(46.222163869140346, 6.096846229088542)
574;Trams149;14;16;10184;(46.21001858728912, 6.137845020249269)
575;Trams182;18;5;10185;(46.222163869140346, 6.096846229088542)
576;Trams141;14;5;10188;(46.225833392644, 6.083285732983272)
577;Trams183;18;1;10190;(46.232199996112904, 6.060063485647696)
578;Trams181;18;7;10193;(46.211920451819665, 6.133385791795223)
579;Trams184;18;4;10195;(46.227049832271845, 6.078516021202702)
580;Trams148;14;9;10196;(46.209619147164844, 6.1418080462799)
581;Trams145;14;1;10199;(46.21623985899967, 6.1184805828468845)
582;Trams149;14;17;10199;(46.21360610540597, 6.129871458171416)
583;Trams181;18;8;10200;(46.21360610540597, 6.129871458171416)
584;Trams145;14;0;10200;(46.21611750965686, 6.119130967851263)
585;Trams184;18;5;10204;(46.22560056832065, 6.083841398797564)
586;Trams148;14;10;10204;(46.21001858728912, 6.137845020249269)
587;Trams143;14;9;10205;(46.21986421490718, 6.105204240236039)
588;Trams141;14;3;10208;(46.23326160820353, 6.07761114905184)
589;Trams141;14;2;10209;(46.233663217488996, 6.077579081696816)
590;Trams147;14;7;10211;(46.209619147164844, 6.1418080462799)
591;Trams141;14;1;10219;(46.23651293118392, 6.081750773481154)
592;Trams149;14;16;10219;(46.21651716889963, 6.117756532803255)
593;Trams182;18;4;10226;(46.22892467602633, 6.071768004605402)
594;Trams184;18;6;10226;(46.221882977508976, 6.097531092195339)
595;Trams146;14;3;10226;(46.209619147164844, 6.1418080462799)
596;Trams142;14;4;10227;(46.233663217488996, 6.077579081696816)
597;Trams183;18;2;10230;(46.22875340025039, 6.0722781370443135)
598;Trams181;18;9;10232;(46.218563912516935, 6.11024684749853)
599;Trams182;18;3;10234;(46.230281046110804, 6.0669425701125625)
600;Trams147;14;8;10234;(46.21360610540597, 6.129871458171416)
601;Trams148;14;8;10238;(46.216491364508514, 6.117851415050074)
602;Trams149;14;12;10239;(46.21986421490718, 6.105204240236039)
603;Trams184;18;5;10240;(46.21959258599202, 6.105855945721585)
604;Trams145;14;12;10241;(46.209619147164844, 6.1418080462799)
605;Trams184;18;4;10249;(46.2182406935082, 6.111092092025428)
606;Trams185;18;12;10249;(46.209619147164844, 6.1418080462799)
607;Trams145;14;13;10249;(46.21001858728912, 6.137845020249269)
608;Trams148;14;7;10252;(46.2187268199986, 6.1096151489643695)
609;Trams147;14;7;10253;(46.216491364508514, 6.117851415050074)
610;Trams143;14;5;10254;(46.2309061952839, 6.080766699467892)
611;Trams147;14;9;10254;(46.21651716889963, 6.117756532803255)
612;Trams142;14;3;10257;(46.23050706038271, 6.081178429003463)
613;Trams148;14;6;10259;(46.21986421490718, 6.105204240236039)
614;Trams143;14;4;10261;(46.23326160820353, 6.07761114905184)
615;Trams144;14;5;10261;(46.209619147164844, 6.1418080462799)
616;Trams184;18;2;10262;(46.21611750965686, 6.119130967851263)
617;Trams147;14;8;10266;(46.218563912516935, 6.11024684749853)
618;Trams146;14;2;10268;(46.216491364508514, 6.117851415050074)
619;Trams184;18;1;10272;(46.214945898309566, 6.125408578114381)
620;Trams143;14;1;10272;(46.23651293118392, 6.081750773481154)
621;Trams145;14;11;10273;(46.215189369790004, 6.124317509329907)
622;Trams147;14;7;10274;(46.21986421490718, 6.105204240236039)
623;Trams146;14;1;10282;(46.2187268199986, 6.1096151489643695)
624;Trams145;14;9;10283;(46.216491364508514, 6.117851415050074)
625;Trams181;18;6;10285;(46.22725061595765, 6.078016845858288)
626;Trams149;14;11;10288;(46.2309061952839, 6.080766699467892)
627;Trams185;18;11;10291;(46.216491364508514, 6.117851415050074)
628;Trams185;18;12;10292;(46.21651716889963, 6.117756532803255)
629;Trams181;18;5;10295;(46.22892467602633, 6.071768004605402)
630;Trams149;14;6;10295;(46.23326160820353, 6.07761114905184)
631;Trams181;18;3;10296;(46.229129091577946, 6.071164369673746)
632;Trams145;14;7;10296;(46.218563912516935, 6.11024684749853)
633;Trams145;14;6;10297;(46.2187268199986, 6.1096151489643695)
634;Trams181;18;2;10303;(46.230281046110804, 6.0669425701125625)
635;Trams184;18;17;10303;(46.209619147164844, 6.1418080462799)
636;Trams182;18;4;10304;(46.22560056832065, 6.083841398797564)
637;Trams185;18;11;10304;(46.218563912516935, 6.11024684749853)
638;Trams144;14;4;10304;(46.21651716889963, 6.117756532803255)
639;Trams185;18;10;10305;(46.2187268199986, 6.1096151489643695)
640;Trams145;14;5;10305;(46.220033895155204, 6.104576238045008)
641;Trams183;18;3;10306;(46.21623985899967, 6.1184805828468845)
642;Trams149;14;4;10306;(46.23651293118392, 6.081750773481154)
643;Trams148;14;5;10308;(46.2309061952839, 6.080766699467892)
644;Trams184;18;19;10311;(46.21001858728912, 6.137845020249269)
645;Trams185;18;9;10312;(46.21986421490718, 6.105204240236039)
646;Trams144;14;3;10316;(46.218563912516935, 6.11024684749853)
647;Trams184;18;20;10319;(46.211920451819665, 6.133385791795223)
648;Trams147;14;6;10323;(46.2309061952839, 6.080766699467892)
649;Trams184;18;21;10326;(46.21360610540597, 6.129871458171416)
650;Trams185;18;10;10326;(46.222163869140346, 6.096846229088542)
651;Trams148;14;3;10326;(46.23651293118392, 6.081750773481154)
652;Trams149;14;5;10326;(46.23050706038271, 6.081178429003463)
653;Trams147;14;5;10330;(46.23326160820353, 6.07761114905184)
654;Trams147;14;4;10331;(46.233663217488996, 6.077579081696816)
655;Trams184;18;20;10335;(46.215189369790004, 6.124317509329907)
656;Trams148;14;4;10338;(46.23295072525259, 6.077983956126664)
657;Trams182;18;3;10339;(46.21964321390066, 6.105669972291958)
658;Trams182;18;2;10340;(46.21959258599202, 6.105855945721585)
659;Trams149;14;4;10340;(46.22544879047648, 6.0844786795063195)
660;Trams147;14;1;10341;(46.23651293118392, 6.081750773481154)
661;Trams184;18;16;10345;(46.216491364508514, 6.117851415050074)
662;Trams146;14;0;10345;(46.23326160820353, 6.07761114905184)
663;Trams184;18;15;10346;(46.21651716889963, 6.117756532803255)
664;Trams183;18;8;10348;(46.209619147164844, 6.1418080462799)
665;Trams182;18;1;10349;(46.2182406935082, 6.111092092025428)
666;Trams141;14;20;10351;(46.209619147164844, 6.1418080462799)
667;Trams145;14;4;10353;(46.2309061952839, 6.080766699467892)
668;Trams145;14;3;10354;(46.23126059862631, 6.080326773117102)
669;Trams184;18;13;10358;(46.218563912516935, 6.11024684749853)
670;Trams184;18;10;10359;(46.2187268199986, 6.1096151489643695)
671;Trams141;14;21;10359;(46.21001858728912, 6.137845020249269)
672;Trams145;14;1;10360;(46.23326160820353, 6.07761114905184)
673;Trams183;18;9;10364;(46.211920451819665, 6.133385791795223)
674;Trams184;18;7;10366;(46.21986421490718, 6.105204240236039)
675;Trams184;18;6;10367;(46.220033895155204, 6.104576238045008)
676;Trams185;18;4;10367;(46.22892467602633, 6.071768004605402)
677;Trams185;18;3;10368;(46.229129091577946, 6.071164369673746)
678;Trams142;14;10;10369;(46.209619147164844, 6.1418080462799)
679;Trams183;18;10;10371;(46.21360610540597, 6.129871458171416)
680;Trams145;14;0;10371;(46.23651293118392, 6.081750773481154)
681;Trams144;14;4;10373;(46.2309061952839, 6.080766699467892)
682;Trams141;14;22;10374;(46.21360610540597, 6.129871458171416)
683;Trams184;18;7;10380;(46.222163869140346, 6.096846229088542)
684;Trams144;14;3;10381;(46.233663217488996, 6.077579081696816)
685;Trams183;18;8;10390;(46.216491364508514, 6.117851415050074)
686;Trams144;14;2;10391;(46.23651293118392, 6.081750773481154)
687;Trams142;14;9;10401;(46.215189369790004, 6.124317509329907)
688;Trams182;18;7;10403;(46.209619147164844, 6.1418080462799)
689;Trams183;18;6;10403;(46.218563912516935, 6.11024684749853)
690;Trams183;18;5;10404;(46.2187268199986, 6.1096151489643695)
691;Trams143;14;4;10404;(46.209619147164844, 6.1418080462799)
692;Trams185;18;4;10406;(46.232058584382386, 6.0604319665284745)
693;Trams182;18;8;10411;(46.21001858728912, 6.137845020249269)
694;Trams183;18;4;10411;(46.21986421490718, 6.105204240236039)
695;Trams142;14;8;10412;(46.21651716889963, 6.117756532803255)
696;Trams143;14;5;10420;(46.211920451819665, 6.133385791795223)
697;Trams184;18;4;10421;(46.22892467602633, 6.071768004605402)
698;Trams184;18;1;10422;(46.229129091577946, 6.071164369673746)
699;Trams144;14;3;10424;(46.22560056832065, 6.083841398797564)
700;Trams142;14;6;10425;(46.2187268199986, 6.1096151489643695)
701;Trams185;18;6;10426;(46.22875340025039, 6.0722781370443135)
702;Trams149;14;13;10438;(46.209619147164844, 6.1418080462799)
703;Trams182;18;7;10445;(46.216491364508514, 6.117851415050074)
704;Trams149;14;14;10446;(46.21001858728912, 6.137845020249269)
705;Trams183;18;5;10447;(46.225833392644, 6.083285732983272)
706;Trams141;14;23;10450;(46.225833392644, 6.083285732983272)
707;Trams149;14;16;10454;(46.211920451819665, 6.133385791795223)
708;Trams182;18;8;10458;(46.218563912516935, 6.11024684749853)
709;Trams148;14;12;10458;(46.209619147164844, 6.1418080462799)
710;Trams149;14;18;10461;(46.21360610540597, 6.129871458171416)
711;Trams141;14;20;10463;(46.2309061952839, 6.080766699467892)
712;Trams141;14;17;10464;(46.23126059862631, 6.080326773117102)
713;Trams182;18;7;10466;(46.21986421490718, 6.105204240236039)
714;Trams148;14;13;10466;(46.21001858728912, 6.137845020249269)
715;Trams183;18;4;10467;(46.229129091577946, 6.071164369673746)
716;Trams142;14;7;10468;(46.225833392644, 6.083285732983272)
717;Trams144;14;2;10468;(46.21829243542764, 6.110901561090927)
718;Trams141;14;15;10470;(46.23326160820353, 6.07761114905184)
719;Trams149;14;17;10470;(46.215189369790004, 6.124317509329907)
720;Trams141;14;12;10471;(46.233663217488996, 6.077579081696816)
721;Trams181;18;6;10472;(46.209619147164844, 6.1418080462799)
722;Trams147;14;6;10473;(46.209619147164844, 6.1418080462799)
723;Trams147;14;11;10474;(46.209936084600805, 6.1413937432081545)
724;Trams182;18;6;10480;(46.222163869140346, 6.096846229088542)
725;Trams185;18;5;10481;(46.21959258599202, 6.105855945721585)
726;Trams141;14;1;10481;(46.23651293118392, 6.081750773481154)
727;Trams142;14;6;10481;(46.2309061952839, 6.080766699467892)
728;Trams183;18;3;10486;(46.23221759604077, 6.060000006892894)
729;Trams146;14;17;10488;(46.209619147164844, 6.1418080462799)
730;Trams185;18;4;10489;(46.21829243542764, 6.110901561090927)
731;Trams142;14;4;10489;(46.233663217488996, 6.077579081696816)
732;Trams149;14;16;10493;(46.218563912516935, 6.11024684749853)
733;Trams149;14;15;10494;(46.2187268199986, 6.1096151489643695)
734;Trams142;14;3;10499;(46.23651293118392, 6.081750773481154)
735;Trams148;14;12;10500;(46.216491364508514, 6.117851415050074)
736;Trams148;14;11;10501;(46.21651716889963, 6.117756532803255)
737;Trams149;14;12;10501;(46.21986421490718, 6.105204240236039)
738;Trams149;14;11;10502;(46.220033895155204, 6.104576238045008)
739;Trams145;14;12;10503;(46.209619147164844, 6.1418080462799)
740;Trams145;14;17;10504;(46.209936084600805, 6.1413937432081545)
741;Trams182;18;4;10511;(46.22725061595765, 6.078016845858288)
742;Trams145;14;18;10511;(46.21001858728912, 6.137845020249269)
743;Trams146;14;18;10511;(46.21360610540597, 6.129871458171416)
744;Trams148;14;9;10513;(46.218563912516935, 6.11024684749853)
745;Trams181;18;5;10514;(46.216491364508514, 6.117851415050074)
746;Trams143;14;4;10516;(46.2309061952839, 6.080766699467892)
747;Trams143;14;3;10517;(46.23126059862631, 6.080326773117102)
748;Trams146;14;17;10520;(46.215189369790004, 6.124317509329907)
749;Trams182;18;3;10521;(46.22892467602633, 6.071768004605402)
750;Trams182;18;2;10522;(46.229129091577946, 6.071164369673746)
751;Trams143;14;2;10523;(46.23326160820353, 6.07761114905184)
752;Trams144;14;24;10523;(46.209619147164844, 6.1418080462799)
753;Trams142;14;4;10532;(46.22560056832065, 6.083841398797564)
754;Trams181;18;4;10535;(46.21986421490718, 6.105204240236039)
755;Trams147;14;10;10536;(46.21986421490718, 6.105204240236039)
756;Trams146;14;16;10543;(46.218563912516935, 6.11024684749853)
757;Trams185;18;23;10544;(46.209619147164844, 6.1418080462799)
758;Trams146;14;14;10544;(46.2187268199986, 6.1096151489643695)
759;Trams145;14;17;10545;(46.216491364508514, 6.117851415050074)
760;Trams146;14;12;10551;(46.21986421490718, 6.105204240236039)
761;Trams149;14;9;10551;(46.23126059862631, 6.080326773117102)
762;Trams185;18;24;10552;(46.21001858728912, 6.137845020249269)
763;Trams144;14;23;10555;(46.215189369790004, 6.124317509329907)
764;Trams149;14;8;10557;(46.23326160820353, 6.07761114905184)
765;Trams149;14;7;10558;(46.233663217488996, 6.077579081696816)
766;Trams145;14;12;10559;(46.2187268199986, 6.1096151489643695)
767;Trams144;14;22;10565;(46.216491364508514, 6.117851415050074)
768;Trams146;14;11;10565;(46.222163869140346, 6.096846229088542)
769;Trams145;14;13;10566;(46.21986421490718, 6.105204240236039)
770;Trams142;14;3;10567;(46.21964321390066, 6.105669972291958)
771;Trams143;14;3;10567;(46.22560056832065, 6.083841398797564)
772;Trams145;14;12;10567;(46.220033895155204, 6.104576238045008)
773;Trams149;14;5;10568;(46.23651293118392, 6.081750773481154)
774;Trams148;14;7;10571;(46.23126059862631, 6.080326773117102)
775;Trams182;18;3;10572;(46.23009144236577, 6.0674901771201615)
776;Trams185;18;23;10576;(46.215189369790004, 6.124317509329907)
777;Trams148;14;6;10577;(46.23326160820353, 6.07761114905184)
778;Trams148;14;5;10578;(46.233663217488996, 6.077579081696816)
779;Trams144;14;20;10579;(46.2187268199986, 6.1096151489643695)
780;Trams147;14;9;10585;(46.2309061952839, 6.080766699467892)
781;Trams144;14;16;10586;(46.21986421490718, 6.105204240236039)
782;Trams147;14;8;10586;(46.23126059862631, 6.080326773117102)
783;Trams185;18;22;10587;(46.21651716889963, 6.117756532803255)
784;Trams144;14;15;10587;(46.220033895155204, 6.104576238045008)
785;Trams148;14;6;10587;(46.23651293118392, 6.081750773481154)
786;Trams148;14;5;10588;(46.23651293118392, 6.081750773481154)
787;Trams182;18;2;10590;(46.227049832271845, 6.078516021202702)
788;Trams181;18;2;10591;(46.229129091577946, 6.071164369673746)
789;Trams147;14;5;10592;(46.23326160820353, 6.07761114905184)
790;Trams147;14;3;10593;(46.233663217488996, 6.077579081696816)
791;Trams184;18;24;10598;(46.209619147164844, 6.1418080462799)
792;Trams185;18;21;10599;(46.218563912516935, 6.11024684749853)
793;Trams185;18;19;10600;(46.2187268199986, 6.1096151489643695)
794;Trams146;14;9;10600;(46.2309061952839, 6.080766699467892)
795;Trams146;14;8;10601;(46.23126059862631, 6.080326773117102)
796;Trams147;14;4;10602;(46.23651293118392, 6.081750773481154)
797;Trams147;14;3;10603;(46.23651293118392, 6.081750773481154)
798;Trams185;18;18;10607;(46.21986421490718, 6.105204240236039)
799;Trams146;14;6;10607;(46.23326160820353, 6.07761114905184)
800;Trams146;14;4;10608;(46.233663217488996, 6.077579081696816)
801;Trams143;14;2;10611;(46.21829243542764, 6.110901561090927)
802;Trams141;14;24;10613;(46.209619147164844, 6.1418080462799)
803;Trams145;14;11;10615;(46.2309061952839, 6.080766699467892)
804;Trams145;14;10;10616;(46.23126059862631, 6.080326773117102)
805;Trams146;14;0;10618;(46.23651293118392, 6.081750773481154)
806;Trams185;18;17;10621;(46.222163869140346, 6.096846229088542)
807;Trams145;14;9;10622;(46.23326160820353, 6.07761114905184)
808;Trams145;14;8;10623;(46.233663217488996, 6.077579081696816)
809;Trams184;18;18;10630;(46.215189369790004, 6.124317509329907)
810;Trams146;14;1;10630;(46.23295072525259, 6.077983956126664)
811;Trams142;14;24;10631;(46.209619147164844, 6.1418080462799)
812;Trams1411;14;22;10631;(46.209619147164844, 6.1418080462799)
813;Trams145;14;9;10632;(46.23651293118392, 6.081750773481154)
814;Trams145;14;1;10633;(46.23651293118392, 6.081750773481154)
815;Trams144;14;12;10635;(46.2309061952839, 6.080766699467892)
816;Trams1411;14;23;10639;(46.21001858728912, 6.137845020249269)
817;Trams184;18;17;10640;(46.216491364508514, 6.117851415050074)
818;Trams184;18;16;10641;(46.21651716889963, 6.117756532803255)
819;Trams144;14;10;10642;(46.23326160820353, 6.07761114905184)
820;Trams183;18;15;10643;(46.209619147164844, 6.1418080462799)
821;Trams144;14;8;10643;(46.233663217488996, 6.077579081696816)
822;Trams141;14;23;10645;(46.215189369790004, 6.124317509329907)
823;Trams1411;14;24;10647;(46.211920451819665, 6.133385791795223)
824;Trams185;18;13;10652;(46.22725061595765, 6.078016845858288)
825;Trams144;14;9;10652;(46.23651293118392, 6.081750773481154)
826;Trams144;14;5;10653;(46.23651293118392, 6.081750773481154)
827;Trams184;18;15;10654;(46.2187268199986, 6.1096151489643695)
828;Trams141;14;22;10655;(46.216491364508514, 6.117851415050074)
829;Trams141;14;21;10656;(46.21651716889963, 6.117756532803255)
830;Trams183;18;16;10659;(46.211920451819665, 6.133385791795223)
831;Trams184;18;12;10661;(46.21986421490718, 6.105204240236039)
832;Trams185;18;9;10662;(46.22892467602633, 6.071768004605402)
833;Trams185;18;8;10663;(46.229129091577946, 6.071164369673746)
834;Trams142;14;23;10663;(46.215189369790004, 6.124317509329907)
835;Trams183;18;18;10666;(46.21360610540597, 6.129871458171416)
836;Trams143;14;20;10666;(46.209619147164844, 6.1418080462799)
837;Trams141;14;22;10668;(46.218563912516935, 6.11024684749853)
838;Trams185;18;5;10670;(46.230281046110804, 6.0669425701125625)
839;Trams142;14;21;10673;(46.216491364508514, 6.117851415050074)
840;Trams183;18;20;10674;(46.21506553265199, 6.124967309087373)
841;Trams143;14;22;10674;(46.21001858728912, 6.137845020249269)
842;Trams183;18;19;10675;(46.215189369790004, 6.124317509329907)
843;Trams143;14;23;10682;(46.211920451819665, 6.133385791795223)
844;Trams142;14;20;10687;(46.2187268199986, 6.1096151489643695)
845;Trams146;14;0;10687;(46.21959258599202, 6.105855945721585)
846;Trams1411;14;14;10687;(46.2187268199986, 6.1096151489643695)
847;Trams141;14;21;10689;(46.22210496740385, 6.097060802216698)
848;Trams143;14;24;10689;(46.21360610540597, 6.129871458171416)
849;Trams141;14;22;10690;(46.222163869140346, 6.096846229088542)
850;Trams142;14;19;10694;(46.21986421490718, 6.105204240236039)
851;Trams1411;14;11;10694;(46.21986421490718, 6.105204240236039)
852;Trams142;14;18;10695;(46.220033895155204, 6.104576238045008)
853;Trams1411;14;10;10695;(46.220033895155204, 6.104576238045008)
854;Trams184;18;11;10697;(46.225833392644, 6.083285732983272)
855;Trams182;18;19;10698;(46.209619147164844, 6.1418080462799)
856;Trams149;14;20;10700;(46.209619147164844, 6.1418080462799)
857;Trams182;18;23;10706;(46.21001858728912, 6.137845020249269)
858;Trams183;18;17;10706;(46.21986421490718, 6.105204240236039)
859;Trams184;18;7;10706;(46.22725061595765, 6.078016845858288)
860;Trams143;14;23;10708;(46.216491364508514, 6.117851415050074)
861;Trams144;14;6;10708;(46.221882977508976, 6.097531092195339)
862;Trams149;14;21;10708;(46.21001858728912, 6.137845020249269)
863;Trams141;14;24;10712;(46.225833392644, 6.083285732983272)
864;Trams182;18;24;10714;(46.211920451819665, 6.133385791795223)
865;Trams184;18;6;10716;(46.22892467602633, 6.071768004605402)
866;Trams184;18;3;10717;(46.229129091577946, 6.071164369673746)
867;Trams148;14;23;10720;(46.209619147164844, 6.1418080462799)
868;Trams143;14;24;10721;(46.218563912516935, 6.11024684749853)
869;Trams143;14;22;10722;(46.2187268199986, 6.1096151489643695)
870;Trams149;14;22;10723;(46.21360610540597, 6.129871458171416)
871;Trams141;14;18;10725;(46.2309061952839, 6.080766699467892)
872;Trams141;14;14;10726;(46.23126059862631, 6.080326773117102)
873;Trams148;14;24;10728;(46.21001858728912, 6.137845020249269)
874;Trams143;14;21;10729;(46.21986421490718, 6.105204240236039)
875;Trams182;18;23;10730;(46.215189369790004, 6.124317509329907)
876;Trams141;14;10;10732;(46.23326160820353, 6.07761114905184)
877;Trams141;14;6;10733;(46.233663217488996, 6.077579081696816)
878;Trams147;14;17;10735;(46.209619147164844, 6.1418080462799)
879;Trams182;18;22;10740;(46.216491364508514, 6.117851415050074)
880;Trams182;18;21;10741;(46.21651716889963, 6.117756532803255)
881;Trams183;18;18;10742;(46.225833392644, 6.083285732983272)
882;Trams141;14;1;10743;(46.23651293118392, 6.081750773481154)
883;Trams142;14;16;10743;(46.2309061952839, 6.080766699467892)
884;Trams142;14;14;10744;(46.23126059862631, 6.080326773117102)
885;Trams146;14;14;10750;(46.209619147164844, 6.1418080462799)
886;Trams1411;14;9;10750;(46.23326160820353, 6.07761114905184)
887;Trams183;18;12;10751;(46.22725061595765, 6.078016845858288)
888;Trams142;14;10;10751;(46.233663217488996, 6.077579081696816)
889;Trams1411;14;6;10751;(46.233663217488996, 6.077579081696816)
890;Trams148;14;23;10752;(46.215189369790004, 6.124317509329907)
891;Trams182;18;18;10753;(46.218563912516935, 6.11024684749853)
892;Trams182;18;15;10754;(46.2187268199986, 6.1096151489643695)
893;Trams144;14;5;10754;(46.214945898309566, 6.125408578114381)
894;Trams184;18;4;10755;(46.232058584382386, 6.0604319665284745)
895;Trams149;14;21;10756;(46.2187268199986, 6.1096151489643695)
896;Trams147;14;18;10758;(46.21360610540597, 6.129871458171416)
897;Trams182;18;9;10761;(46.21986421490718, 6.105204240236039)
898;Trams142;14;4;10761;(46.23651293118392, 6.081750773481154)
899;Trams1411;14;0;10761;(46.23651293118392, 6.081750773481154)
900;Trams182;18;7;10762;(46.220033895155204, 6.104576238045008)
901;Trams183;18;6;10762;(46.229129091577946, 6.071164369673746)
902;Trams148;14;21;10762;(46.216491364508514, 6.117851415050074)
903;Trams148;14;20;10763;(46.21651716889963, 6.117756532803255)
904;Trams145;14;10;10765;(46.209619147164844, 6.1418080462799)
905;Trams146;14;15;10766;(46.211920451819665, 6.133385791795223)
906;Trams181;18;10;10767;(46.209619147164844, 6.1418080462799)
907;Trams147;14;17;10767;(46.215189369790004, 6.124317509329907)
908;Trams181;18;12;10768;(46.209936084600805, 6.1413937432081545)
909;Trams183;18;4;10769;(46.230281046110804, 6.0669425701125625)
910;Trams145;14;11;10773;(46.21001858728912, 6.137845020249269)
911;Trams181;18;14;10775;(46.21001858728912, 6.137845020249269)
912;Trams148;14;19;10775;(46.218563912516935, 6.11024684749853)
913;Trams185;18;4;10776;(46.21959258599202, 6.105855945721585)
914;Trams141;14;3;10776;(46.22560056832065, 6.083841398797564)
915;Trams148;14;15;10776;(46.2187268199986, 6.1096151489643695)
916;Trams147;14;16;10777;(46.216491364508514, 6.117851415050074)
917;Trams143;14;15;10778;(46.2309061952839, 6.080766699467892)
918;Trams147;14;14;10778;(46.21651716889963, 6.117756532803255)
919;Trams143;14;14;10779;(46.23126059862631, 6.080326773117102)
920;Trams146;14;14;10782;(46.215189369790004, 6.124317509329907)
921;Trams184;18;3;10785;(46.227049832271845, 6.078516021202702)
922;Trams143;14;10;10785;(46.23326160820353, 6.07761114905184)
923;Trams144;14;24;10785;(46.209619147164844, 6.1418080462799)
924;Trams143;14;7;10786;(46.233663217488996, 6.077579081696816)
925;Trams181;18;15;10790;(46.21360610540597, 6.129871458171416)
926;Trams147;14;11;10790;(46.218563912516935, 6.11024684749853)
927;Trams146;14;13;10792;(46.216491364508514, 6.117851415050074)
928;Trams143;14;9;10795;(46.23651293118392, 6.081750773481154)
929;Trams143;14;4;10796;(46.23651293118392, 6.081750773481154)
930;Trams148;14;13;10797;(46.222163869140346, 6.096846229088542)
931;Trams147;14;9;10798;(46.21986421490718, 6.105204240236039)
932;Trams147;14;7;10799;(46.220033895155204, 6.104576238045008)
933;Trams183;18;5;10800;(46.232058584382386, 6.0604319665284745)
934;Trams146;14;12;10805;(46.218563912516935, 6.11024684749853)
935;Trams182;18;6;10806;(46.22725061595765, 6.078016845858288)
936;Trams146;14;9;10806;(46.2187268199986, 6.1096151489643695)
937;Trams141;14;2;10812;(46.21959258599202, 6.105855945721585)
938;Trams149;14;17;10812;(46.2309061952839, 6.080766699467892)
939;Trams146;14;7;10813;(46.21986421490718, 6.105204240236039)
940;Trams182;18;4;10817;(46.229129091577946, 6.071164369673746)
941;Trams144;14;23;10817;(46.215189369790004, 6.124317509329907)
942;Trams149;14;12;10819;(46.23326160820353, 6.07761114905184)
943;Trams145;14;10;10820;(46.218563912516935, 6.11024684749853)
944;Trams181;18;14;10823;(46.2187268199986, 6.1096151489643695)
945;Trams182;18;3;10824;(46.230281046110804, 6.0669425701125625)
946;Trams144;14;21;10827;(46.216491364508514, 6.117851415050074)
947;Trams145;14;8;10828;(46.21986421490718, 6.105204240236039)
948;Trams181;18;13;10830;(46.21986421490718, 6.105204240236039)
949;Trams149;14;8;10830;(46.23651293118392, 6.081750773481154)
950;Trams181;18;12;10831;(46.220033895155204, 6.104576238045008)
951;Trams148;14;10;10832;(46.2309061952839, 6.080766699467892)
952;Trams141;14;1;10833;(46.21623985899967, 6.1184805828468845)
953;Trams148;14;9;10833;(46.23126059862631, 6.080326773117102)
954;Trams183;18;6;10839;(46.22560056832065, 6.083841398797564)
955;Trams185;18;24;10839;(46.209619147164844, 6.1418080462799)
956;Trams148;14;8;10839;(46.23326160820353, 6.07761114905184)
957;Trams148;14;6;10840;(46.233663217488996, 6.077579081696816)
958;Trams144;14;20;10841;(46.2187268199986, 6.1096151489643695)
959;Trams147;14;6;10847;(46.2309061952839, 6.080766699467892)
960;Trams144;14;18;10848;(46.21986421490718, 6.105204240236039)
961;Trams147;14;5;10848;(46.23126059862631, 6.080326773117102)
962;Trams148;14;4;10850;(46.23651293118392, 6.081750773481154)
963;Trams144;14;17;10862;(46.222163869140346, 6.096846229088542)
964;Trams146;14;4;10863;(46.23126059862631, 6.080326773117102)
965;Trams147;14;3;10865;(46.23651293118392, 6.081750773481154)
966;Trams185;18;23;10871;(46.215189369790004, 6.124317509329907)
967;Trams1410;14;0;10873;(46.21829243542764, 6.110901561090927)
968;Trams181;18;8;10875;(46.22725061595765, 6.078016845858288)
969;Trams141;14;24;10875;(46.209619147164844, 6.1418080462799)
970;Trams145;14;7;10878;(46.23126059862631, 6.080326773117102)
971;Trams146;14;1;10880;(46.23651293118392, 6.081750773481154)
972;Trams185;18;21;10881;(46.216491364508514, 6.117851415050074)
973;Trams185;18;20;10882;(46.21651716889963, 6.117756532803255)
974;Trams183;18;5;10883;(46.21829243542764, 6.110901561090927)
975;Trams145;14;4;10884;(46.23326160820353, 6.07761114905184)
976;Trams181;18;6;10885;(46.22892467602633, 6.071768004605402)
977;Trams182;18;4;10885;(46.227049832271845, 6.078516021202702)
978;Trams145;14;3;10885;(46.233663217488996, 6.077579081696816)
979;Trams181;18;3;10886;(46.229129091577946, 6.071164369673746)
980;Trams181;18;1;10893;(46.230281046110804, 6.0669425701125625)
981;Trams184;18;22;10893;(46.209619147164844, 6.1418080462799)
982;Trams142;14;21;10893;(46.209619147164844, 6.1418080462799)
983;Trams185;18;14;10894;(46.218563912516935, 6.11024684749853)
984;Trams142;14;24;10894;(46.209936084600805, 6.1413937432081545)
985;Trams185;18;13;10895;(46.2187268199986, 6.1096151489643695)
986;Trams145;14;1;10895;(46.23651293118392, 6.081750773481154)
987;Trams144;14;14;10897;(46.2309061952839, 6.080766699467892)
988;Trams144;14;13;10898;(46.23126059862631, 6.080326773117102)
989;Trams184;18;23;10901;(46.21001858728912, 6.137845020249269)
990;Trams1411;14;4;10901;(46.21001858728912, 6.137845020249269)
991;Trams185;18;12;10903;(46.220033895155204, 6.104576238045008)
992;Trams144;14;9;10905;(46.233663217488996, 6.077579081696816)
993;Trams183;18;4;10907;(46.214945898309566, 6.125408578114381)
994;Trams145;14;2;10907;(46.23295072525259, 6.077983956126664)
995;Trams1411;14;5;10909;(46.211920451819665, 6.133385791795223)
996;Trams144;14;10;10914;(46.23651293118392, 6.081750773481154)
997;Trams144;14;6;10915;(46.23651293118392, 6.081750773481154)
998;Trams184;18;24;10916;(46.21360610540597, 6.129871458171416)
999;Trams1411;14;6;10916;(46.21360610540597, 6.129871458171416)
1000;Trams141;14;23;10917;(46.216491364508514, 6.117851415050074)
1001;Trams141;14;24;10918;(46.21651716889963, 6.117756532803255)
1002;Trams1411;14;9;10924;(46.21506553265199, 6.124967309087373)
1003;Trams184;18;23;10925;(46.215189369790004, 6.124317509329907)
1004;Trams143;14;17;10928;(46.209619147164844, 6.1418080462799)
1005;Trams141;14;22;10930;(46.218563912516935, 6.11024684749853)
1006;Trams184;18;22;10935;(46.216491364508514, 6.117851415050074)
1007;Trams184;18;23;10936;(46.21651716889963, 6.117756532803255)
1008;Trams143;14;21;10936;(46.21001858728912, 6.137845020249269)
1009;Trams1411;14;10;10936;(46.21651716889963, 6.117756532803255)
1010;Trams182;18;3;10938;(46.21829243542764, 6.110901561090927)
1011;Trams183;18;11;10938;(46.209619147164844, 6.1418080462799)
1012;Trams185;18;13;10938;(46.225833392644, 6.083285732983272)
1013;Trams181;18;2;10944;(46.22875340025039, 6.0722781370443135)
1014;Trams185;18;11;10947;(46.22725061595765, 6.078016845858288)
1015;Trams184;18;22;10948;(46.218563912516935, 6.11024684749853)
1016;Trams184;18;16;10949;(46.2187268199986, 6.1096151489643695)
1017;Trams141;14;23;10952;(46.222163869140346, 6.096846229088542)
1018;Trams184;18;12;10956;(46.21986421490718, 6.105204240236039)
1019;Trams184;18;8;10957;(46.220033895155204, 6.104576238045008)
1020;Trams185;18;9;10957;(46.22892467602633, 6.071768004605402)
1021;Trams1411;14;9;10957;(46.220033895155204, 6.104576238045008)
1022;Trams185;18;7;10958;(46.229129091577946, 6.071164369673746)
1023;Trams143;14;20;10960;(46.215189369790004, 6.124317509329907)
1024;Trams183;18;12;10961;(46.21360610540597, 6.129871458171416)
1025;Trams149;14;24;10962;(46.209619147164844, 6.1418080462799)
1026;Trams181;18;3;10963;(46.22560056832065, 6.083841398797564)
1027;Trams145;14;1;10964;(46.21959258599202, 6.105855945721585)
1028;Trams185;18;5;10965;(46.230281046110804, 6.0669425701125625)
1029;Trams184;18;7;10970;(46.222163869140346, 6.096846229088542)
1030;Trams183;18;11;10981;(46.21651716889963, 6.117756532803255)
1031;Trams148;14;9;10982;(46.209619147164844, 6.1418080462799)
1032;Trams143;14;21;10983;(46.218563912516935, 6.11024684749853)
1033;Trams143;14;19;10984;(46.2187268199986, 6.1096151489643695)
1034;Trams185;18;7;10986;(46.233563482052425, 6.055252143299553)
1035;Trams141;14;19;10987;(46.2309061952839, 6.080766699467892)
1036;Trams141;14;16;10988;(46.23126059862631, 6.080326773117102)
1037;Trams148;14;12;10990;(46.21001858728912, 6.137845020249269)
1038;Trams143;14;18;10991;(46.21986421490718, 6.105204240236039)
1039;Trams143;14;16;10992;(46.220033895155204, 6.104576238045008)
1040;Trams182;18;8;10993;(46.209619147164844, 6.1418080462799)
1041;Trams141;14;7;10994;(46.23326160820353, 6.07761114905184)
1042;Trams141;14;3;10995;(46.233663217488996, 6.077579081696816)
1043;Trams147;14;7;10997;(46.209619147164844, 6.1418080462799)
1044;Trams182;18;10;11001;(46.21001858728912, 6.137845020249269)
1045;Trams184;18;5;11001;(46.22725061595765, 6.078016845858288)
1046;Trams149;14;23;11004;(46.216491364508514, 6.117851415050074)
1047;Trams141;14;1;11005;(46.23651293118392, 6.081750773481154)
1048;Trams143;14;17;11005;(46.222163869140346, 6.096846229088542)
1049;Trams142;14;23;11006;(46.23126059862631, 6.080326773117102)
1050;Trams1411;14;8;11006;(46.23126059862631, 6.080326773117102)
1051;Trams182;18;11;11009;(46.211920451819665, 6.133385791795223)
1052;Trams184;18;3;11012;(46.229129091577946, 6.071164369673746)
1053;Trams142;14;22;11012;(46.23326160820353, 6.07761114905184)
1054;Trams146;14;4;11012;(46.209619147164844, 6.1418080462799)
1055;Trams1411;14;7;11012;(46.23326160820353, 6.07761114905184)
1056;Trams142;14;16;11013;(46.233663217488996, 6.077579081696816)
1057;Trams148;14;13;11013;(46.21506553265199, 6.124967309087373)
1058;Trams1411;14;5;11013;(46.233663217488996, 6.077579081696816)
1059;Trams149;14;22;11017;(46.218563912516935, 6.11024684749853)
1060;Trams149;14;19;11018;(46.2187268199986, 6.1096151489643695)
1061;Trams181;18;2;11020;(46.21623985899967, 6.1184805828468845)
1062;Trams142;14;5;11023;(46.23651293118392, 6.081750773481154)
1063;Trams1411;14;0;11023;(46.23651293118392, 6.081750773481154)
1064;Trams148;14;12;11024;(46.216491364508514, 6.117851415050074)
1065;Trams148;14;11;11025;(46.21651716889963, 6.117756532803255)
1066;Trams149;14;17;11026;(46.220033895155204, 6.104576238045008)
1067;Trams143;14;16;11027;(46.225833392644, 6.083285732983272)
1068;Trams145;14;5;11027;(46.209619147164844, 6.1418080462799)
1069;Trams181;18;1;11031;(46.214945898309566, 6.125408578114381)
1070;Trams185;18;8;11035;(46.22560056832065, 6.083841398797564)
1071;Trams148;14;10;11037;(46.218563912516935, 6.11024684749853)
1072;Trams147;14;6;11039;(46.216491364508514, 6.117851415050074)
1073;Trams184;18;4;11040;(46.233563482052425, 6.055252143299553)
1074;Trams143;14;12;11040;(46.2309061952839, 6.080766699467892)
1075;Trams148;14;9;11045;(46.21986421490718, 6.105204240236039)
1076;Trams183;18;9;11046;(46.22725061595765, 6.078016845858288)
1077;Trams143;14;11;11047;(46.23326160820353, 6.07761114905184)
1078;Trams144;14;12;11047;(46.209619147164844, 6.1418080462799)
1079;Trams143;14;8;11048;(46.233663217488996, 6.077579081696816)
1080;Trams184;18;5;11050;(46.232058584382386, 6.0604319665284745)
1081;Trams182;18;9;11057;(46.220033895155204, 6.104576238045008)
1082;Trams183;18;7;11057;(46.229129091577946, 6.071164369673746)
1083;Trams143;14;6;11058;(46.23651293118392, 6.081750773481154)
1084;Trams147;14;5;11060;(46.21986421490718, 6.105204240236039)
1085;Trams181;18;4;11062;(46.209619147164844, 6.1418080462799)
1086;Trams183;18;5;11064;(46.230281046110804, 6.0669425701125625)
1087;Trams146;14;3;11068;(46.2187268199986, 6.1096151489643695)
1088;Trams144;14;13;11070;(46.21360610540597, 6.129871458171416)
1089;Trams185;18;7;11071;(46.21959258599202, 6.105855945721585)
1090;Trams149;14;15;11074;(46.2309061952839, 6.080766699467892)
1091;Trams149;14;14;11075;(46.23126059862631, 6.080326773117102)
1092;Trams185;18;6;11079;(46.21829243542764, 6.110901561090927)
1093;Trams144;14;12;11079;(46.215189369790004, 6.124317509329907)
1094;Trams148;14;10;11081;(46.225833392644, 6.083285732983272)
1095;Trams149;14;10;11081;(46.23326160820353, 6.07761114905184)
1096;Trams149;14;8;11082;(46.233663217488996, 6.077579081696816)
1097;Trams181;18;5;11085;(46.21360610540597, 6.129871458171416)
1098;Trams144;14;11;11089;(46.216491364508514, 6.117851415050074)
1099;Trams145;14;3;11090;(46.21986421490718, 6.105204240236039)
1100;Trams149;14;6;11092;(46.23651293118392, 6.081750773481154)
1101;Trams185;18;5;11093;(46.21611750965686, 6.119130967851263)
1102;Trams148;14;9;11094;(46.2309061952839, 6.080766699467892)
1103;Trams148;14;6;11101;(46.23326160820353, 6.07761114905184)
1104;Trams144;14;10;11102;(46.218563912516935, 6.11024684749853)
1105;Trams181;18;4;11104;(46.216491364508514, 6.117851415050074)
1106;Trams147;14;4;11110;(46.23126059862631, 6.080326773117102)
1107;Trams182;18;7;11111;(46.22892467602633, 6.071768004605402)
1108;Trams182;18;4;11112;(46.229129091577946, 6.071164369673746)
1109;Trams148;14;3;11112;(46.23651293118392, 6.081750773481154)
1110;Trams183;18;6;11115;(46.22875340025039, 6.0722781370443135)
1111;Trams147;14;3;11117;(46.233663217488996, 6.077579081696816)
1112;Trams146;14;2;11124;(46.2309061952839, 6.080766699467892)
1113;Trams182;18;3;11130;(46.232199996112904, 6.060063485647696)
1114;Trams146;14;1;11132;(46.233663217488996, 6.077579081696816)
1115;Trams184;18;4;11133;(46.21829243542764, 6.110901561090927)
1116;Trams184;18;3;11134;(46.2182406935082, 6.111092092025428)
1117;Trams185;18;21;11134;(46.209619147164844, 6.1418080462799)
1118;Trams141;14;17;11137;(46.209619147164844, 6.1418080462799)
1119;Trams182;18;2;11140;(46.233563482052425, 6.055252143299553)
1120;Trams185;18;24;11142;(46.21001858728912, 6.137845020249269)
1121;Trams145;14;1;11146;(46.23326160820353, 6.07761114905184)
1122;Trams149;14;7;11147;(46.221882977508976, 6.097531092195339)
1123;Trams142;14;16;11155;(46.209619147164844, 6.1418080462799)
1124;Trams144;14;8;11159;(46.2309061952839, 6.080766699467892)
1125;Trams141;14;18;11160;(46.21360610540597, 6.129871458171416)
1126;Trams144;14;7;11160;(46.23126059862631, 6.080326773117102)
1127;Trams185;18;23;11166;(46.215189369790004, 6.124317509329907)
1128;Trams144;14;6;11166;(46.23326160820353, 6.07761114905184)
1129;Trams148;14;4;11167;(46.221882977508976, 6.097531092195339)
1130;Trams149;14;6;11169;(46.21829243542764, 6.110901561090927)
1131;Trams182;18;3;11170;(46.22875340025039, 6.0722781370443135)
1132;Trams183;18;5;11170;(46.21959258599202, 6.105855945721585)
1133;Trams185;18;21;11176;(46.216491364508514, 6.117851415050074)
1134;Trams185;18;20;11177;(46.21651716889963, 6.117756532803255)
1135;Trams142;14;17;11178;(46.21360610540597, 6.129871458171416)
1136;Trams181;18;2;11181;(46.229129091577946, 6.071164369673746)
1137;Trams184;18;7;11188;(46.209619147164844, 6.1418080462799)
1138;Trams185;18;18;11189;(46.218563912516935, 6.11024684749853)
1139;Trams185;18;16;11190;(46.2187268199986, 6.1096151489643695)
1140;Trams143;14;8;11190;(46.209619147164844, 6.1418080462799)
1141;Trams184;18;9;11196;(46.21001858728912, 6.137845020249269)
1142;Trams185;18;12;11197;(46.21986421490718, 6.105204240236039)
1143;Trams142;14;15;11197;(46.216491364508514, 6.117851415050074)
1144;Trams185;18;10;11198;(46.220033895155204, 6.104576238045008)
1145;Trams141;14;17;11200;(46.21986421490718, 6.105204240236039)
1146;Trams183;18;4;11202;(46.214945898309566, 6.125408578114381)
1147;Trams148;14;3;11202;(46.21623985899967, 6.1184805828468845)
1148;Trams184;18;10;11204;(46.211920451819665, 6.133385791795223)
1149;Trams143;14;9;11206;(46.211920451819665, 6.133385791795223)
1150;Trams142;14;14;11210;(46.218563912516935, 6.11024684749853)
1151;Trams185;18;9;11211;(46.222163869140346, 6.096846229088542)
1152;Trams142;14;11;11211;(46.2187268199986, 6.1096151489643695)
1153;Trams143;14;10;11213;(46.21360610540597, 6.129871458171416)
1154;Trams142;14;10;11218;(46.21986421490718, 6.105204240236039)
1155;Trams184;18;11;11219;(46.21506553265199, 6.124967309087373)
1156;Trams184;18;10;11220;(46.215189369790004, 6.124317509329907)
1157;Trams182;18;2;11224;(46.21964321390066, 6.105669972291958)
1158;Trams185;18;8;11242;(46.22725061595765, 6.078016845858288)
1159;Trams184;18;8;11244;(46.2187268199986, 6.1096151489643695)
1160;Trams143;14;11;11245;(46.218563912516935, 6.11024684749853)
1161;Trams141;14;14;11249;(46.2309061952839, 6.080766699467892)
1162;Trams141;14;13;11250;(46.23126059862631, 6.080326773117102)
1163;Trams184;18;7;11252;(46.220033895155204, 6.104576238045008)
1164;Trams185;18;7;11252;(46.22892467602633, 6.071768004605402)
1165;Trams144;14;5;11254;(46.21829243542764, 6.110901561090927)
1166;Trams141;14;10;11256;(46.23326160820353, 6.07761114905184)
1167;Trams141;14;8;11257;(46.233663217488996, 6.077579081696816)
1168;Trams185;18;5;11260;(46.230281046110804, 6.0669425701125625)
1169;Trams184;18;6;11265;(46.222163869140346, 6.096846229088542)
1170;Trams141;14;2;11267;(46.23651293118392, 6.081750773481154)
1171;Trams142;14;7;11267;(46.2309061952839, 6.080766699467892)
1172;Trams142;14;6;11275;(46.233663217488996, 6.077579081696816)
1173;Trams142;14;7;11284;(46.23651293118392, 6.081750773481154)
1174;Trams142;14;5;11285;(46.23651293118392, 6.081750773481154)
1175;Trams143;14;10;11302;(46.2309061952839, 6.080766699467892)
1176;Trams143;14;9;11303;(46.23126059862631, 6.080326773117102)
1177;Trams184;18;4;11306;(46.22892467602633, 6.071768004605402)
1178;Trams143;14;8;11309;(46.23326160820353, 6.07761114905184)
1179;Trams184;18;3;11314;(46.230281046110804, 6.0669425701125625)
1180;Trams143;14;7;11320;(46.23651293118392, 6.081750773481154)
