tramName;tramLine;nPassengers;cycleNo;time;location
Trams182;18;7;78127;6:0;{1782.5218000002205,1208.6106000002474,0.0}
Trams143;14;8;78130;6:0;{2894.896500002593,514.0241999980062,0.0}
Trams141;14;7;78132;6:1;{4084.1569000035524,2161.088000001386,0.0}
Trams147;14;4;78132;6:1;{4672.309900000691,2395.577299999073,0.0}
Trams143;14;9;78142;6:2;{2597.49450000003,904.9190000016242,0.0}
Trams183;18;10;78144;6:3;{5123.508700001985,2583.745899999514,0.0}
Trams143;14;10;78150;6:4;{2839.1857000030577,1180.8036000002176,0.0}
Trams182;18;6;78154;6:4;{3035.1652000024915,1729.7097000014037,0.0}
Trams141;14;8;78155;6:4;{5123.508700001985,2583.745899999514,0.0}
Trams183;18;11;78156;6:5;{5689.812200002372,2815.7713999990374,0.0}
Trams142;14;13;78164;6:6;{4722.0763000026345,2426.624300001189,0.0}
Trams149;14;9;78164;6:6;{2894.896500002593,514.0241999980062,0.0}
Trams183;18;13;78167;6:6;{6221.943900000304,2968.579499999061,0.0}
Trams149;14;13;78176;6:8;{2597.49450000003,904.9190000016242,0.0}
Trams141;14;11;78178;6:8;{6221.943900000304,2968.579499999061,0.0}
Trams144;14;5;78182;6:9;{4672.309900000691,2395.577299999073,0.0}
Trams149;14;16;78184;6:9;{2839.1857000030577,1180.8036000002176,0.0}
Trams182;18;8;78190;6:10;{4722.0763000026345,2426.624300001189,0.0}
Trams183;18;12;78191;6:10;{7223.311400000006,3570.043500000611,0.0}
Trams181;18;14;78196;6:11;{1782.5218000002205,1208.6106000002474,0.0}
Trams184;18;3;78196;6:11;{5634.466500002891,2784.006800001487,0.0}
Trams148;14;3;78196;6:11;{2597.49450000003,904.9190000016242,0.0}
Trams183;18;8;78197;6:11;{7477.508000001311,3581.729000000283,0.0}
Trams182;18;10;78199;6:12;{5123.508700001985,2583.745899999514,0.0}
Trams143;14;11;78199;6:12;{4722.0763000026345,2426.624300001189,0.0}
Trams147;14;3;78199;6:12;{2894.896500002593,514.0241999980062,0.0}
Trams181;18;18;78204;6:13;{2149.2538000009954,1363.784799998626,0.0}
Trams185;18;3;78207;6:13;{2589.0274000018835,1538.5219000000507,0.0}
Trams184;18;5;78208;6:13;{5058.904000002891,2546.714799998328,0.0}
Trams141;14;6;78208;6:13;{7477.508000001311,3581.729000000283,0.0}
Trams182;18;11;78211;6:14;{5689.812200002372,2815.7713999990374,0.0}
Trams147;14;4;78211;6:14;{2597.49450000003,904.9190000016242,0.0}
Trams142;14;12;78212;6:14;{6883.719200000167,3354.242599999532,0.0}
Trams144;14;4;78219;6:15;{2952.0448504139104,1673.1693294131398,0.0}
Trams147;14;5;78219;6:15;{2839.1857000030577,1180.8036000002176,0.0}
Trams142;14;8;78226;6:16;{7477.508000001311,3581.729000000283,0.0}
Trams146;14;5;78226;6:16;{2597.49450000003,904.9190000016242,0.0}
Trams183;18;9;78229;6:17;{6188.119100000709,2954.7112999986857,0.0}
Trams149;14;18;78233;6:17;{4722.0763000026345,2426.624300001189,0.0}
Trams146;14;6;78234;6:18;{2839.1857000030577,1180.8036000002176,0.0}
Trams148;14;5;78239;6:18;{4084.1569000035524,2161.088000001386,0.0}
Trams183;18;10;78241;6:19;{5634.466500002891,2784.006800001487,0.0}
Trams149;14;21;78242;6:19;{5123.508700001985,2583.745899999514,0.0}
Trams185;18;2;78246;6:20;{845.340600002557,806.1041999999434,0.0}
Trams182;18;3;78252;6:21;{7477.508000001311,3581.729000000283,0.0}
Trams183;18;9;78253;6:21;{5058.904000002891,2546.714799998328,0.0}
Trams184;18;4;78253;6:21;{2942.963136644313,1688.2069726773154,0.0}
Trams148;14;6;78253;6:21;{4722.0763000026345,2426.624300001189,0.0}
Trams149;14;23;78254;6:21;{5689.812200002372,2815.7713999990374,0.0}
Trams183;18;10;78261;6:22;{4672.309900000691,2395.577299999073,0.0}
Trams143;14;7;78261;6:22;{7477.508000001311,3581.729000000283,0.0}
Trams144;14;6;78261;6:22;{2597.49450000003,904.9190000016242,0.0}
Trams149;14;24;78265;6:23;{6221.943900000304,2968.579499999061,0.0}
Trams149;14;23;78266;6:23;{6271.932036142039,2982.903802087056,0.0}
Trams181;18;19;78268;6:23;{5123.508700001985,2583.745899999514,0.0}
Trams185;18;5;78268;6:23;{1782.5218000002205,1208.6106000002474,0.0}
Trams147;14;6;78268;6:23;{4722.0763000026345,2426.624300001189,0.0}
Trams144;14;7;78269;6:23;{2839.1857000030577,1180.8036000002176,0.0}
Trams146;14;5;78269;6:23;{4084.1569000035524,2161.088000001386,0.0}
Trams141;14;7;78272;6:24;{4672.309900000691,2395.577299999073,0.0}
Trams148;14;8;78274;6:24;{5689.812200002372,2815.7713999990374,0.0}
Trams185;18;12;78276;6:25;{2149.2538000009954,1363.784799998626,0.0}
Trams147;14;8;78277;6:25;{5123.508700001985,2583.745899999514,0.0}
Trams149;14;22;78280;6:25;{6864.837443928478,3341.6995773341046,0.0}
Trams146;14;8;78283;6:26;{4722.0763000026345,2426.624300001189,0.0}
Trams185;18;16;78286;6:26;{2627.1466000005603,1561.507400000468,0.0}
Trams147;14;10;78289;6:27;{5689.812200002372,2815.7713999990374,0.0}
Trams148;14;7;78294;6:28;{6609.992500003427,3161.7836000006646,0.0}
Trams149;14;7;78295;6:28;{7477.508000001311,3581.729000000283,0.0}
Trams182;18;4;78296;6:28;{5634.466500002891,2784.006800001487,0.0}
Trams183;18;9;78297;6:28;{2992.747200001031,1703.0900999996811,0.0}
Trams184;18;2;78300;6:29;{845.340600002557,806.1041999999434,0.0}
Trams147;14;11;78300;6:29;{6221.943900000304,2968.579499999061,0.0}
Trams142;14;7;78304;6:29;{4031.8555000014603,2128.9623999986798,0.0}
Trams145;14;3;78307;6:30;{5123.508700001985,2583.745899999514,0.0}
Trams148;14;2;78315;6:31;{7477.508000001311,3581.729000000283,0.0}
Trams147;14;10;78316;6:31;{6883.719200000167,3354.242599999532,0.0}
Trams144;14;8;78318;6:32;{4722.0763000026345,2426.624300001189,0.0}
Trams181;18;9;78321;6:32;{7477.508000001311,3581.729000000283,0.0}
Trams181;18;8;78322;6:32;{7477.508000001311,3581.729000000283,0.0}
Trams184;18;6;78322;6:32;{1782.5218000002205,1208.6106000002474,0.0}
Trams144;14;9;78327;6:33;{5123.508700001985,2583.745899999514,0.0}
Trams141;14;6;78329;6:33;{2567.6414284064917,825.1840510346515,0.0}
Trams184;18;11;78330;6:34;{2149.2538000009954,1363.784799998626,0.0}
Trams145;14;4;78330;6:34;{6221.943900000304,2968.579499999061,0.0}
Trams146;14;7;78330;6:34;{6864.837443928478,3341.6995773341046,0.0}
Trams147;14;4;78330;6:34;{7477.508000001311,3581.729000000283,0.0}
Trams185;18;18;78331;6:34;{4722.0763000026345,2426.624300001189,0.0}
Trams147;14;3;78331;6:34;{7477.508000001311,3581.729000000283,0.0}
Trams141;14;7;78339;6:35;{2894.896500002593,514.0241999980062,0.0}
Trams143;14;8;78339;6:35;{4031.8555000014603,2128.9623999986798,0.0}
Trams146;14;6;78340;6:35;{7267.007879060962,3598.2324644667874,0.0}
Trams183;18;7;78345;6:36;{845.340600002557,806.1041999999434,0.0}
Trams146;14;4;78345;6:36;{7477.508000001311,3581.729000000283,0.0}
Trams146;14;3;78346;6:36;{7477.508000001311,3581.729000000283,0.0}
Trams184;18;10;78349;6:37;{3035.1652000024915,1729.7097000014037,0.0}
Trams141;14;12;78351;6:37;{2597.49450000003,904.9190000016242,0.0}
Trams149;14;8;78351;6:37;{5058.904000002891,2546.714799998328,0.0}
Trams182;18;5;78352;6:37;{2992.747200001031,1703.0900999996811,0.0}
Trams185;18;17;78353;6:37;{5739.764803540053,2830.2159521656795,0.0}
Trams145;14;5;78354;6:38;{7223.311400000006,3570.043500000611,0.0}
Trams142;14;8;78357;6:38;{2894.896500002593,514.0241999980062,0.0}
Trams141;14;19;78359;6:38;{2839.1857000030577,1180.8036000002176,0.0}
Trams149;14;9;78359;6:38;{4672.309900000691,2395.577299999073,0.0}
Trams145;14;3;78360;6:39;{7477.508000001311,3581.729000000283,0.0}
Trams182;18;8;78361;6:39;{2589.0274000018835,1538.5219000000507,0.0}
Trams185;18;18;78363;6:39;{6221.943900000304,2968.579499999061,0.0}
Trams183;18;9;78367;6:40;{1782.5218000002205,1208.6106000002474,0.0}
Trams142;14;12;78369;6:40;{2597.49450000003,904.9190000016242,0.0}
Trams182;18;7;78372;6:41;{2064.0685709043055,1320.5282183098925,0.0}
Trams149;14;7;78373;6:41;{4031.8555000014603,2128.9623999986798,0.0}
Trams143;14;7;78375;6:41;{2774.94460455129,1095.9101807449765,0.0}
Trams181;18;9;78377;6:41;{5058.904000002891,2546.714799998328,0.0}
Trams144;14;6;78380;6:42;{7477.508000001311,3581.729000000283,0.0}
Trams144;14;4;78381;6:42;{7477.508000001311,3581.729000000283,0.0}
Trams183;18;10;78385;6:43;{2627.1466000005603,1561.507400000468,0.0}
Trams146;14;4;78389;6:43;{5634.466500002891,2784.006800001487,0.0}
Trams182;18;6;78391;6:44;{1208.916700001806,962.1525999996811,0.0}
Trams142;14;11;78391;6:44;{3084.0353342962862,1747.4296273253601,0.0}
Trams143;14;8;78392;6:44;{2894.896500002593,514.0241999980062,0.0}
Trams185;18;2;78393;6:44;{7477.508000001311,3581.729000000283,0.0}
Trams184;18;14;78394;6:44;{5123.508700001985,2583.745899999514,0.0}
Trams182;18;3;78400;6:45;{845.340600002557,806.1041999999434,0.0}
Trams146;14;5;78401;6:45;{5058.904000002891,2546.714799998328,0.0}
Trams143;14;14;78404;6:46;{2597.49450000003,904.9190000016242,0.0}
Trams184;18;20;78406;6:46;{5689.812200002372,2815.7713999990374,0.0}
Trams184;18;19;78407;6:46;{5739.764803540053,2830.2159521656795,0.0}
Trams149;14;8;78408;6:47;{2808.1955000013113,1135.889900000766,0.0}
Trams143;14;18;78412;6:47;{2839.1857000030577,1180.8036000002176,0.0}
Trams149;14;7;78416;6:48;{2567.6414284064917,825.1840510346515,0.0}
Trams184;18;20;78417;6:48;{6221.943900000304,2968.579499999061,0.0}
Trams182;18;5;78422;6:49;{1782.5218000002205,1208.6106000002474,0.0}
Trams146;14;4;78422;6:49;{4048.297289360261,2135.7927898531034,0.0}
Trams142;14;13;78426;6:50;{4722.0763000026345,2426.624300001189,0.0}
Trams183;18;9;78429;6:50;{4707.823850244834,2420.7529164061234,0.0}
Trams141;14;23;78429;6:50;{5689.812200002372,2815.7713999990374,0.0}
Trams182;18;7;78430;6:50;{2149.2538000009954,1363.784799998626,0.0}
Trams141;14;22;78430;6:50;{5739.764803540053,2830.2159521656795,0.0}
Trams149;14;9;78438;6:52;{2597.49450000003,904.9190000016242,0.0}
Trams141;14;21;78440;6:52;{6221.943900000304,2968.579499999061,0.0}
Trams184;18;19;78441;6:52;{7223.311400000006,3570.043500000611,0.0}
Trams149;14;11;78446;6:53;{2839.1857000030577,1180.8036000002176,0.0}
Trams184;18;3;78447;6:53;{7477.508000001311,3581.729000000283,0.0}
Trams184;18;1;78448;6:53;{7477.508000001311,3581.729000000283,0.0}
Trams182;18;8;78449;6:53;{3035.1652000024915,1729.7097000014037,0.0}
Trams141;14;20;78455;6:54;{6864.837443928478,3341.6995773341046,0.0}
Trams185;18;3;78457;6:55;{4672.309900000691,2395.577299999073,0.0}
Trams143;14;20;78461;6:55;{4722.0763000026345,2426.624300001189,0.0}
Trams183;18;10;78462;6:56;{6221.943900000304,2968.579499999061,0.0}
Trams148;14;5;78466;6:56;{2839.1857000030577,1180.8036000002176,0.0}
Trams181;18;8;78469;6:57;{845.340600002557,806.1041999999434,0.0}
Trams141;14;6;78470;6:57;{7477.508000001311,3581.729000000283,0.0}
Trams143;14;21;78470;6:57;{5123.508700001985,2583.745899999514,0.0}
Trams182;18;9;78471;6:57;{4084.1569000035524,2161.088000001386,0.0}
Trams185;18;4;78471;6:57;{4031.8555000014603,2128.9623999986798,0.0}
Trams146;14;3;78476;6:58;{2894.896500002593,514.0241999980062,0.0}
Trams183;18;9;78478;6:58;{6883.719200000167,3354.242599999532,0.0}
Trams148;14;4;78480;6:59;{3084.0353342962862,1747.4296273253601,0.0}
Trams143;14;22;78482;6:59;{5689.812200002372,2815.7713999990374,0.0}
Trams142;14;12;78483;6:59;{7267.007879060962,3598.2324644667874,0.0}
Trams182;18;12;78485;6:59;{4722.0763000026345,2426.624300001189,0.0}
Trams142;14;7;78488;7:0;{7477.508000001311,3581.729000000283,0.0}
Trams142;14;6;78489;7:0;{7477.508000001311,3581.729000000283,0.0}
Trams145;14;5;78491;7:0;{2894.896500002593,514.0241999980062,0.0}
Trams183;18;7;78492;7:1;{7477.508000001311,3581.729000000283,0.0}
Trams182;18;11;78493;7:1;{5108.905971347362,2577.745680309252,0.0}
Trams182;18;15;78494;7:1;{5123.508700001985,2583.745899999514,0.0}
Trams149;14;12;78495;7:1;{4722.0763000026345,2426.624300001189,0.0}
Trams146;14;4;78496;7:1;{2839.1857000030577,1180.8036000002176,0.0}
Trams181;18;15;78499;7:2;{2149.2538000009954,1363.784799998626,0.0}
Trams141;14;7;78502;7:2;{6188.119100000709,2954.7112999986857,0.0}
Trams184;18;2;78503;7:2;{5058.904000002891,2546.714799998328,0.0}
Trams141;14;6;78503;7:2;{6138.21238208538,2940.1058384544613,0.0}
Trams145;14;8;78503;7:2;{2597.49450000003,904.9190000016242,0.0}
Trams149;14;14;78504;7:3;{5123.508700001985,2583.745899999514,0.0}
Trams182;18;21;78506;7:3;{5689.812200002372,2815.7713999990374,0.0}
Trams181;18;16;78509;7:3;{2627.1466000005603,1561.507400000468,0.0}
Trams143;14;21;78509;7:3;{6883.719200000167,3354.242599999532,0.0}
Trams184;18;3;78511;7:4;{4672.309900000691,2395.577299999073,0.0}
Trams144;14;6;78511;7:4;{2894.896500002593,514.0241999980062,0.0}
Trams145;14;10;78511;7:4;{2839.1857000030577,1180.8036000002176,0.0}
Trams141;14;7;78514;7:4;{5634.466500002891,2784.006800001487,0.0}
Trams148;14;9;78515;7:4;{4722.0763000026345,2426.624300001189,0.0}
Trams147;14;4;78516;7:5;{4084.1569000035524,2161.088000001386,0.0}
Trams182;18;22;78517;7:5;{6221.943900000304,2968.579499999061,0.0}
Trams149;14;13;78517;7:5;{5739.764803540053,2830.2159521656795,0.0}
Trams143;14;8;78523;7:6;{7477.508000001311,3581.729000000283,0.0}
Trams144;14;11;78523;7:6;{2597.49450000003,904.9190000016242,0.0}
Trams148;14;10;78524;7:6;{5123.508700001985,2583.745899999514,0.0}
Trams184;18;2;78525;7:6;{4031.8555000014603,2128.9623999986798,0.0}
Trams145;14;9;78525;7:6;{3084.0353342962862,1747.4296273253601,0.0}
Trams149;14;14;78527;7:6;{6221.943900000304,2968.579499999061,0.0}
Trams147;14;6;78530;7:7;{4722.0763000026345,2426.624300001189,0.0}
Trams144;14;17;78531;7:7;{2839.1857000030577,1180.8036000002176,0.0}
Trams148;14;15;78536;7:8;{5689.812200002372,2815.7713999990374,0.0}
Trams147;14;7;78539;7:8;{5123.508700001985,2583.745899999514,0.0}
Trams181;18;17;78540;7:9;{4084.1569000035524,2161.088000001386,0.0}
Trams185;18;2;78541;7:9;{845.340600002557,806.1041999999434,0.0}
Trams149;14;13;78543;7:9;{6883.719200000167,3354.242599999532,0.0}
Trams146;14;7;78545;7:9;{4722.0763000026345,2426.624300001189,0.0}
Trams182;18;4;78547;7:10;{7477.508000001311,3581.729000000283,0.0}
Trams148;14;16;78547;7:10;{6221.943900000304,2968.579499999061,0.0}
Trams182;18;3;78548;7:10;{7477.508000001311,3581.729000000283,0.0}
Trams141;14;8;78548;7:10;{4031.8555000014603,2128.9623999986798,0.0}
Trams147;14;8;78551;7:10;{5689.812200002372,2815.7713999990374,0.0}
Trams147;14;7;78552;7:11;{5739.764803540053,2830.2159521656795,0.0}
Trams181;18;19;78554;7:11;{4722.0763000026345,2426.624300001189,0.0}
Trams146;14;9;78554;7:11;{5123.508700001985,2583.745899999514,0.0}
Trams184;18;3;78556;7:11;{2589.0274000018835,1538.5219000000507,0.0}
Trams149;14;7;78557;7:11;{7477.508000001311,3581.729000000283,0.0}
Trams149;14;5;78558;7:12;{7477.508000001311,3581.729000000283,0.0}
Trams181;18;21;78563;7:12;{5123.508700001985,2583.745899999514,0.0}
Trams185;18;12;78563;7:12;{1782.5218000002205,1208.6106000002474,0.0}
Trams144;14;19;78566;7:13;{4084.1569000035524,2161.088000001386,0.0}
Trams146;14;10;78566;7:13;{5689.812200002372,2815.7713999990374,0.0}
Trams143;14;9;78567;7:13;{5634.466500002891,2784.006800001487,0.0}
Trams145;14;10;78569;7:13;{5123.508700001985,2583.745899999514,0.0}
Trams141;14;7;78570;7:14;{2992.747200001031,1703.0900999996811,0.0}
Trams185;18;18;78571;7:14;{2149.2538000009954,1363.784799998626,0.0}
Trams181;18;23;78575;7:14;{5689.812200002372,2815.7713999990374,0.0}
Trams184;18;1;78575;7:14;{1692.722305299079,1166.6255241828771,0.0}
Trams146;14;11;78577;7:15;{6221.943900000304,2968.579499999061,0.0}
Trams148;14;3;78577;7:15;{7477.508000001311,3581.729000000283,0.0}
Trams148;14;2;78578;7:15;{7477.508000001311,3581.729000000283,0.0}
Trams144;14;23;78580;7:15;{4722.0763000026345,2426.624300001189,0.0}
Trams185;18;22;78581;7:15;{2627.1466000005603,1561.507400000468,0.0}
Trams141;14;6;78584;7:16;{2774.94460455129,1095.9101807449765,0.0}
Trams144;14;24;78589;7:17;{5123.508700001985,2583.745899999514,0.0}
Trams182;18;4;78591;7:17;{5634.466500002891,2784.006800001487,0.0}
Trams145;14;9;78592;7:17;{6221.943900000304,2968.579499999061,0.0}
Trams147;14;3;78592;7:17;{7477.508000001311,3581.729000000283,0.0}
Trams181;18;22;78594;7:18;{6593.146138654794,3149.575753243163,0.0}
Trams141;14;19;78601;7:19;{2894.896500002593,514.0241999980062,0.0}
Trams182;18;5;78603;7:19;{5058.904000002891,2546.714799998328,0.0}
Trams146;14;3;78607;7:20;{7477.508000001311,3581.729000000283,0.0}
Trams146;14;2;78608;7:20;{7477.508000001311,3581.729000000283,0.0}
Trams181;18;20;78611;7:20;{7267.007879060962,3598.2324644667874,0.0}
Trams182;18;6;78611;7:20;{4672.309900000691,2395.577299999073,0.0}
Trams185;18;23;78612;7:21;{4084.1569000035524,2161.088000001386,0.0}
Trams141;14;24;78613;7:21;{2597.49450000003,904.9190000016242,0.0}
Trams181;18;7;78616;7:21;{7477.508000001311,3581.729000000283,0.0}
Trams181;18;5;78617;7:21;{7477.508000001311,3581.729000000283,0.0}
Trams184;18;7;78617;7:21;{1782.5218000002205,1208.6106000002474,0.0}
Trams142;14;9;78619;7:22;{2894.896500002593,514.0241999980062,0.0}
Trams144;14;23;78621;7:22;{6609.992500003427,3161.7836000006646,0.0}
Trams145;14;4;78622;7:22;{7477.508000001311,3581.729000000283,0.0}
Trams145;14;3;78623;7:22;{7477.508000001311,3581.729000000283,0.0}
Trams184;18;13;78625;7:23;{2149.2538000009954,1363.784799998626,0.0}
Trams185;18;24;78626;7:23;{4722.0763000026345,2426.624300001189,0.0}
Trams142;14;23;78631;7:24;{2597.49450000003,904.9190000016242,0.0}
Trams184;18;20;78635;7:24;{2627.1466000005603,1561.507400000468,0.0}
Trams141;14;23;78635;7:24;{3084.0353342962862,1747.4296273253601,0.0}
Trams147;14;4;78636;7:25;{5634.466500002891,2784.006800001487,0.0}
Trams142;14;24;78639;7:25;{2839.1857000030577,1180.8036000002176,0.0}
Trams1411;14;18;78639;7:25;{2839.1857000030577,1180.8036000002176,0.0}
Trams183;18;8;78640;7:25;{845.340600002557,806.1041999999434,0.0}
Trams144;14;5;78642;7:26;{7477.508000001311,3581.729000000283,0.0}
Trams144;14;4;78643;7:26;{7477.508000001311,3581.729000000283,0.0}
Trams185;18;23;78648;7:27;{5739.764803540053,2830.2159521656795,0.0}
Trams143;14;13;78654;7:28;{2894.896500002593,514.0241999980062,0.0}
Trams182;18;7;78656;7:28;{2589.0274000018835,1538.5219000000507,0.0}
Trams185;18;24;78658;7:28;{6221.943900000304,2968.579499999061,0.0}
Trams183;18;7;78661;7:29;{1768.882714616512,1202.84636491075,0.0}
Trams183;18;8;78662;7:29;{1782.5218000002205,1208.6106000002474,0.0}
Trams143;14;24;78666;7:30;{2597.49450000003,904.9190000016242,0.0}
Trams147;14;3;78669;7:30;{4048.297289360261,2135.7927898531034,0.0}
Trams183;18;14;78670;7:30;{2149.2538000009954,1363.784799998626,0.0}
Trams141;14;24;78670;7:30;{4722.0763000026345,2426.624300001189,0.0}
Trams182;18;8;78674;7:31;{1740.6504000015557,1186.7970000002533,0.0}
Trams1410;14;3;78674;7:31;{2839.1857000030577,1180.8036000002176,0.0}
Trams181;18;6;78680;7:32;{4672.309900000691,2395.577299999073,0.0}
Trams183;18;15;78680;7:32;{2627.1466000005603,1561.507400000468,0.0}
Trams184;18;24;78680;7:32;{4722.0763000026345,2426.624300001189,0.0}
Trams182;18;6;78685;7:33;{1213.7785956119094,964.194963392883,0.0}
Trams182;18;7;78686;7:33;{1208.916700001806,962.1525999996811,0.0}
Trams143;14;23;78687;7:33;{3035.1652000024915,1729.7097000014037,0.0}
Trams185;18;3;78688;7:33;{7477.508000001311,3581.729000000283,0.0}
Trams149;14;8;78688;7:33;{2894.896500002593,514.0241999980062,0.0}
Trams1411;14;24;78688;7:33;{4722.0763000026345,2426.624300001189,0.0}
Trams185;18;2;78689;7:33;{7477.508000001311,3581.729000000283,0.0}
Trams182;18;4;78695;7:34;{845.340600002557,806.1041999999434,0.0}
Trams182;18;5;78697;7:35;{902.5305000022054,834.7037000004202,0.0}
Trams144;14;5;78698;7:35;{5058.904000002891,2546.714799998328,0.0}
Trams149;14;12;78700;7:35;{2597.49450000003,904.9190000016242,0.0}
Trams144;14;6;78706;7:36;{4672.309900000691,2395.577299999073,0.0}
Trams148;14;6;78708;7:37;{2894.896500002593,514.0241999980062,0.0}
Trams149;14;15;78708;7:37;{2839.1857000030577,1180.8036000002176,0.0}
Trams143;14;24;78709;7:37;{4084.1569000035524,2161.088000001386,0.0}
Trams181;18;7;78716;7:38;{2992.747200001031,1703.0900999996811,0.0}
Trams182;18;9;78717;7:38;{1782.5218000002205,1208.6106000002474,0.0}
Trams144;14;5;78720;7:39;{4031.8555000014603,2128.9623999986798,0.0}
Trams148;14;15;78720;7:39;{2597.49450000003,904.9190000016242,0.0}
Trams147;14;6;78723;7:39;{2894.896500002593,514.0241999980062,0.0}
Trams1410;14;11;78723;7:39;{4722.0763000026345,2426.624300001189,0.0}
Trams182;18;14;78725;7:39;{2149.2538000009954,1363.784799998626,0.0}
Trams148;14;16;78728;7:40;{2839.1857000030577,1180.8036000002176,0.0}
Trams185;18;5;78732;7:41;{5634.466500002891,2784.006800001487,0.0}
Trams141;14;5;78732;7:41;{7477.508000001311,3581.729000000283,0.0}
Trams1410;14;24;78732;7:41;{5123.508700001985,2583.745899999514,0.0}
Trams183;18;24;78734;7:41;{5123.508700001985,2583.745899999514,0.0}
Trams182;18;15;78735;7:41;{2627.1466000005603,1561.507400000468,0.0}
Trams147;14;11;78735;7:41;{2597.49450000003,904.9190000016242,0.0}
Trams184;18;23;78737;7:41;{7267.007879060962,3598.2324644667874,0.0}
Trams146;14;5;78738;7:42;{2894.896500002593,514.0241999980062,0.0}
Trams184;18;2;78742;7:42;{7477.508000001311,3581.729000000283,0.0}
Trams144;14;4;78742;7:42;{2992.747200001031,1703.0900999996811,0.0}
Trams184;18;1;78743;7:42;{7477.508000001311,3581.729000000283,0.0}
Trams181;18;6;78744;7:43;{1692.722305299079,1166.6255241828771,0.0}
Trams185;18;6;78744;7:43;{5058.904000002891,2546.714799998328,0.0}
Trams142;14;5;78750;7:44;{7477.508000001311,3581.729000000283,0.0}
Trams146;14;7;78750;7:44;{2597.49450000003,904.9190000016242,0.0}
Trams1411;14;1;78750;7:44;{7477.508000001311,3581.729000000283,0.0}
Trams145;14;5;78753;7:44;{2894.896500002593,514.0241999980062,0.0}
Trams181;18;5;78754;7:44;{1213.7785956119094,964.194963392883,0.0}
Trams1410;14;23;78756;7:45;{6271.932036142039,2982.903802087056,0.0}
Trams147;14;10;78757;7:45;{3084.0353342962862,1747.4296273253601,0.0}
Trams149;14;19;78757;7:45;{4722.0763000026345,2426.624300001189,0.0}
Trams146;14;11;78758;7:45;{2839.1857000030577,1180.8036000002176,0.0}
Trams143;14;23;78763;7:46;{6593.146138654794,3149.575753243163,0.0}
Trams148;14;17;78763;7:46;{4084.1569000035524,2161.088000001386,0.0}
Trams181;18;4;78764;7:46;{845.340600002557,806.1041999999434,0.0}
Trams143;14;24;78764;7:46;{6609.992500003427,3161.7836000006646,0.0}
Trams1410;14;22;78764;7:46;{6609.992500003427,3161.7836000006646,0.0}
Trams145;14;10;78765;7:46;{2597.49450000003,904.9190000016242,0.0}
Trams182;18;14;78766;7:46;{4084.1569000035524,2161.088000001386,0.0}
Trams149;14;21;78766;7:46;{5123.508700001985,2583.745899999514,0.0}
Trams183;18;23;78773;7:47;{6883.719200000167,3354.242599999532,0.0}
Trams144;14;7;78773;7:47;{2894.896500002593,514.0241999980062,0.0}
Trams148;14;21;78777;7:48;{4722.0763000026345,2426.624300001189,0.0}
Trams147;14;11;78778;7:48;{4084.1569000035524,2161.088000001386,0.0}
Trams149;14;24;78778;7:48;{5689.812200002372,2815.7713999990374,0.0}
Trams1410;14;21;78779;7:48;{7223.311400000006,3570.043500000611,0.0}
Trams143;14;23;78780;7:49;{7267.007879060962,3598.2324644667874,0.0}
Trams143;14;5;78785;7:49;{7477.508000001311,3581.729000000283,0.0}
Trams144;14;9;78785;7:49;{2597.49450000003,904.9190000016242,0.0}
Trams1410;14;0;78785;7:49;{7477.508000001311,3581.729000000283,0.0}
Trams181;18;10;78786;7:50;{1782.5218000002205,1208.6106000002474,0.0}
Trams184;18;2;78786;7:50;{5634.466500002891,2784.006800001487,0.0}
Trams143;14;4;78786;7:50;{7477.508000001311,3581.729000000283,0.0}
Trams148;14;23;78786;7:50;{5123.508700001985,2583.745899999514,0.0}
Trams183;18;4;78787;7:50;{7477.508000001311,3581.729000000283,0.0}
Trams141;14;6;78788;7:50;{5058.904000002891,2546.714799998328,0.0}
Trams144;14;16;78793;7:51;{2839.1857000030577,1180.8036000002176,0.0}
Trams181;18;18;78794;7:51;{2149.2538000009954,1363.784799998626,0.0}
Trams185;18;5;78797;7:51;{2589.0274000018835,1538.5219000000507,0.0}
Trams148;14;24;78798;7:52;{5689.812200002372,2815.7713999990374,0.0}
Trams182;18;24;78801;7:52;{5689.812200002372,2815.7713999990374,0.0}
Trams147;14;12;78801;7:52;{5123.508700001985,2583.745899999514,0.0}
Trams181;18;21;78804;7:53;{2627.1466000005603,1561.507400000468,0.0}
Trams149;14;23;78805;7:53;{6883.719200000167,3354.242599999532,0.0}
Trams144;14;15;78806;7:53;{3035.1652000024915,1729.7097000014037,0.0}
Trams146;14;14;78807;7:53;{4722.0763000026345,2426.624300001189,0.0}
Trams185;18;3;78808;7:53;{2064.0685709043055,1320.5282183098925,0.0}
Trams145;14;9;78809;7:53;{4132.967545312427,2178.980077572535,0.0}
Trams147;14;23;78813;7:54;{5689.812200002372,2815.7713999990374,0.0}
Trams146;14;16;78816;7:55;{5123.508700001985,2583.745899999514,0.0}
Trams143;14;5;78817;7:55;{6188.119100000709,2954.7112999986857,0.0}
Trams149;14;5;78819;7:55;{7477.508000001311,3581.729000000283,0.0}
Trams149;14;4;78820;7:55;{7477.508000001311,3581.729000000283,0.0}
Trams145;14;11;78822;7:56;{4722.0763000026345,2426.624300001189,0.0}
Trams146;14;18;78828;7:57;{5689.812200002372,2815.7713999990374,0.0}
Trams143;14;6;78829;7:57;{5634.466500002891,2784.006800001487,0.0}
Trams183;18;5;78831;7:57;{5634.466500002891,2784.006800001487,0.0}
Trams145;14;12;78831;7:57;{5123.508700001985,2583.745899999514,0.0}
Trams141;14;5;78832;7:57;{2992.747200001031,1703.0900999996811,0.0}
Trams185;18;2;78836;7:58;{845.340600002557,806.1041999999434,0.0}
Trams182;18;23;78837;7:58;{7267.007879060962,3598.2324644667874,0.0}
Trams148;14;3;78839;7:58;{7477.508000001311,3581.729000000283,0.0}
Trams148;14;2;78840;7:59;{7477.508000001311,3581.729000000283,0.0}
Trams144;14;14;78841;7:59;{4707.823850244834,2420.7529164061234,0.0}
Trams182;18;2;78842;7:59;{7477.508000001311,3581.729000000283,0.0}
Trams144;14;16;78842;7:59;{4722.0763000026345,2426.624300001189,0.0}
Trams145;14;15;78843;7:59;{5689.812200002372,2815.7713999990374,0.0}
Trams143;14;7;78849;8:0;{4672.309900000691,2395.577299999073,0.0}
Trams183;18;7;78851;8:0;{4672.309900000691,2395.577299999073,0.0}
Trams144;14;19;78851;8:0;{5123.508700001985,2583.745899999514,0.0}
Trams147;14;2;78854;8:1;{7477.508000001311,3581.729000000283,0.0}
Trams146;14;17;78855;8:1;{6883.719200000167,3354.242599999532,0.0}
Trams181;18;22;78858;8:2;{5123.508700001985,2583.745899999514,0.0}
Trams185;18;6;78858;8:2;{1782.5218000002205,1208.6106000002474,0.0}
Trams184;18;3;78861;8:2;{2110.2352000027895,1344.0613000001758,0.0}
Trams141;14;19;78863;8:2;{2894.896500002593,514.0241999980062,0.0}
Trams143;14;6;78863;8:2;{4031.8555000014603,2128.9623999986798,0.0}
Trams146;14;16;78863;8:2;{7223.311400000006,3570.043500000611,0.0}
Trams149;14;5;78863;8:2;{5634.466500002891,2784.006800001487,0.0}
Trams141;14;21;78864;8:3;{2892.683600001037,511.3241000007838,0.0}
Trams185;18;11;78866;8:3;{2149.2538000009954,1363.784799998626,0.0}
Trams146;14;1;78869;8:3;{7477.508000001311,3581.729000000283,0.0}
Trams145;14;14;78870;8:4;{6883.719200000167,3354.242599999532,0.0}
Trams141;14;24;78875;8:4;{2597.49450000003,904.9190000016242,0.0}
Trams185;18;19;78876;8:5;{2627.1466000005603,1561.507400000468,0.0}
Trams142;14;6;78881;8:5;{2894.896500002593,514.0241999980062,0.0}
Trams145;14;3;78884;8:6;{7477.508000001311,3581.729000000283,0.0}
Trams143;14;4;78885;8:6;{2992.747200001031,1703.0900999996811,0.0}
Trams182;18;4;78886;8:6;{5634.466500002891,2784.006800001487,0.0}
Trams144;14;18;78889;8:7;{6864.837443928478,3341.6995773341046,0.0}
Trams184;18;2;78890;8:7;{845.340600002557,806.1041999999434,0.0}
Trams142;14;21;78893;8:7;{2597.49450000003,904.9190000016242,0.0}
Trams183;18;9;78896;8:8;{2589.0274000018835,1538.5219000000507,0.0}
Trams182;18;6;78898;8:8;{5058.904000002891,2546.714799998328,0.0}
Trams142;14;24;78901;8:9;{2839.1857000030577,1180.8036000002176,0.0}
Trams1411;14;8;78901;8:9;{2839.1857000030577,1180.8036000002176,0.0}
Trams144;14;4;78904;8:9;{7477.508000001311,3581.729000000283,0.0}
Trams183;18;8;78907;8:10;{2064.0685709043055,1320.5282183098925,0.0}
Trams181;18;2;78911;8:10;{7477.508000001311,3581.729000000283,0.0}
Trams184;18;3;78912;8:11;{1782.5218000002205,1208.6106000002474,0.0}
Trams142;14;23;78915;8:11;{3084.0353342962862,1747.4296273253601,0.0}
Trams143;14;5;78916;8:11;{2894.896500002593,514.0241999980062,0.0}
Trams149;14;4;78919;8:12;{2992.747200001031,1703.0900999996811,0.0}
Trams184;18;6;78920;8:12;{2149.2538000009954,1363.784799998626,0.0}
Trams185;18;21;78921;8:12;{4722.0763000026345,2426.624300001189,0.0}
Trams146;14;2;78925;8:13;{5058.904000002891,2546.714799998328,0.0}
Trams143;14;9;78928;8:13;{2597.49450000003,904.9190000016242,0.0}
Trams184;18;10;78930;8:14;{2627.1466000005603,1561.507400000468,0.0}
Trams185;18;24;78930;8:14;{5123.508700001985,2583.745899999514,0.0}
Trams183;18;4;78935;8:14;{845.340600002557,806.1041999999434,0.0}
Trams142;14;24;78936;8:15;{4084.1569000035524,2161.088000001386,0.0}
Trams143;14;14;78936;8:15;{2839.1857000030577,1180.8036000002176,0.0}
Trams1411;14;7;78937;8:15;{4132.967545312427,2178.980077572535,0.0}
Trams141;14;23;78940;8:15;{5108.905971347362,2577.745680309252,0.0}
Trams145;14;4;78940;8:15;{5058.904000002891,2546.714799998328,0.0}
Trams141;14;24;78941;8:15;{5123.508700001985,2583.745899999514,0.0}
Trams149;14;9;78950;8:17;{2894.896500002593,514.0241999980062,0.0}
Trams182;18;5;78951;8:17;{2589.0274000018835,1538.5219000000507,0.0}
Trams185;18;23;78954;8:18;{6271.932036142039,2982.903802087056,0.0}
Trams181;18;3;78955;8:18;{5634.466500002891,2784.006800001487,0.0}
Trams183;18;5;78957;8:18;{1782.5218000002205,1208.6106000002474,0.0}
Trams1411;14;9;78959;8:18;{5123.508700001985,2583.745899999514,0.0}
Trams182;18;4;78961;8:19;{2110.2352000027895,1344.0613000001758,0.0}
Trams184;18;9;78962;8:19;{4132.967545312427,2178.980077572535,0.0}
Trams149;14;10;78962;8:19;{2597.49450000003,904.9190000016242,0.0}
Trams181;18;6;78967;8:20;{5058.904000002891,2546.714799998328,0.0}
Trams185;18;22;78968;8:20;{6864.837443928478,3341.6995773341046,0.0}
Trams182;18;3;78969;8:20;{1740.6504000015557,1186.7970000002533,0.0}
Trams148;14;3;78970;8:20;{2894.896500002593,514.0241999980062,0.0}
Trams149;14;11;78970;8:20;{2839.1857000030577,1180.8036000002176,0.0}
Trams143;14;15;78971;8:20;{4084.1569000035524,2161.088000001386,0.0}
Trams1411;14;12;78971;8:20;{5689.812200002372,2815.7713999990374,0.0}
Trams141;14;23;78972;8:21;{6593.146138654794,3149.575753243163,0.0}
Trams143;14;14;78972;8:21;{4132.967545312427,2178.980077572535,0.0}
Trams181;18;7;78975;8:21;{4672.309900000691,2395.577299999073,0.0}
Trams183;18;9;78975;8:21;{2627.1466000005603,1561.507400000468,0.0}
Trams184;18;11;78975;8:21;{4722.0763000026345,2426.624300001189,0.0}
Trams146;14;1;78982;8:22;{2808.1955000013113,1135.889900000766,0.0}
Trams148;14;4;78982;8:22;{2597.49450000003,904.9190000016242,0.0}
Trams185;18;1;78983;8:22;{7477.508000001311,3581.729000000283,0.0}
Trams184;18;13;78984;8:23;{5123.508700001985,2583.745899999514,0.0}
Trams145;14;3;78984;8:23;{2992.747200001031,1703.0900999996811,0.0}
Trams143;14;13;78985;8:23;{4722.0763000026345,2426.624300001189,0.0}
Trams148;14;6;78990;8:24;{2839.1857000030577,1180.8036000002176,0.0}
Trams141;14;5;78994;8:24;{7477.508000001311,3581.729000000283,0.0}
Trams141;14;3;78995;8:24;{7477.508000001311,3581.729000000283,0.0}
Trams184;18;16;78996;8:25;{5689.812200002372,2815.7713999990374,0.0}
Trams142;14;23;78997;8:25;{6864.837443928478,3341.6995773341046,0.0}
Trams147;14;3;78997;8:25;{2597.49450000003,904.9190000016242,0.0}
Trams142;14;22;78998;8:25;{6883.719200000167,3354.242599999532,0.0}
Trams147;14;5;79005;8:26;{2839.1857000030577,1180.8036000002176,0.0}
Trams149;14;12;79005;8:26;{4084.1569000035524,2161.088000001386,0.0}
Trams181;18;6;79011;8:27;{2992.747200001031,1703.0900999996811,0.0}
Trams182;18;6;79012;8:27;{1782.5218000002205,1208.6106000002474,0.0}
Trams142;14;6;79012;8:27;{7477.508000001311,3581.729000000283,0.0}
Trams1411;14;1;79012;8:27;{7477.508000001311,3581.729000000283,0.0}
Trams142;14;5;79013;8:27;{7477.508000001311,3581.729000000283,0.0}
Trams184;18;15;79015;8:28;{6593.146138654794,3149.575753243163,0.0}
Trams185;18;3;79015;8:28;{6188.119100000709,2954.7112999986857,0.0}
Trams145;14;4;79015;8:28;{2894.896500002593,514.0241999980062,0.0}
Trams149;14;16;79019;8:28;{4722.0763000026345,2426.624300001189,0.0}
Trams182;18;11;79020;8:29;{2149.2538000009954,1363.784799998626,0.0}
Trams185;18;4;79027;8:30;{5634.466500002891,2784.006800001487,0.0}
Trams145;14;8;79027;8:30;{2597.49450000003,904.9190000016242,0.0}
Trams149;14;15;79027;8:30;{5108.905971347362,2577.745680309252,0.0}
Trams149;14;17;79028;8:30;{5123.508700001985,2583.745899999514,0.0}
Trams181;18;7;79030;8:30;{2110.2352000027895,1344.0613000001758,0.0}
Trams182;18;12;79030;8:30;{2627.1466000005603,1561.507400000468,0.0}
Trams144;14;5;79035;8:31;{2894.896500002593,514.0241999980062,0.0}
Trams145;14;9;79035;8:31;{2839.1857000030577,1180.8036000002176,0.0}
Trams184;18;2;79037;8:31;{7477.508000001311,3581.729000000283,0.0}
Trams141;14;4;79038;8:32;{5634.466500002891,2784.006800001487,0.0}
Trams148;14;8;79039;8:32;{4722.0763000026345,2426.624300001189,0.0}
Trams149;14;16;79040;8:32;{5689.812200002372,2815.7713999990374,0.0}
Trams183;18;8;79041;8:32;{5689.812200002372,2815.7713999990374,0.0}
Trams183;18;7;79042;8:32;{5739.764803540053,2830.2159521656795,0.0}
Trams143;14;12;79042;8:32;{7267.007879060962,3598.2324644667874,0.0}
Trams142;14;6;79044;8:33;{6188.119100000709,2954.7112999986857,0.0}
Trams143;14;4;79047;8:33;{7477.508000001311,3581.729000000283,0.0}
Trams144;14;6;79047;8:33;{2597.49450000003,904.9190000016242,0.0}
Trams148;14;9;79048;8:33;{5123.508700001985,2583.745899999514,0.0}
Trams141;14;5;79050;8:34;{5058.904000002891,2546.714799998328,0.0}
Trams142;14;7;79056;8:35;{5634.466500002891,2784.006800001487,0.0}
Trams181;18;5;79057;8:35;{874.5067790792331,818.4381949221134,0.0}
Trams181;18;2;79059;8:35;{845.340600002557,806.1041999999434,0.0}
Trams183;18;6;79060;8:35;{6593.146138654794,3149.575753243163,0.0}
Trams148;14;10;79060;8:35;{5689.812200002372,2815.7713999990374,0.0}
Trams185;18;3;79061;8:35;{4031.8555000014603,2128.9623999986798,0.0}
Trams147;14;7;79063;8:36;{5123.508700001985,2583.745899999514,0.0}
Trams149;14;15;79066;8:36;{6864.837443928478,3341.6995773341046,0.0}
Trams183;18;5;79068;8:37;{6883.719200000167,3354.242599999532,0.0}
Trams184;18;3;79069;8:37;{6188.119100000709,2954.7112999986857,0.0}
Trams142;14;6;79069;8:37;{5010.473492013262,2527.781076226536,0.0}
Trams148;14;9;79072;8:37;{6271.932036142039,2982.903802087056,0.0}
Trams147;14;9;79075;8:38;{5689.812200002372,2815.7713999990374,0.0}
Trams149;14;14;79075;8:38;{7223.311400000006,3570.043500000611,0.0}
Trams183;18;4;79077;8:38;{7267.007879060962,3598.2324644667874,0.0}
Trams146;14;3;79078;8:38;{5123.508700001985,2583.745899999514,0.0}
Trams181;18;6;79081;8:39;{1782.5218000002205,1208.6106000002474,0.0}
Trams184;18;4;79081;8:39;{5634.466500002891,2784.006800001487,0.0}
Trams149;14;3;79081;8:39;{7477.508000001311,3581.729000000283,0.0}
Trams183;18;2;79082;8:39;{7477.508000001311,3581.729000000283,0.0}
Trams145;14;10;79084;8:39;{4722.0763000026345,2426.624300001189,0.0}
Trams181;18;17;79089;8:40;{2149.2538000009954,1363.784799998626,0.0}
Trams142;14;5;79089;8:40;{4048.297289360261,2135.7927898531034,0.0}
Trams185;18;4;79092;8:41;{2589.0274000018835,1538.5219000000507,0.0}
Trams184;18;5;79093;8:41;{5058.904000002891,2546.714799998328,0.0}
Trams145;14;12;79093;8:41;{5123.508700001985,2583.745899999514,0.0}
Trams182;18;13;79096;8:41;{5689.812200002372,2815.7713999990374,0.0}
Trams181;18;19;79099;8:42;{2627.1466000005603,1561.507400000468,0.0}
Trams184;18;6;79101;8:42;{4672.309900000691,2395.577299999073,0.0}
Trams148;14;2;79101;8:42;{7477.508000001311,3581.729000000283,0.0}
Trams144;14;7;79104;8:43;{4722.0763000026345,2426.624300001189,0.0}
Trams148;14;1;79104;8:43;{7399.735580409566,3546.353579350148,0.0}
Trams181;18;17;79108;8:43;{3035.1652000024915,1729.7097000014037,0.0}
Trams182;18;12;79108;8:43;{6271.932036142039,2982.903802087056,0.0}
Trams141;14;4;79108;8:43;{2774.94460455129,1095.9101807449765,0.0}
Trams144;14;10;79113;8:44;{5123.508700001985,2583.745899999514,0.0}
Trams141;14;3;79115;8:44;{2567.6414284064917,825.1840510346515,0.0}
Trams147;14;2;79116;8:45;{7477.508000001311,3581.729000000283,0.0}
Trams182;18;11;79122;8:46;{6864.837443928478,3341.6995773341046,0.0}
Trams182;18;10;79123;8:46;{6883.719200000167,3354.242599999532,0.0}
Trams141;14;6;79125;8:46;{2894.896500002593,514.0241999980062,0.0}
Trams144;14;12;79125;8:46;{5689.812200002372,2815.7713999990374,0.0}
Trams185;18;1;79131;8:47;{845.340600002557,806.1041999999434,0.0}
Trams146;14;1;79131;8:47;{7477.508000001311,3581.729000000283,0.0}
Trams182;18;4;79137;8:48;{7477.508000001311,3581.729000000283,0.0}
Trams184;18;4;79137;8:48;{2992.747200001031,1703.0900999996811,0.0}
Trams141;14;21;79137;8:48;{2597.49450000003,904.9190000016242,0.0}
Trams142;14;8;79143;8:49;{2894.896500002593,514.0241999980062,0.0}
Trams181;18;18;79144;8:49;{4722.0763000026345,2426.624300001189,0.0}
Trams141;14;24;79145;8:49;{2839.1857000030577,1180.8036000002176,0.0}
Trams183;18;5;79146;8:50;{4672.309900000691,2395.577299999073,0.0}
Trams184;18;5;79146;8:50;{2589.0274000018835,1538.5219000000507,0.0}
Trams145;14;4;79146;8:50;{7477.508000001311,3581.729000000283,0.0}
Trams145;14;3;79147;8:50;{7477.508000001311,3581.729000000283,0.0}
Trams181;18;20;79153;8:51;{5123.508700001985,2583.745899999514,0.0}
Trams185;18;4;79153;8:51;{1782.5218000002205,1208.6106000002474,0.0}
Trams142;14;11;79155;8:51;{2597.49450000003,904.9190000016242,0.0}
Trams184;18;4;79156;8:51;{2110.2352000027895,1344.0613000001758,0.0}
Trams184;18;3;79157;8:51;{2064.0685709043055,1320.5282183098925,0.0}
Trams148;14;2;79157;8:51;{5058.904000002891,2546.714799998328,0.0}
Trams141;14;22;79159;8:52;{3084.0353342962862,1747.4296273253601,0.0}
Trams185;18;8;79161;8:52;{2149.2538000009954,1363.784799998626,0.0}
Trams142;14;15;79163;8:52;{2839.1857000030577,1180.8036000002176,0.0}
Trams181;18;24;79165;8:53;{5689.812200002372,2815.7713999990374,0.0}
Trams181;18;23;79166;8:53;{5739.764803540053,2830.2159521656795,0.0}
Trams144;14;3;79166;8:53;{7477.508000001311,3581.729000000283,0.0}
Trams185;18;9;79171;8:54;{2627.1466000005603,1561.507400000468,0.0}
Trams146;14;3;79175;8:54;{5634.466500002891,2784.006800001487,0.0}
Trams181;18;24;79176;8:55;{6221.943900000304,2968.579499999061,0.0}
Trams143;14;7;79178;8:55;{2894.896500002593,514.0241999980062,0.0}
Trams141;14;23;79180;8:55;{4084.1569000035524,2161.088000001386,0.0}
Trams182;18;5;79181;8:55;{5634.466500002891,2784.006800001487,0.0}
Trams183;18;4;79182;8:56;{2992.747200001031,1703.0900999996811,0.0}
Trams184;18;2;79185;8:56;{845.340600002557,806.1041999999434,0.0}
Trams146;14;5;79187;8:56;{5058.904000002891,2546.714799998328,0.0}
Trams143;14;8;79190;8:57;{2597.49450000003,904.9190000016242,0.0}
Trams183;18;6;79191;8:57;{2589.0274000018835,1538.5219000000507,0.0}
Trams182;18;6;79193;8:57;{5058.904000002891,2546.714799998328,0.0}
Trams141;14;24;79194;8:58;{4722.0763000026345,2426.624300001189,0.0}
Trams142;14;16;79198;8:58;{4084.1569000035524,2161.088000001386,0.0}
Trams143;14;10;79198;8:58;{2839.1857000030577,1180.8036000002176,0.0}
Trams183;18;7;79201;8:59;{2110.2352000027895,1344.0613000001758,0.0}
Trams181;18;5;79206;9:0;{7477.508000001311,3581.729000000283,0.0}
Trams181;18;2;79207;9:0;{7477.508000001311,3581.729000000283,0.0}
Trams184;18;5;79207;9:0;{1782.5218000002205,1208.6106000002474,0.0}
Trams146;14;4;79208;9:0;{4048.297289360261,2135.7927898531034,0.0}
Trams142;14;19;79212;9:1;{4722.0763000026345,2426.624300001189,0.0}
Trams185;18;8;79216;9:1;{4722.0763000026345,2426.624300001189,0.0}
Trams142;14;20;79221;9:2;{5123.508700001985,2583.745899999514,0.0}
Trams149;14;4;79224;9:3;{2597.49450000003,904.9190000016242,0.0}
Trams184;18;7;79225;9:3;{2627.1466000005603,1561.507400000468,0.0}
Trams183;18;3;79230;9:4;{845.340600002557,806.1041999999434,0.0}
Trams146;14;2;79231;9:4;{2992.747200001031,1703.0900999996811,0.0}
Trams148;14;1;79232;9:4;{2894.896500002593,514.0241999980062,0.0}
Trams142;14;22;79233;9:4;{5689.812200002372,2815.7713999990374,0.0}
Trams142;14;21;79234;9:4;{5739.764803540053,2830.2159521656795,0.0}
Trams181;18;4;79238;9:5;{6188.119100000709,2954.7112999986857,0.0}
Trams185;18;7;79238;9:5;{5739.764803540053,2830.2159521656795,0.0}
Trams141;14;23;79242;9:6;{6883.719200000167,3354.242599999532,0.0}
Trams142;14;22;79244;9:6;{6221.943900000304,2968.579499999061,0.0}
Trams185;18;6;79256;9:8;{6593.146138654794,3149.575753243163,0.0}
Trams141;14;5;79256;9:8;{7477.508000001311,3581.729000000283,0.0}
Trams141;14;3;79257;9:8;{7477.508000001311,3581.729000000283,0.0}
Trams146;14;1;79262;9:9;{2894.896500002593,514.0241999980062,0.0}
Trams182;18;4;79265;9:9;{1692.722305299079,1166.6255241828771,0.0}
Trams142;14;5;79274;9:11;{7477.508000001311,3581.729000000283,0.0}
Trams142;14;4;79275;9:11;{7477.508000001311,3581.729000000283,0.0}
Trams185;18;2;79278;9:12;{7477.508000001311,3581.729000000283,0.0}
Trams185;18;0;79279;9:12;{7477.508000001311,3581.729000000283,0.0}
Trams143;14;9;79287;9:13;{6593.146138654794,3149.575753243163,0.0}
Trams143;14;8;79303;9:16;{7223.311400000006,3570.043500000611,0.0}
Trams181;18;3;79306;9:16;{2992.747200001031,1703.0900999996811,0.0}
Trams143;14;4;79309;9:17;{7477.508000001311,3581.729000000283,0.0}
Trams149;14;3;79314;9:18;{6271.932036142039,2982.903802087056,0.0}
Trams181;18;2;79315;9:18;{2589.0274000018835,1538.5219000000507,0.0}
Trams184;18;1;79332;9:21;{7477.508000001311,3581.729000000283,0.0}
Trams147;14;1;79378;9:28;{7477.508000001311,3581.729000000283,0.0}
Trams147;14;4;81737;16:1;{7477.508000001311,3581.729000000283,0.0}
Trams183;18;4;81738;16:2;{7477.508000001311,3581.729000000283,0.0}
Trams185;18;1;81738;16:2;{2992.747200001031,1703.0900999996811,0.0}
Trams141;14;4;81745;16:3;{2894.896500002593,514.0241999980062,0.0}
Trams146;14;7;81752;16:4;{7477.508000001311,3581.729000000283,0.0}
Trams148;14;2;81753;16:4;{6188.119100000709,2954.7112999986857,0.0}
Trams146;14;8;81760;16:5;{7172.43200000003,3532.2607999984175,0.0}
Trams185;18;0;81765;16:6;{1740.6504000015557,1186.7970000002533,0.0}
Trams145;14;6;81767;16:6;{7477.508000001311,3581.729000000283,0.0}
Trams145;14;11;81768;16:7;{7446.12100000307,3545.9720000009984,0.0}
Trams146;14;10;81768;16:7;{6831.853600002825,3315.144899999723,0.0}
Trams147;14;5;81768;16:7;{6188.119100000709,2954.7112999986857,0.0}
Trams141;14;5;81778;16:8;{3035.1652000024915,1729.7097000014037,0.0}
Trams146;14;9;81784;16:9;{6138.21238208538,2940.1058384544613,0.0}
Trams185;18;2;81786;16:10;{845.340600002557,806.1041999999434,0.0}
Trams148;14;1;81786;16:10;{4624.179771982149,2375.8925514936154,0.0}
Trams144;14;8;81787;16:10;{7477.508000001311,3581.729000000283,0.0}
Trams145;14;12;81790;16:10;{6563.806600000709,3123.2601999994367,0.0}
Trams147;14;6;81792;16:11;{5058.904000002891,2546.714799998328,0.0}
Trams182;18;16;81793;16:11;{7477.508000001311,3581.729000000283,0.0}
Trams146;14;8;81794;16:11;{5641.738919684285,2786.998382666919,0.0}
Trams142;14;5;81796;16:11;{3035.1652000024915,1729.7097000014037,0.0}
Trams145;14;10;81799;16:12;{6138.21238208538,2940.1058384544613,0.0}
Trams144;14;9;81803;16:12;{6831.853600002825,3315.144899999723,0.0}
Trams146;14;7;81807;16:13;{5058.904000002891,2546.714799998328,0.0}
Trams146;14;6;81808;16:13;{5010.473492013262,2527.781076226536,0.0}
Trams145;14;9;81809;16:13;{5641.738919684285,2786.998382666919,0.0}
Trams145;14;10;81810;16:14;{5634.466500002891,2784.006800001487,0.0}
Trams141;14;3;81814;16:14;{4722.0763000026345,2426.624300001189,0.0}
Trams147;14;5;81814;16:14;{4031.8555000014603,2128.9623999986798,0.0}
Trams146;14;5;81815;16:14;{4672.309900000691,2395.577299999073,0.0}
Trams144;14;6;81819;16:15;{6138.21238208538,2940.1058384544613,0.0}
Trams185;18;1;81827;16:16;{2675.4015184145933,1580.8842637522473,0.0}
Trams146;14;6;81829;16:17;{4031.8555000014603,2128.9623999986798,0.0}
Trams145;14;9;81831;16:17;{4624.179771982149,2375.8925514936154,0.0}
Trams183;18;5;81837;16:18;{2992.747200001031,1703.0900999996811,0.0}
Trams147;14;4;81837;16:18;{2952.0448504139104,1673.1693294131398,0.0}
Trams184;18;4;81840;16:19;{845.340600002557,806.1041999999434,0.0}
Trams142;14;4;81840;16:19;{5108.905971347362,2577.745680309252,0.0}
Trams144;14;5;81842;16:19;{5058.904000002891,2546.714799998328,0.0}
Trams145;14;10;81844;16:19;{4031.8555000014603,2128.9623999986798,0.0}
Trams144;14;4;81850;16:20;{4672.309900000691,2395.577299999073,0.0}
Trams182;18;15;81856;16:21;{4672.309900000691,2395.577299999073,0.0}
Trams147;14;2;81857;16:21;{2567.6414284064917,825.1840510346515,0.0}
Trams181;18;24;81862;16:22;{7477.508000001311,3581.729000000283,0.0}
Trams183;18;4;81864;16:23;{1740.6504000015557,1186.7970000002533,0.0}
Trams146;14;5;81864;16:23;{2808.1955000013113,1135.889900000766,0.0}
Trams148;14;2;81864;16:23;{2597.49450000003,904.9190000016242,0.0}
Trams146;14;4;81865;16:23;{2774.94460455129,1095.9101807449765,0.0}
Trams149;14;4;81865;16:23;{3035.1652000024915,1729.7097000014037,0.0}
Trams147;14;1;81867;16:23;{2894.896500002593,514.0241999980062,0.0}
Trams146;14;3;81871;16:24;{2569.3393000029027,869.8653000015765,0.0}
Trams146;14;2;81872;16:24;{2567.6414284064917,825.1840510346515,0.0}
Trams141;14;24;81877;16:25;{7477.508000001311,3581.729000000283,0.0}
Trams145;14;8;81879;16:25;{2808.1955000013113,1135.889900000766,0.0}
Trams185;18;0;81880;16:25;{5123.508700001985,2583.745899999514,0.0}
Trams145;14;7;81880;16:25;{2774.94460455129,1095.9101807449765,0.0}
Trams146;14;1;81882;16:26;{2894.896500002593,514.0241999980062,0.0}
Trams145;14;6;81886;16:26;{2569.3393000029027,869.8653000015765,0.0}
Trams145;14;4;81887;16:26;{2567.6414284064917,825.1840510346515,0.0}
Trams181;18;23;81894;16:28;{6138.21238208538,2940.1058384544613,0.0}
Trams142;14;8;81895;16:28;{7477.508000001311,3581.729000000283,0.0}
Trams144;14;5;81899;16:28;{2808.1955000013113,1135.889900000766,0.0}
Trams181;18;21;81904;16:29;{5641.738919684285,2786.998382666919,0.0}
Trams181;18;23;81905;16:29;{5634.466500002891,2784.006800001487,0.0}
Trams144;14;4;81907;16:30;{2567.6414284064917,825.1840510346515,0.0}
Trams182;18;13;81911;16:30;{2110.2352000027895,1344.0613000001758,0.0}
Trams142;14;10;81911;16:30;{6831.853600002825,3315.144899999723,0.0}
Trams182;18;11;81912;16:31;{2064.0685709043055,1320.5282183098925,0.0}
Trams183;18;5;81915;16:31;{2149.2538000009954,1363.784799998626,0.0}
Trams181;18;22;81917;16:31;{5058.904000002891,2546.714799998328,0.0}
Trams181;18;19;81918;16:32;{5010.473492013262,2527.781076226536,0.0}
Trams182;18;6;81919;16:32;{1740.6504000015557,1186.7970000002533,0.0}
Trams141;14;22;81919;16:32;{5641.738919684285,2786.998382666919,0.0}
Trams141;14;21;81920;16:32;{5634.466500002891,2784.006800001487,0.0}
Trams148;14;1;81920;16:32;{4707.823850244834,2420.7529164061234,0.0}
Trams149;14;3;81922;16:32;{5689.812200002372,2815.7713999990374,0.0}
Trams184;18;3;81924;16:33;{4707.823850244834,2420.7529164061234,0.0}
Trams181;18;16;81925;16:33;{4672.309900000691,2395.577299999073,0.0}
Trams142;14;11;81926;16:33;{6188.119100000709,2954.7112999986857,0.0}
Trams143;14;15;81930;16:34;{7477.508000001311,3581.729000000283,0.0}
Trams141;14;20;81932;16:34;{5058.904000002891,2546.714799998328,0.0}
Trams141;14;19;81933;16:34;{5010.473492013262,2527.781076226536,0.0}
Trams185;18;10;81934;16:34;{7477.508000001311,3581.729000000283,0.0}
Trams142;14;10;81937;16:35;{5641.738919684285,2786.998382666919,0.0}
Trams181;18;14;81939;16:35;{4031.8555000014603,2128.9623999986798,0.0}
Trams182;18;10;81940;16:35;{845.340600002557,806.1041999999434,0.0}
Trams141;14;17;81940;16:35;{4672.309900000691,2395.577299999073,0.0}
Trams185;18;11;81942;16:36;{7172.43200000003,3532.2607999984175,0.0}
Trams184;18;2;81947;16:36;{5739.764803540053,2830.2159521656795,0.0}
Trams182;18;11;81950;16:37;{1241.924200002104,980.4126999992877,0.0}
Trams185;18;12;81950;16:37;{6831.853600002825,3315.144899999723,0.0}
Trams145;14;5;81952;16:37;{4084.1569000035524,2161.088000001386,0.0}
Trams141;14;18;81954;16:38;{4031.8555000014603,2128.9623999986798,0.0}
Trams184;18;1;81957;16:38;{6221.943900000304,2968.579499999061,0.0}
Trams142;14;9;81958;16:38;{4672.309900000691,2395.577299999073,0.0}
Trams181;18;15;81961;16:39;{2992.747200001031,1703.0900999996811,0.0}
Trams143;14;13;81962;16:39;{6138.21238208538,2940.1058384544613,0.0}
Trams149;14;9;81964;16:39;{7477.508000001311,3581.729000000283,0.0}
Trams145;14;4;81965;16:39;{4707.823850244834,2420.7529164061234,0.0}
Trams181;18;12;81970;16:40;{2589.0274000018835,1538.5219000000507,0.0}
Trams149;14;10;81972;16:41;{7172.43200000003,3532.2607999984175,0.0}
Trams145;14;3;81974;16:41;{5108.905971347362,2577.745680309252,0.0}
Trams141;14;19;81976;16:41;{2992.747200001031,1703.0900999996811,0.0}
Trams181;18;11;81980;16:42;{2110.2352000027895,1344.0613000001758,0.0}
Trams182;18;9;81980;16:42;{2627.1466000005603,1561.507400000468,0.0}
Trams181;18;5;81981;16:42;{2064.0685709043055,1320.5282183098925,0.0}
Trams182;18;8;81981;16:42;{2675.4015184145933,1580.8842637522473,0.0}
Trams148;14;11;81984;16:43;{7477.508000001311,3581.729000000283,0.0}
Trams143;14;12;81985;16:43;{5058.904000002891,2546.714799998328,0.0}
Trams143;14;11;81986;16:43;{5010.473492013262,2527.781076226536,0.0}
Trams181;18;3;81988;16:43;{1740.6504000015557,1186.7970000002533,0.0}
Trams184;18;3;81988;16:43;{7477.508000001311,3581.729000000283,0.0}
Trams182;18;7;81989;16:43;{3035.1652000024915,1729.7097000014037,0.0}
Trams185;18;13;81989;16:43;{5058.904000002891,2546.714799998328,0.0}
Trams141;14;15;81989;16:43;{2808.1955000013113,1135.889900000766,0.0}
Trams141;14;12;81990;16:44;{2774.94460455129,1095.9101807449765,0.0}
Trams183;18;4;81992;16:44;{5739.764803540053,2830.2159521656795,0.0}
Trams143;14;8;81993;16:44;{4672.309900000691,2395.577299999073,0.0}
Trams141;14;9;81996;16:45;{2569.3393000029027,869.8653000015765,0.0}
Trams149;14;9;81996;16:45;{6138.21238208538,2940.1058384544613,0.0}
Trams185;18;14;81997;16:45;{4672.309900000691,2395.577299999073,0.0}
Trams141;14;6;81997;16:45;{2567.6414284064917,825.1840510346515,0.0}
Trams147;14;9;81999;16:45;{7477.508000001311,3581.729000000283,0.0}
Trams141;14;4;82007;16:46;{2894.896500002593,514.0241999980062,0.0}
Trams149;14;8;82007;16:46;{5634.466500002891,2784.006800001487,0.0}
Trams142;14;8;82008;16:47;{2774.94460455129,1095.9101807449765,0.0}
Trams182;18;8;82011;16:47;{4084.1569000035524,2161.088000001386,0.0}
Trams142;14;7;82014;16:48;{2569.3393000029027,869.8653000015765,0.0}
Trams146;14;7;82014;16:48;{7477.508000001311,3581.729000000283,0.0}
Trams147;14;10;82015;16:48;{6831.853600002825,3315.144899999723,0.0}
Trams148;14;10;82016;16:48;{6138.21238208538,2940.1058384544613,0.0}
Trams141;14;5;82019;16:48;{2597.49450000003,904.9190000016242,0.0}
Trams149;14;9;82019;16:48;{5058.904000002891,2546.714799998328,0.0}
Trams149;14;8;82020;16:49;{5010.473492013262,2527.781076226536,0.0}
Trams142;14;10;82024;16:49;{2894.896500002593,514.0241999980062,0.0}
Trams142;14;9;82025;16:49;{2894.896500002593,514.0241999980062,0.0}
Trams148;14;9;82026;16:50;{5641.738919684285,2786.998382666919,0.0}
Trams148;14;8;82027;16:50;{5634.466500002891,2784.006800001487,0.0}
Trams145;14;8;82029;16:50;{7477.508000001311,3581.729000000283,0.0}
Trams146;14;8;82030;16:50;{6831.853600002825,3315.144899999723,0.0}
Trams182;18;7;82033;16:51;{5108.905971347362,2577.745680309252,0.0}
Trams183;18;7;82033;16:51;{7477.508000001311,3581.729000000283,0.0}
Trams148;14;6;82040;16:52;{5010.473492013262,2527.781076226536,0.0}
Trams149;14;7;82041;16:52;{4031.8555000014603,2128.9623999986798,0.0}
Trams185;18;12;82042;16:52;{2589.0274000018835,1538.5219000000507,0.0}
Trams143;14;6;82042;16:52;{2808.1955000013113,1135.889900000766,0.0}
Trams147;14;9;82042;16:52;{5634.466500002891,2784.006800001487,0.0}
Trams146;14;9;82045;16:53;{6188.119100000709,2954.7112999986857,0.0}
Trams182;18;6;82047;16:53;{5739.764803540053,2830.2159521656795,0.0}
Trams144;14;7;82049;16:53;{7477.508000001311,3581.729000000283,0.0}
Trams143;14;5;82050;16:54;{2567.6414284064917,825.1840510346515,0.0}
Trams185;18;7;82053;16:54;{2064.0685709043055,1320.5282183098925,0.0}
Trams147;14;8;82054;16:54;{5058.904000002891,2546.714799998328,0.0}
Trams146;14;7;82056;16:55;{5641.738919684285,2786.998382666919,0.0}
Trams185;18;4;82060;16:55;{1740.6504000015557,1186.7970000002533,0.0}
Trams145;14;9;82060;16:55;{6188.119100000709,2954.7112999986857,0.0}
Trams185;18;0;82061;16:55;{1692.722305299079,1166.6255241828771,0.0}
Trams149;14;8;82063;16:56;{2992.747200001031,1703.0900999996811,0.0}
Trams146;14;6;82070;16:57;{5010.473492013262,2527.781076226536,0.0}
Trams145;14;7;82071;16:57;{5641.738919684285,2786.998382666919,0.0}
Trams145;14;6;82072;16:57;{5634.466500002891,2784.006800001487,0.0}
Trams141;14;4;82076;16:58;{4722.0763000026345,2426.624300001189,0.0}
Trams149;14;6;82077;16:58;{2774.94460455129,1095.9101807449765,0.0}
Trams146;14;5;82078;16:58;{4624.179771982149,2375.8925514936154,0.0}
Trams185;18;2;82081;16:59;{845.340600002557,806.1041999999434,0.0}
Trams149;14;5;82083;16:59;{2569.3393000029027,869.8653000015765,0.0}
Trams149;14;3;82084;16:59;{2567.6414284064917,825.1840510346515,0.0}
Trams141;14;3;82085;16:59;{5123.508700001985,2583.745899999514,0.0}
Trams145;14;5;82085;16:59;{5010.473492013262,2527.781076226536,0.0}
Trams182;18;24;82088;17:0;{7477.508000001311,3581.729000000283,0.0}
Trams183;18;8;82088;17:0;{5058.904000002891,2546.714799998328,0.0}
Trams143;14;6;82093;17:1;{3035.1652000024915,1729.7097000014037,0.0}
Trams183;18;7;82096;17:1;{4672.309900000691,2395.577299999073,0.0}
Trams148;14;5;82096;17:1;{2808.1955000013113,1135.889900000766,0.0}
Trams147;14;9;82098;17:2;{2992.747200001031,1703.0900999996811,0.0}
Trams185;18;3;82103;17:2;{1782.5218000002205,1208.6106000002474,0.0}
Trams148;14;2;82103;17:2;{2569.3393000029027,869.8653000015765,0.0}
Trams147;14;7;82111;17:4;{2808.1955000013113,1135.889900000766,0.0}
Trams144;14;6;82112;17:4;{4672.309900000691,2395.577299999073,0.0}
Trams146;14;4;82113;17:4;{2992.747200001031,1703.0900999996811,0.0}
Trams184;18;1;82114;17:4;{1740.6504000015557,1186.7970000002533,0.0}
Trams149;14;4;82114;17:4;{2839.1857000030577,1180.8036000002176,0.0}
Trams143;14;7;82115;17:4;{4084.1569000035524,2161.088000001386,0.0}
Trams147;14;6;82118;17:5;{2569.3393000029027,869.8653000015765,0.0}
Trams147;14;2;82119;17:5;{2567.6414284064917,825.1840510346515,0.0}
Trams182;18;23;82120;17:5;{6138.21238208538,2940.1058384544613,0.0}
Trams143;14;6;82129;17:7;{4722.0763000026345,2426.624300001189,0.0}
Trams147;14;1;82129;17:7;{2894.896500002593,514.0241999980062,0.0}
Trams182;18;21;82130;17:7;{5641.738919684285,2786.998382666919,0.0}
Trams182;18;20;82131;17:7;{5634.466500002891,2784.006800001487,0.0}
Trams146;14;2;82134;17:8;{2567.6414284064917,825.1840510346515,0.0}
Trams141;14;24;82139;17:8;{7477.508000001311,3581.729000000283,0.0}
Trams145;14;4;82141;17:9;{2808.1955000013113,1135.889900000766,0.0}
Trams182;18;19;82143;17:9;{5058.904000002891,2546.714799998328,0.0}
Trams182;18;18;82144;17:9;{5010.473492013262,2527.781076226536,0.0}
Trams145;14;3;82148;17:10;{2569.3393000029027,869.8653000015765,0.0}
Trams149;14;3;82149;17:10;{4084.1569000035524,2161.088000001386,0.0}
Trams182;18;15;82151;17:10;{4672.309900000691,2395.577299999073,0.0}
Trams183;18;6;82151;17:10;{2110.2352000027895,1344.0613000001758,0.0}
Trams182;18;14;82152;17:11;{4624.179771982149,2375.8925514936154,0.0}
Trams183;18;5;82152;17:11;{2064.0685709043055,1320.5282183098925,0.0}
Trams185;18;2;82152;17:11;{4084.1569000035524,2161.088000001386,0.0}
Trams181;18;24;82157;17:11;{7477.508000001311,3581.729000000283,0.0}
Trams184;18;2;82157;17:11;{1782.5218000002205,1208.6106000002474,0.0}
Trams142;14;24;82157;17:11;{7477.508000001311,3581.729000000283,0.0}
Trams1411;14;24;82157;17:11;{7477.508000001311,3581.729000000283,0.0}
Trams145;14;4;82159;17:12;{2894.896500002593,514.0241999980062,0.0}
Trams143;14;5;82161;17:12;{6221.943900000304,2968.579499999061,0.0}
Trams144;14;5;82162;17:12;{2774.94460455129,1095.9101807449765,0.0}
Trams182;18;12;82165;17:13;{4031.8555000014603,2128.9623999986798,0.0}
Trams185;18;1;82166;17:13;{4722.0763000026345,2426.624300001189,0.0}
Trams144;14;4;82169;17:13;{2567.6414284064917,825.1840510346515,0.0}
Trams141;14;20;82171;17:14;{6138.21238208538,2940.1058384544613,0.0}
Trams185;18;0;82174;17:14;{5108.905971347362,2577.745680309252,0.0}
Trams184;18;1;82175;17:14;{2627.1466000005603,1561.507400000468,0.0}
Trams183;18;6;82180;17:15;{845.340600002557,806.1041999999434,0.0}
Trams141;14;17;82181;17:15;{5641.738919684285,2786.998382666919,0.0}
Trams141;14;16;82182;17:16;{5634.466500002891,2784.006800001487,0.0}
Trams149;14;2;82185;17:16;{5739.764803540053,2830.2159521656795,0.0}
Trams183;18;7;82190;17:17;{1241.924200002104,980.4126999992877,0.0}
Trams143;14;24;82192;17:17;{7477.508000001311,3581.729000000283,0.0}
Trams1410;14;23;82192;17:17;{7477.508000001311,3581.729000000283,0.0}
Trams141;14;14;82194;17:18;{5058.904000002891,2546.714799998328,0.0}
Trams182;18;11;82196;17:18;{2589.0274000018835,1538.5219000000507,0.0}
Trams181;18;23;82199;17:18;{5641.738919684285,2786.998382666919,0.0}
Trams181;18;24;82200;17:19;{5634.466500002891,2784.006800001487,0.0}
Trams1410;14;24;82200;17:19;{7172.43200000003,3532.2607999984175,0.0}
Trams1411;14;23;82200;17:19;{5634.466500002891,2784.006800001487,0.0}
Trams141;14;13;82202;17:19;{4672.309900000691,2395.577299999073,0.0}
Trams141;14;12;82203;17:19;{4624.179771982149,2375.8925514936154,0.0}
Trams182;18;9;82206;17:20;{2110.2352000027895,1344.0613000001758,0.0}
Trams182;18;6;82207;17:20;{2064.0685709043055,1320.5282183098925,0.0}
Trams181;18;18;82213;17:21;{5010.473492013262,2527.781076226536,0.0}
Trams1411;14;21;82213;17:21;{5010.473492013262,2527.781076226536,0.0}
Trams182;18;7;82214;17:21;{1740.6504000015557,1186.7970000002533,0.0}
Trams141;14;11;82216;17:21;{4031.8555000014603,2128.9623999986798,0.0}
Trams181;18;16;82220;17:22;{4672.309900000691,2395.577299999073,0.0}
Trams1411;14;18;82220;17:22;{4672.309900000691,2395.577299999073,0.0}
Trams1411;14;14;82221;17:22;{4624.179771982149,2375.8925514936154,0.0}
Trams143;14;23;82224;17:23;{6138.21238208538,2940.1058384544613,0.0}
Trams149;14;24;82226;17:23;{7477.508000001311,3581.729000000283,0.0}
Trams185;18;24;82229;17:23;{7477.508000001311,3581.729000000283,0.0}
Trams181;18;14;82234;17:24;{4031.8555000014603,2128.9623999986798,0.0}
Trams143;14;17;82234;17:24;{5641.738919684285,2786.998382666919,0.0}
Trams144;14;5;82234;17:24;{4084.1569000035524,2161.088000001386,0.0}
Trams143;14;16;82235;17:24;{5634.466500002891,2784.006800001487,0.0}
Trams1410;14;20;82235;17:24;{5634.466500002891,2784.006800001487,0.0}
Trams141;14;12;82238;17:25;{2992.747200001031,1703.0900999996811,0.0}
Trams182;18;8;82245;17:26;{1241.924200002104,980.4126999992877,0.0}
Trams148;14;23;82246;17:26;{7477.508000001311,3581.729000000283,0.0}
Trams143;14;13;82247;17:26;{5058.904000002891,2546.714799998328,0.0}
Trams1410;14;18;82248;17:27;{5010.473492013262,2527.781076226536,0.0}
Trams145;14;3;82249;17:27;{5689.812200002372,2815.7713999990374,0.0}
Trams141;14;8;82251;17:27;{2808.1955000013113,1135.889900000766,0.0}
Trams141;14;6;82252;17:27;{2774.94460455129,1095.9101807449765,0.0}
Trams148;14;24;82254;17:28;{7172.43200000003,3532.2607999984175,0.0}
Trams143;14;12;82255;17:28;{4672.309900000691,2395.577299999073,0.0}
Trams1410;14;13;82255;17:28;{4672.309900000691,2395.577299999073,0.0}
Trams143;14;11;82256;17:28;{4624.179771982149,2375.8925514936154,0.0}
Trams1410;14;11;82256;17:28;{4624.179771982149,2375.8925514936154,0.0}
Trams1411;14;15;82256;17:28;{2992.747200001031,1703.0900999996811,0.0}
Trams141;14;7;82258;17:28;{2569.3393000029027,869.8653000015765,0.0}
Trams149;14;22;82258;17:28;{6138.21238208538,2940.1058384544613,0.0}
Trams141;14;6;82259;17:28;{2567.6414284064917,825.1840510346515,0.0}
Trams147;14;20;82261;17:29;{7477.508000001311,3581.729000000283,0.0}
Trams181;18;11;82265;17:29;{2589.0274000018835,1538.5219000000507,0.0}
Trams183;18;6;82265;17:29;{4722.0763000026345,2426.624300001189,0.0}
Trams141;14;5;82269;17:30;{2894.896500002593,514.0241999980062,0.0}
Trams142;14;23;82269;17:30;{2808.1955000013113,1135.889900000766,0.0}
Trams142;14;18;82270;17:30;{2774.94460455129,1095.9101807449765,0.0}
Trams144;14;4;82270;17:30;{5739.764803540053,2830.2159521656795,0.0}
Trams181;18;10;82275;17:31;{2110.2352000027895,1344.0613000001758,0.0}
Trams181;18;9;82276;17:31;{2064.0685709043055,1320.5282183098925,0.0}
Trams182;18;7;82276;17:31;{2675.4015184145933,1580.8842637522473,0.0}
Trams142;14;15;82276;17:31;{2569.3393000029027,869.8653000015765,0.0}
Trams146;14;12;82276;17:31;{7477.508000001311,3581.729000000283,0.0}
Trams142;14;12;82277;17:31;{2567.6414284064917,825.1840510346515,0.0}
Trams147;14;21;82277;17:31;{6831.853600002825,3315.144899999723,0.0}
Trams1411;14;9;82277;17:31;{2567.6414284064917,825.1840510346515,0.0}
Trams149;14;19;82282;17:32;{5010.473492013262,2527.781076226536,0.0}
Trams181;18;6;82283;17:32;{1740.6504000015557,1186.7970000002533,0.0}
Trams184;18;24;82283;17:32;{7477.508000001311,3581.729000000283,0.0}
Trams147;14;23;82284;17:33;{6563.806600000709,3123.2601999994367,0.0}
Trams185;18;23;82285;17:33;{5010.473492013262,2527.781076226536,0.0}
Trams183;18;5;82286;17:33;{5689.812200002372,2815.7713999990374,0.0}
Trams142;14;9;82287;17:33;{2894.896500002593,514.0241999980062,0.0}
Trams1411;14;1;82287;17:33;{2894.896500002593,514.0241999980062,0.0}
Trams148;14;22;82288;17:33;{5641.738919684285,2786.998382666919,0.0}
Trams148;14;19;82289;17:33;{5634.466500002891,2784.006800001487,0.0}
Trams145;14;11;82291;17:34;{7477.508000001311,3581.729000000283,0.0}
Trams185;18;20;82292;17:34;{4672.309900000691,2395.577299999073,0.0}
Trams146;14;13;82292;17:34;{6831.853600002825,3315.144899999723,0.0}
Trams147;14;24;82292;17:34;{6188.119100000709,2954.7112999986857,0.0}
Trams147;14;23;82293;17:34;{6138.21238208538,2940.1058384544613,0.0}
Trams145;14;12;82299;17:35;{7172.43200000003,3532.2607999984175,0.0}
Trams148;14;18;82301;17:35;{5058.904000002891,2546.714799998328,0.0}
Trams141;14;6;82302;17:36;{3035.1652000024915,1729.7097000014037,0.0}
Trams148;14;17;82302;17:36;{5010.473492013262,2527.781076226536,0.0}
Trams149;14;18;82303;17:36;{4031.8555000014603,2128.9623999986798,0.0}
Trams181;18;8;82304;17:36;{845.340600002557,806.1041999999434,0.0}
Trams143;14;7;82304;17:36;{2808.1955000013113,1135.889900000766,0.0}
Trams143;14;6;82305;17:36;{2774.94460455129,1095.9101807449765,0.0}
Trams1410;14;8;82305;17:36;{2774.94460455129,1095.9101807449765,0.0}
Trams182;18;8;82306;17:36;{4084.1569000035524,2161.088000001386,0.0}
Trams185;18;21;82306;17:36;{4031.8555000014603,2128.9623999986798,0.0}
Trams146;14;15;82307;17:36;{6188.119100000709,2954.7112999986857,0.0}
Trams148;14;15;82309;17:37;{4672.309900000691,2395.577299999073,0.0}
Trams148;14;14;82310;17:37;{4624.179771982149,2375.8925514936154,0.0}
Trams144;14;23;82311;17:37;{7477.508000001311,3581.729000000283,0.0}
Trams1410;14;7;82311;17:37;{2569.3393000029027,869.8653000015765,0.0}
Trams1410;14;5;82312;17:37;{2567.6414284064917,825.1840510346515,0.0}
Trams147;14;21;82316;17:38;{5058.904000002891,2546.714799998328,0.0}
Trams147;14;18;82317;17:38;{5010.473492013262,2527.781076226536,0.0}
Trams144;14;24;82319;17:38;{7172.43200000003,3532.2607999984175,0.0}
Trams146;14;13;82319;17:38;{5634.466500002891,2784.006800001487,0.0}
Trams143;14;5;82322;17:39;{2894.896500002593,514.0241999980062,0.0}
Trams1410;14;0;82322;17:39;{2894.896500002593,514.0241999980062,0.0}
Trams147;14;16;82324;17:39;{4672.309900000691,2395.577299999073,0.0}
Trams149;14;19;82325;17:39;{2992.747200001031,1703.0900999996811,0.0}
Trams184;18;23;82326;17:40;{5634.466500002891,2784.006800001487,0.0}
Trams182;18;6;82328;17:40;{5108.905971347362,2577.745680309252,0.0}
Trams183;18;18;82328;17:40;{7477.508000001311,3581.729000000283,0.0}
Trams146;14;11;82331;17:40;{5058.904000002891,2546.714799998328,0.0}
Trams146;14;9;82332;17:41;{5010.473492013262,2527.781076226536,0.0}
Trams145;14;11;82333;17:41;{5641.738919684285,2786.998382666919,0.0}
Trams181;18;9;82334;17:41;{2149.2538000009954,1363.784799998626,0.0}
Trams145;14;10;82334;17:41;{5634.466500002891,2784.006800001487,0.0}
Trams183;18;20;82336;17:41;{7172.43200000003,3532.2607999984175,0.0}
Trams185;18;16;82337;17:41;{2589.0274000018835,1538.5219000000507,0.0}
Trams184;18;22;82338;17:42;{5058.904000002891,2546.714799998328,0.0}
Trams149;14;18;82338;17:42;{2808.1955000013113,1135.889900000766,0.0}
Trams184;18;21;82339;17:42;{5010.473492013262,2527.781076226536,0.0}
Trams146;14;7;82339;17:42;{4672.309900000691,2395.577299999073,0.0}
Trams149;14;15;82339;17:42;{2774.94460455129,1095.9101807449765,0.0}
Trams182;18;5;82342;17:42;{5739.764803540053,2830.2159521656795,0.0}
Trams181;18;10;82344;17:43;{2627.1466000005603,1561.507400000468,0.0}
Trams149;14;11;82345;17:43;{2569.3393000029027,869.8653000015765,0.0}
Trams184;18;20;82346;17:43;{4672.309900000691,2395.577299999073,0.0}
Trams145;14;11;82346;17:43;{5058.904000002891,2546.714799998328,0.0}
Trams149;14;7;82346;17:43;{2567.6414284064917,825.1840510346515,0.0}
Trams185;18;13;82347;17:43;{2110.2352000027895,1344.0613000001758,0.0}
Trams185;18;8;82348;17:43;{2064.0685709043055,1320.5282183098925,0.0}
Trams183;18;21;82351;17:44;{6563.806600000709,3123.2601999994367,0.0}
Trams144;14;23;82354;17:44;{5634.466500002891,2784.006800001487,0.0}
Trams145;14;9;82354;17:44;{4672.309900000691,2395.577299999073,0.0}
Trams185;18;0;82355;17:44;{1740.6504000015557,1186.7970000002533,0.0}
Trams145;14;8;82355;17:44;{4624.179771982149,2375.8925514936154,0.0}
Trams149;14;4;82356;17:45;{2894.896500002593,514.0241999980062,0.0}
Trams148;14;12;82358;17:45;{2808.1955000013113,1135.889900000766,0.0}
Trams183;18;22;82359;17:45;{6188.119100000709,2954.7112999986857,0.0}
Trams148;14;11;82359;17:45;{2774.94460455129,1095.9101807449765,0.0}
Trams141;14;5;82360;17:45;{5739.764803540053,2830.2159521656795,0.0}
Trams148;14;7;82365;17:46;{2569.3393000029027,869.8653000015765,0.0}
Trams144;14;21;82366;17:46;{5058.904000002891,2546.714799998328,0.0}
Trams148;14;6;82366;17:46;{2567.6414284064917,825.1840510346515,0.0}
Trams144;14;20;82367;17:46;{5010.473492013262,2527.781076226536,0.0}
Trams145;14;9;82368;17:47;{4031.8555000014603,2128.9623999986798,0.0}
Trams183;18;23;82371;17:47;{5634.466500002891,2784.006800001487,0.0}
Trams147;14;14;82373;17:47;{2808.1955000013113,1135.889900000766,0.0}
Trams144;14;17;82374;17:48;{4672.309900000691,2395.577299999073,0.0}
Trams147;14;13;82374;17:48;{2774.94460455129,1095.9101807449765,0.0}
Trams146;14;8;82375;17:48;{2992.747200001031,1703.0900999996811,0.0}
Trams185;18;2;82376;17:48;{845.340600002557,806.1041999999434,0.0}
Trams148;14;2;82376;17:48;{2894.896500002593,514.0241999980062,0.0}
Trams147;14;11;82380;17:49;{2569.3393000029027,869.8653000015765,0.0}
Trams147;14;6;82381;17:49;{2567.6414284064917,825.1840510346515,0.0}
Trams182;18;24;82383;17:49;{7477.508000001311,3581.729000000283,0.0}
Trams183;18;22;82383;17:49;{5058.904000002891,2546.714799998328,0.0}
Trams183;18;21;82384;17:49;{5010.473492013262,2527.781076226536,0.0}
Trams181;18;9;82388;17:50;{4707.823850244834,2420.7529164061234,0.0}
Trams144;14;16;82388;17:50;{4031.8555000014603,2128.9623999986798,0.0}
Trams146;14;6;82388;17:50;{2808.1955000013113,1135.889900000766,0.0}
Trams181;18;8;82389;17:50;{4722.0763000026345,2426.624300001189,0.0}
Trams146;14;5;82389;17:50;{2774.94460455129,1095.9101807449765,0.0}
Trams149;14;5;82389;17:50;{3035.1652000024915,1729.7097000014037,0.0}
Trams184;18;17;82391;17:50;{2589.0274000018835,1538.5219000000507,0.0}
Trams147;14;2;82391;17:50;{2894.896500002593,514.0241999980062,0.0}
Trams146;14;4;82396;17:51;{2567.6414284064917,825.1840510346515,0.0}
Trams181;18;7;82397;17:51;{5108.905971347362,2577.745680309252,0.0}
Trams184;18;16;82401;17:52;{2110.2352000027895,1344.0613000001758,0.0}
Trams141;14;24;82401;17:52;{7477.508000001311,3581.729000000283,0.0}
Trams184;18;8;82402;17:52;{2064.0685709043055,1320.5282183098925,0.0}
Trams145;14;8;82403;17:52;{2808.1955000013113,1135.889900000766,0.0}
Trams146;14;2;82406;17:53;{2894.896500002593,514.0241999980062,0.0}
Trams184;18;3;82409;17:53;{1740.6504000015557,1186.7970000002533,0.0}
Trams148;14;3;82409;17:53;{3035.1652000024915,1729.7097000014037,0.0}
Trams181;18;8;82410;17:54;{5689.812200002372,2815.7713999990374,0.0}
Trams184;18;1;82410;17:54;{1692.722305299079,1166.6255241828771,0.0}
Trams145;14;7;82410;17:54;{2569.3393000029027,869.8653000015765,0.0}
Trams181;18;7;82411;17:54;{5739.764803540053,2830.2159521656795,0.0}
Trams145;14;4;82411;17:54;{2567.6414284064917,825.1840510346515,0.0}
Trams142;14;24;82419;17:55;{7477.508000001311,3581.729000000283,0.0}
Trams1411;14;24;82419;17:55;{7477.508000001311,3581.729000000283,0.0}
Trams145;14;5;82420;17:55;{2894.896500002593,514.0241999980062,0.0}
Trams144;14;15;82423;17:56;{2808.1955000013113,1135.889900000766,0.0}
Trams185;18;1;82425;17:56;{3035.1652000024915,1729.7097000014037,0.0}
Trams182;18;21;82426;17:56;{5634.466500002891,2784.006800001487,0.0}
Trams184;18;4;82430;17:57;{845.340600002557,806.1041999999434,0.0}
Trams144;14;10;82430;17:57;{2569.3393000029027,869.8653000015765,0.0}
Trams144;14;8;82431;17:57;{2567.6414284064917,825.1840510346515,0.0}
Trams149;14;4;82433;17:57;{5108.905971347362,2577.745680309252,0.0}
Trams183;18;19;82436;17:58;{2589.0274000018835,1538.5219000000507,0.0}
Trams182;18;18;82439;17:58;{5010.473492013262,2527.781076226536,0.0}
Trams146;14;3;82439;17:58;{3035.1652000024915,1729.7097000014037,0.0}
Trams144;14;4;82441;17:59;{2894.896500002593,514.0241999980062,0.0}
Trams141;14;22;82444;17:59;{5634.466500002891,2784.006800001487,0.0}
Trams182;18;12;82446;18:0;{4672.309900000691,2395.577299999073,0.0}
Trams183;18;18;82446;18:0;{2110.2352000027895,1344.0613000001758,0.0}
Trams147;14;3;82446;18:0;{4084.1569000035524,2161.088000001386,0.0}
Trams183;18;11;82447;18:0;{2064.0685709043055,1320.5282183098925,0.0}
Trams181;18;24;82452;18:1;{7477.508000001311,3581.729000000283,0.0}
Trams184;18;5;82452;18:1;{1782.5218000002205,1208.6106000002474,0.0}
Trams183;18;9;82454;18:1;{1740.6504000015557,1186.7970000002533,0.0}
Trams143;14;24;82454;18:1;{7477.508000001311,3581.729000000283,0.0}
Trams145;14;6;82454;18:1;{3035.1652000024915,1729.7097000014037,0.0}
Trams1410;14;17;82454;18:1;{7477.508000001311,3581.729000000283,0.0}
Trams183;18;8;82455;18:1;{1692.722305299079,1166.6255241828771,0.0}
Trams141;14;23;82456;18:1;{5058.904000002891,2546.714799998328,0.0}
Trams147;14;2;82459;18:2;{4707.823850244834,2420.7529164061234,0.0}
Trams182;18;10;82460;18:2;{4031.8555000014603,2128.9623999986798,0.0}
Trams184;18;6;82460;18:2;{2149.2538000009954,1363.784799998626,0.0}
Trams142;14;22;82461;18:2;{5641.738919684285,2786.998382666919,0.0}
Trams142;14;21;82462;18:2;{5634.466500002891,2784.006800001487,0.0}
Trams1410;14;18;82462;18:2;{7172.43200000003,3532.2607999984175,0.0}
Trams141;14;24;82464;18:3;{4672.309900000691,2395.577299999073,0.0}
Trams184;18;7;82470;18:4;{2627.1466000005603,1561.507400000468,0.0}
Trams1410;14;21;82470;18:4;{6831.853600002825,3315.144899999723,0.0}
Trams183;18;6;82475;18:4;{845.340600002557,806.1041999999434,0.0}
Trams1411;14;20;82475;18:4;{5010.473492013262,2527.781076226536,0.0}
Trams183;18;7;82477;18:5;{902.5305000022054,834.7037000004202,0.0}
Trams148;14;2;82477;18:5;{6221.943900000304,2968.579499999061,0.0}
Trams1410;14;22;82477;18:5;{6563.806600000709,3123.2601999994367,0.0}
Trams1411;14;14;82482;18:6;{4672.309900000691,2395.577299999073,0.0}
Trams142;14;20;82483;18:6;{4624.179771982149,2375.8925514936154,0.0}
Trams1410;14;23;82485;18:6;{6188.119100000709,2954.7112999986857,0.0}
Trams149;14;15;82488;18:7;{7477.508000001311,3581.729000000283,0.0}
Trams182;18;8;82491;18:7;{2589.0274000018835,1538.5219000000507,0.0}
Trams181;18;23;82494;18:8;{5641.738919684285,2786.998382666919,0.0}
Trams142;14;22;82496;18:8;{4031.8555000014603,2128.9623999986798,0.0}
Trams146;14;2;82496;18:8;{5689.812200002372,2815.7713999990374,0.0}
Trams1410;14;22;82496;18:8;{5641.738919684285,2786.998382666919,0.0}
Trams1410;14;18;82497;18:8;{5634.466500002891,2784.006800001487,0.0}
Trams182;18;6;82501;18:9;{2110.2352000027895,1344.0613000001758,0.0}
Trams149;14;16;82504;18:9;{6831.853600002825,3315.144899999723,0.0}
Trams183;18;8;82505;18:9;{2149.2538000009954,1363.784799998626,0.0}
Trams181;18;22;82507;18:10;{5058.904000002891,2546.714799998328,0.0}
Trams181;18;20;82508;18:10;{5010.473492013262,2527.781076226536,0.0}
Trams148;14;5;82508;18:10;{7477.508000001311,3581.729000000283,0.0}
Trams182;18;5;82509;18:10;{1740.6504000015557,1186.7970000002533,0.0}
Trams1410;14;19;82509;18:10;{5058.904000002891,2546.714799998328,0.0}
Trams143;14;22;82510;18:10;{5010.473492013262,2527.781076226536,0.0}
Trams145;14;5;82512;18:11;{5739.764803540053,2830.2159521656795,0.0}
Trams141;14;17;82513;18:11;{2808.1955000013113,1135.889900000766,0.0}
Trams141;14;15;82514;18:11;{2774.94460455129,1095.9101807449765,0.0}
Trams184;18;6;82515;18:11;{4722.0763000026345,2426.624300001189,0.0}
Trams181;18;19;82516;18:11;{4624.179771982149,2375.8925514936154,0.0}
Trams183;18;7;82516;18:11;{2675.4015184145933,1580.8842637522473,0.0}
Trams1410;14;17;82517;18:11;{4672.309900000691,2395.577299999073,0.0}
Trams142;14;23;82518;18:12;{2992.747200001031,1703.0900999996811,0.0}
Trams141;14;13;82520;18:12;{2569.3393000029027,869.8653000015765,0.0}
Trams141;14;8;82521;18:12;{2567.6414284064917,825.1840510346515,0.0}
Trams147;14;11;82523;18:12;{7477.508000001311,3581.729000000283,0.0}
Trams184;18;5;82524;18:13;{5123.508700001985,2583.745899999514,0.0}
Trams185;18;24;82524;18:13;{7477.508000001311,3581.729000000283,0.0}
Trams181;18;20;82529;18:13;{4031.8555000014603,2128.9623999986798,0.0}
Trams182;18;9;82530;18:14;{845.340600002557,806.1041999999434,0.0}
Trams149;14;15;82530;18:14;{5641.738919684285,2786.998382666919,0.0}
Trams141;14;7;82531;18:14;{2894.896500002593,514.0241999980062,0.0}
Trams142;14;20;82531;18:14;{2808.1955000013113,1135.889900000766,0.0}
Trams143;14;23;82531;18:14;{4031.8555000014603,2128.9623999986798,0.0}
Trams147;14;12;82531;18:14;{7172.43200000003,3532.2607999984175,0.0}
Trams149;14;16;82531;18:14;{5634.466500002891,2784.006800001487,0.0}
Trams142;14;16;82532;18:14;{2774.94460455129,1095.9101807449765,0.0}
Trams184;18;4;82536;18:15;{5689.812200002372,2815.7713999990374,0.0}
Trams184;18;1;82537;18:15;{5739.764803540053,2830.2159521656795,0.0}
Trams142;14;14;82538;18:15;{2569.3393000029027,869.8653000015765,0.0}
Trams146;14;6;82538;18:15;{7477.508000001311,3581.729000000283,0.0}
Trams142;14;13;82539;18:15;{2567.6414284064917,825.1840510346515,0.0}
Trams147;14;13;82539;18:15;{6831.853600002825,3315.144899999723,0.0}
Trams148;14;6;82539;18:15;{6188.119100000709,2954.7112999986857,0.0}
Trams1411;14;8;82539;18:15;{2567.6414284064917,825.1840510346515,0.0}
Trams149;14;15;82543;18:16;{5058.904000002891,2546.714799998328,0.0}
Trams149;14;13;82544;18:16;{5010.473492013262,2527.781076226536,0.0}
Trams146;14;7;82546;18:16;{7172.43200000003,3532.2607999984175,0.0}
Trams142;14;10;82549;18:17;{2894.896500002593,514.0241999980062,0.0}
Trams1411;14;1;82549;18:17;{2894.896500002593,514.0241999980062,0.0}
Trams141;14;8;82551;18:17;{2839.1857000030577,1180.8036000002176,0.0}
Trams149;14;12;82552;18:17;{4624.179771982149,2375.8925514936154,0.0}
Trams145;14;6;82553;18:17;{7477.508000001311,3581.729000000283,0.0}
Trams145;14;7;82554;18:18;{7446.12100000307,3545.9720000009984,0.0}
Trams146;14;8;82554;18:18;{6831.853600002825,3315.144899999723,0.0}
Trams181;18;14;82560;18:19;{2589.0274000018835,1538.5219000000507,0.0}
Trams146;14;9;82561;18:19;{6563.806600000709,3123.2601999994367,0.0}
Trams148;14;7;82563;18:19;{5058.904000002891,2546.714799998328,0.0}
Trams141;14;9;82564;18:19;{3035.1652000024915,1729.7097000014037,0.0}
Trams143;14;20;82566;18:20;{2808.1955000013113,1135.889900000766,0.0}
Trams147;14;12;82566;18:20;{5634.466500002891,2784.006800001487,0.0}
Trams1410;14;16;82566;18:20;{2808.1955000013113,1135.889900000766,0.0}
Trams183;18;6;82568;18:20;{5108.905971347362,2577.745680309252,0.0}
Trams181;18;9;82571;18:20;{2064.0685709043055,1320.5282183098925,0.0}
Trams182;18;8;82571;18:20;{2675.4015184145933,1580.8842637522473,0.0}
Trams143;14;16;82573;18:21;{2569.3393000029027,869.8653000015765,0.0}
Trams144;14;16;82573;18:21;{7477.508000001311,3581.729000000283,0.0}
Trams143;14;7;82574;18:21;{2567.6414284064917,825.1840510346515,0.0}
Trams1410;14;13;82574;18:21;{2567.6414284064917,825.1840510346515,0.0}
Trams181;18;8;82578;18:22;{1740.6504000015557,1186.7970000002533,0.0}
Trams184;18;8;82578;18:22;{7477.508000001311,3581.729000000283,0.0}
Trams147;14;11;82578;18:22;{5058.904000002891,2546.714799998328,0.0}
Trams182;18;9;82579;18:22;{3035.1652000024915,1729.7097000014037,0.0}
Trams147;14;10;82579;18:22;{5010.473492013262,2527.781076226536,0.0}
Trams143;14;9;82583;18:22;{2894.896500002593,514.0241999980062,0.0}
Trams143;14;7;82584;18:23;{2894.896500002593,514.0241999980062,0.0}
Trams1410;14;0;82584;18:23;{2894.896500002593,514.0241999980062,0.0}
Trams184;18;10;82594;18:24;{6831.853600002825,3315.144899999723,0.0}
Trams146;14;7;82594;18:24;{5010.473492013262,2527.781076226536,0.0}
Trams181;18;10;82599;18:25;{845.340600002557,806.1041999999434,0.0}
Trams147;14;8;82600;18:25;{4031.8555000014603,2128.9623999986798,0.0}
Trams182;18;10;82601;18:25;{4084.1569000035524,2161.088000001386,0.0}
Trams184;18;11;82601;18:25;{6563.806600000709,3123.2601999994367,0.0}
Trams149;14;11;82601;18:25;{2774.94460455129,1095.9101807449765,0.0}
Trams146;14;6;82602;18:26;{4624.179771982149,2375.8925514936154,0.0}
Trams143;14;8;82604;18:26;{2839.1857000030577,1180.8036000002176,0.0}
Trams149;14;10;82607;18:26;{2569.3393000029027,869.8653000015765,0.0}
Trams141;14;7;82608;18:27;{5108.905971347362,2577.745680309252,0.0}
Trams149;14;7;82608;18:27;{2567.6414284064917,825.1840510346515,0.0}
Trams184;18;12;82609;18:27;{6188.119100000709,2954.7112999986857,0.0}
Trams144;14;13;82615;18:28;{5641.738919684285,2786.998382666919,0.0}
Trams144;14;12;82616;18:28;{5634.466500002891,2784.006800001487,0.0}
Trams149;14;4;82618;18:28;{2894.896500002593,514.0241999980062,0.0}
Trams184;18;13;82621;18:29;{5634.466500002891,2784.006800001487,0.0}
Trams148;14;4;82621;18:29;{2774.94460455129,1095.9101807449765,0.0}
Trams182;18;7;82623;18:29;{5108.905971347362,2577.745680309252,0.0}
Trams183;18;16;82623;18:29;{7477.508000001311,3581.729000000283,0.0}
Trams148;14;3;82628;18:30;{2567.6414284064917,825.1840510346515,0.0}
Trams181;18;11;82629;18:30;{2149.2538000009954,1363.784799998626,0.0}
Trams144;14;10;82629;18:30;{5010.473492013262,2527.781076226536,0.0}
Trams149;14;5;82630;18:30;{2597.49450000003,904.9190000016242,0.0}
Trams185;18;20;82632;18:31;{2589.0274000018835,1538.5219000000507,0.0}
Trams147;14;6;82635;18:31;{2808.1955000013113,1135.889900000766,0.0}
Trams182;18;6;82636;18:31;{5689.812200002372,2815.7713999990374,0.0}
Trams144;14;9;82636;18:31;{4672.309900000691,2395.577299999073,0.0}
Trams148;14;2;82638;18:32;{2894.896500002593,514.0241999980062,0.0}
Trams183;18;17;82639;18:32;{6831.853600002825,3315.144899999723,0.0}
Trams143;14;9;82639;18:32;{4084.1569000035524,2161.088000001386,0.0}
Trams185;18;13;82643;18:32;{2064.0685709043055,1320.5282183098925,0.0}
Trams147;14;5;82643;18:32;{2567.6414284064917,825.1840510346515,0.0}
Trams182;18;5;82647;18:33;{6221.943900000304,2968.579499999061,0.0}
Trams185;18;6;82650;18:34;{1740.6504000015557,1186.7970000002533,0.0}
Trams144;14;7;82650;18:34;{4031.8555000014603,2128.9623999986798,0.0}
Trams146;14;4;82650;18:34;{2808.1955000013113,1135.889900000766,0.0}
Trams185;18;4;82651;18:34;{1692.722305299079,1166.6255241828771,0.0}
Trams147;14;3;82653;18:34;{2894.896500002593,514.0241999980062,0.0}
Trams183;18;18;82654;18:34;{6188.119100000709,2954.7112999986857,0.0}
Trams141;14;24;82663;18:36;{7477.508000001311,3581.729000000283,0.0}
Trams146;14;2;82668;18:37;{2894.896500002593,514.0241999980062,0.0}
Trams185;18;6;82671;18:37;{845.340600002557,806.1041999999434,0.0}
Trams148;14;3;82671;18:37;{3035.1652000024915,1729.7097000014037,0.0}
Trams143;14;8;82675;18:38;{5739.764803540053,2830.2159521656795,0.0}
Trams184;18;14;82677;18:38;{2992.747200001031,1703.0900999996811,0.0}
Trams182;18;24;82678;18:38;{7477.508000001311,3581.729000000283,0.0}
Trams183;18;17;82678;18:38;{5058.904000002891,2546.714799998328,0.0}
Trams183;18;15;82679;18:38;{5010.473492013262,2527.781076226536,0.0}
Trams142;14;16;82681;18:39;{7477.508000001311,3581.729000000283,0.0}
Trams145;14;5;82683;18:39;{2894.896500002593,514.0241999980062,0.0}
Trams181;18;10;82684;18:39;{4722.0763000026345,2426.624300001189,0.0}
Trams143;14;7;82685;18:39;{6221.943900000304,2968.579499999061,0.0}
Trams183;18;11;82686;18:40;{4672.309900000691,2395.577299999073,0.0}
Trams184;18;7;82686;18:40;{2589.0274000018835,1538.5219000000507,0.0}
Trams144;14;6;82686;18:40;{2774.94460455129,1095.9101807449765,0.0}
Trams183;18;10;82687;18:40;{4624.179771982149,2375.8925514936154,0.0}
Trams144;14;5;82693;18:41;{2567.6414284064917,825.1840510346515,0.0}
Trams141;14;23;82695;18:41;{6138.21238208538,2940.1058384544613,0.0}
Trams184;18;6;82696;18:41;{2110.2352000027895,1344.0613000001758,0.0}
Trams142;14;18;82697;18:41;{6831.853600002825,3315.144899999723,0.0}
Trams146;14;3;82701;18:42;{3035.1652000024915,1729.7097000014037,0.0}
Trams184;18;2;82704;18:43;{1740.6504000015557,1186.7970000002533,0.0}
Trams181;18;9;82705;18:43;{5689.812200002372,2815.7713999990374,0.0}
Trams184;18;1;82705;18:43;{1692.722305299079,1166.6255241828771,0.0}
Trams141;14;22;82705;18:43;{5641.738919684285,2786.998382666919,0.0}
Trams141;14;23;82706;18:43;{5634.466500002891,2784.006800001487,0.0}
Trams149;14;4;82709;18:43;{5739.764803540053,2830.2159521656795,0.0}
Trams185;18;5;82712;18:44;{2675.4015184145933,1580.8842637522473,0.0}
Trams142;14;19;82712;18:44;{6188.119100000709,2954.7112999986857,0.0}
Trams181;18;8;82716;18:45;{6221.943900000304,2968.579499999061,0.0}
Trams143;14;21;82716;18:45;{7477.508000001311,3581.729000000283,0.0}
Trams141;14;22;82718;18:45;{5058.904000002891,2546.714799998328,0.0}
Trams182;18;23;82720;18:45;{5641.738919684285,2786.998382666919,0.0}
Trams183;18;11;82722;18:46;{2992.747200001031,1703.0900999996811,0.0}
Trams142;14;18;82723;18:46;{5641.738919684285,2786.998382666919,0.0}
Trams184;18;5;82725;18:46;{845.340600002557,806.1041999999434,0.0}
Trams148;14;2;82728;18:47;{5689.812200002372,2815.7713999990374,0.0}
Trams183;18;10;82731;18:47;{2589.0274000018835,1538.5219000000507,0.0}
Trams182;18;20;82734;18:48;{5010.473492013262,2527.781076226536,0.0}
Trams146;14;2;82737;18:48;{4722.0763000026345,2426.624300001189,0.0}
Trams182;18;19;82741;18:49;{4672.309900000691,2395.577299999073,0.0}
Trams183;18;8;82741;18:49;{2110.2352000027895,1344.0613000001758,0.0}
Trams183;18;5;82742;18:49;{2064.0685709043055,1320.5282183098925,0.0}
Trams142;14;17;82744;18:49;{4672.309900000691,2395.577299999073,0.0}
Trams181;18;21;82747;18:50;{7477.508000001311,3581.729000000283,0.0}
Trams149;14;19;82750;18:50;{7477.508000001311,3581.729000000283,0.0}
Trams181;18;22;82755;18:51;{7172.43200000003,3532.2607999984175,0.0}
Trams184;18;4;82755;18:51;{2149.2538000009954,1363.784799998626,0.0}
Trams143;14;20;82759;18:52;{5634.466500002891,2784.006800001487,0.0}
Trams141;14;24;82762;18:52;{2992.747200001031,1703.0900999996811,0.0}
Trams184;18;3;82766;18:53;{2675.4015184145933,1580.8842637522473,0.0}
Trams181;18;23;82770;18:54;{6563.806600000709,3123.2601999994367,0.0}
Trams183;18;6;82770;18:54;{845.340600002557,806.1041999999434,0.0}
Trams148;14;16;82770;18:54;{7477.508000001311,3581.729000000283,0.0}
Trams143;14;17;82771;18:54;{5058.904000002891,2546.714799998328,0.0}
Trams143;14;15;82772;18:54;{5010.473492013262,2527.781076226536,0.0}
Trams149;14;20;82773;18:54;{6563.806600000709,3123.2601999994367,0.0}
Trams184;18;5;82774;18:54;{3035.1652000024915,1729.7097000014037,0.0}
Trams141;14;20;82775;18:54;{2808.1955000013113,1135.889900000766,0.0}
Trams141;14;18;82776;18:55;{2774.94460455129,1095.9101807449765,0.0}
Trams143;14;14;82779;18:55;{4672.309900000691,2395.577299999073,0.0}
Trams143;14;13;82780;18:55;{4624.179771982149,2375.8925514936154,0.0}
Trams141;14;13;82782;18:56;{2569.3393000029027,869.8653000015765,0.0}
Trams141;14;10;82783;18:56;{2567.6414284064917,825.1840510346515,0.0}
Trams147;14;5;82785;18:56;{7477.508000001311,3581.729000000283,0.0}
Trams182;18;18;82786;18:56;{2589.0274000018835,1538.5219000000507,0.0}
Trams185;18;4;82788;18:57;{6221.943900000304,2968.579499999061,0.0}
Trams181;18;21;82789;18:57;{5641.738919684285,2786.998382666919,0.0}
Trams181;18;19;82790;18:57;{5634.466500002891,2784.006800001487,0.0}
Trams183;18;8;82792;18:57;{1782.5218000002205,1208.6106000002474,0.0}
Trams141;14;9;82793;18:57;{2894.896500002593,514.0241999980062,0.0}
Trams142;14;16;82793;18:57;{2808.1955000013113,1135.889900000766,0.0}
Trams147;14;6;82793;18:57;{7172.43200000003,3532.2607999984175,0.0}
Trams182;18;14;82796;18:58;{2110.2352000027895,1344.0613000001758,0.0}
Trams184;18;6;82796;18:58;{4084.1569000035524,2161.088000001386,0.0}
Trams182;18;8;82797;18:58;{2064.0685709043055,1320.5282183098925,0.0}
Trams142;14;15;82800;18:59;{2569.3393000029027,869.8653000015765,0.0}
Trams146;14;5;82800;18:59;{7477.508000001311,3581.729000000283,0.0}
Trams142;14;12;82801;18:59;{2567.6414284064917,825.1840510346515,0.0}
Trams148;14;17;82801;18:59;{6188.119100000709,2954.7112999986857,0.0}
Trams181;18;18;82802;18:59;{5058.904000002891,2546.714799998328,0.0}
Trams148;14;14;82802;18:59;{6138.21238208538,2940.1058384544613,0.0}
Trams181;18;17;82803;18:59;{5010.473492013262,2527.781076226536,0.0}
Trams182;18;7;82804;18:59;{1740.6504000015557,1186.7970000002533,0.0}
Trams182;18;4;82805;18:59;{1692.722305299079,1166.6255241828771,0.0}
Trams184;18;3;82810;19:0;{4722.0763000026345,2426.624300001189,0.0}
Trams142;14;14;82810;19:0;{2894.896500002593,514.0241999980062,0.0}
Trams142;14;12;82811;19:0;{2894.896500002593,514.0241999980062,0.0}
Trams148;14;12;82813;19:1;{5634.466500002891,2784.006800001487,0.0}
Trams184;18;2;82818;19:2;{5108.905971347362,2577.745680309252,0.0}
Trams183;18;10;82819;19:2;{3035.1652000024915,1729.7097000014037,0.0}
Trams185;18;12;82819;19:2;{7477.508000001311,3581.729000000283,0.0}
Trams181;18;16;82824;19:3;{4031.8555000014603,2128.9623999986798,0.0}
Trams182;18;5;82825;19:3;{845.340600002557,806.1041999999434,0.0}
Trams148;14;11;82825;19:3;{5058.904000002891,2546.714799998328,0.0}
Trams143;14;12;82828;19:3;{2808.1955000013113,1135.889900000766,0.0}
Trams184;18;1;82831;19:4;{5689.812200002372,2815.7713999990374,0.0}
Trams148;14;9;82833;19:4;{4672.309900000691,2395.577299999073,0.0}
Trams143;14;11;82835;19:4;{2569.3393000029027,869.8653000015765,0.0}
Trams143;14;10;82836;19:5;{2567.6414284064917,825.1840510346515,0.0}
Trams146;14;4;82843;19:6;{5634.466500002891,2784.006800001487,0.0}
Trams143;14;7;82846;19:6;{2894.896500002593,514.0241999980062,0.0}
Trams147;14;5;82848;19:7;{4672.309900000691,2395.577299999073,0.0}
Trams181;18;14;82855;19:8;{2589.0274000018835,1538.5219000000507,0.0}
Trams146;14;3;82855;19:8;{5058.904000002891,2546.714799998328,0.0}
Trams147;14;4;82862;19:9;{4031.8555000014603,2128.9623999986798,0.0}
Trams183;18;8;82863;19:9;{5108.905971347362,2577.745680309252,0.0}
Trams149;14;19;82863;19:9;{2774.94460455129,1095.9101807449765,0.0}
Trams181;18;13;82865;19:9;{2110.2352000027895,1344.0613000001758,0.0}
Trams182;18;4;82865;19:9;{2627.1466000005603,1561.507400000468,0.0}
Trams181;18;11;82866;19:10;{2064.0685709043055,1320.5282183098925,0.0}
Trams149;14;12;82869;19:10;{2569.3393000029027,869.8653000015765,0.0}
Trams141;14;8;82870;19:10;{5108.905971347362,2577.745680309252,0.0}
Trams149;14;9;82870;19:10;{2567.6414284064917,825.1840510346515,0.0}
Trams181;18;9;82873;19:11;{1740.6504000015557,1186.7970000002533,0.0}
Trams183;18;7;82877;19:11;{5739.764803540053,2830.2159521656795,0.0}
Trams149;14;10;82879;19:12;{2894.896500002593,514.0241999980062,0.0}
Trams149;14;6;82880;19:12;{2894.896500002593,514.0241999980062,0.0}
Trams148;14;8;82882;19:12;{2808.1955000013113,1135.889900000766,0.0}
Trams148;14;6;82883;19:12;{2774.94460455129,1095.9101807449765,0.0}
Trams141;14;7;82884;19:13;{5739.764803540053,2830.2159521656795,0.0}
Trams183;18;5;82887;19:13;{6221.943900000304,2968.579499999061,0.0}
Trams148;14;4;82890;19:14;{2567.6414284064917,825.1840510346515,0.0}
Trams147;14;3;82898;19:15;{2774.94460455129,1095.9101807449765,0.0}
Trams148;14;2;82900;19:15;{2894.896500002593,514.0241999980062,0.0}
Trams146;14;2;82913;19:17;{2774.94460455129,1095.9101807449765,0.0}
Trams185;18;10;82927;19:20;{2589.0274000018835,1538.5219000000507,0.0}
Trams145;14;6;82927;19:20;{2808.1955000013113,1135.889900000766,0.0}
Trams184;18;2;82936;19:21;{4672.309900000691,2395.577299999073,0.0}
Trams185;18;9;82937;19:21;{2110.2352000027895,1344.0613000001758,0.0}
Trams185;18;8;82938;19:22;{2064.0685709043055,1320.5282183098925,0.0}
Trams185;18;6;82945;19:23;{1740.6504000015557,1186.7970000002533,0.0}
Trams185;18;5;82946;19:23;{1692.722305299079,1166.6255241828771,0.0}
Trams184;18;1;82950;19:24;{4031.8555000014603,2128.9623999986798,0.0}
Trams184;18;2;82991;19:30;{2110.2352000027895,1344.0613000001758,0.0}
