roadName;nPassages;cycleNo
Roads0;[];[]
Roads1;[];[]
Roads2;[];[]
Roads3;[];[]
Roads4;[];[]
Roads5;[];[]
Roads6;[];[]
Roads7;[];[]
Roads8;[];[]
Roads9;[];[]
Roads10;[];[]
Roads11;[];[]
Roads12;[];[]
Roads13;[];[]
Roads14;[];[]
Roads15;[];[]
Roads16;[];[]
Roads17;[];[]
Roads18;[];[]
Roads19;[];[]
Roads20;[];[]
Roads21;[];[]
Roads22;[];[]
Roads23;[];[]
Roads24;[];[]
Roads25;[];[]
Roads26;[];[]
Roads27;[];[]
Roads28;[];[]
Roads29;[];[]
Roads30;[];[]
Roads31;[];[]
Roads32;[];[]
Roads33;[];[]
Roads34;[];[]
Roads35;[];[]
Roads36;[];[]
Roads37;[];[]
Roads38;[];[]
Roads39;[];[]
Roads40;[];[]
Roads41;[];[]
Roads42;[];[]
Roads43;[];[]
Roads44;[];[]
Roads45;[];[]
Roads46;[];[]
Roads47;[];[]
Roads48;[];[]
Roads49;[];[]
Roads50;[];[]
Roads51;[];[]
Roads52;[];[]
Roads53;[];[]
Roads54;[];[]
Roads55;[];[]
Roads56;[];[]
Roads57;[];[]
Roads58;[];[]
Roads59;[];[]
Roads60;[];[]
Roads61;[];[]
Roads62;[];[]
Roads63;[];[]
Roads64;[];[]
Roads65;[];[]
Roads66;[];[]
Roads67;[];[]
Roads68;[];[]
Roads69;[];[]
Roads70;[];[]
Roads71;[];[]
Roads72;[];[]
Roads73;[];[]
Roads74;[];[]
Roads75;[];[]
Roads76;[];[]
Roads77;[];[]
Roads78;[];[]
Roads79;[];[]
Roads80;[];[]
Roads81;[];[]
Roads82;[];[]
Roads83;[];[]
Roads84;[];[]
Roads85;[];[]
Roads86;[];[]
Roads87;[];[]
Roads88;[];[]
Roads89;[];[]
Roads90;[];[]
Roads91;[];[]
Roads92;[];[]
Roads93;[];[]
Roads94;[];[]
Roads95;[];[]
Roads96;[];[]
Roads97;[];[]
Roads98;[];[]
Roads99;[];[]
Roads100;[];[]
Roads101;[];[]
Roads102;[];[]
Roads103;[];[]
Roads104;[];[]
Roads105;[];[]
Roads106;[];[]
Roads107;[];[]
Roads108;[];[]
Roads109;[];[]
Roads110;[];[]
Roads111;[];[]
Roads112;[];[]
Roads113;[];[]
Roads114;[];[]
Roads115;[];[]
Roads116;[];[]
Roads117;[];[]
Roads118;[];[]
Roads119;[];[]
Roads120;[];[]
Roads121;[];[]
Roads122;[];[]
Roads123;[];[]
Roads124;[];[]
Roads125;[];[]
Roads126;[];[]
Roads127;[];[]
Roads128;[];[]
Roads129;[];[]
Roads130;[];[]
Roads131;[];[]
Roads132;[];[]
Roads133;[];[]
Roads134;[];[]
Roads135;[];[]
Roads136;[];[]
Roads137;[];[]
Roads138;[];[]
Roads139;[];[]
Roads140;[];[]
Roads141;[];[]
Roads142;[];[]
Roads143;[];[]
Roads144;[];[]
Roads145;[];[]
Roads146;[];[]
Roads147;[];[]
Roads148;[];[]
Roads149;[];[]
Roads150;[];[]
Roads151;[];[]
Roads152;[];[]
Roads153;[];[]
Roads154;[];[]
Roads155;[];[]
Roads156;[];[]
Roads157;[];[]
Roads158;[];[]
Roads159;[];[]
Roads160;[];[]
Roads161;[];[]
Roads162;[];[]
Roads163;[];[]
Roads164;[];[]
Roads165;[];[]
Roads166;[];[]
Roads167;[];[]
Roads168;[];[]
Roads169;[];[]
Roads170;[];[]
Roads171;[];[]
Roads172;[];[]
Roads173;[];[]
Roads174;[];[]
Roads175;[];[]
Roads176;[];[]
Roads177;[];[]
Roads178;[];[]
Roads179;[];[]
Roads180;[];[]
Roads181;[];[]
Roads182;[];[]
Roads183;[];[]
Roads184;[];[]
Roads185;[];[]
Roads186;[];[]
Roads187;[];[]
Roads188;[];[]
Roads189;[];[]
Roads190;[];[]
Roads191;[];[]
Roads192;[];[]
Roads193;[];[]
Roads194;[];[]
Roads195;[];[]
Roads196;[];[]
Roads197;[];[]
Roads198;[];[]
Roads199;[];[]
Roads200;[];[]
Roads201;[];[]
Roads202;[];[]
Roads203;[];[]
Roads204;[];[]
Roads205;[];[]
Roads206;[];[]
Roads207;[];[]
Roads208;[];[]
Roads209;[];[]
Roads210;[];[]
Roads211;[];[]
Roads212;[];[]
Roads213;[];[]
Roads214;[];[]
Roads215;[];[]
Roads216;[];[]
Roads217;[];[]
Roads218;[];[]
Roads219;[];[]
Roads220;[];[]
Roads221;[];[]
Roads222;[];[]
Roads223;[];[]
Roads224;[];[]
Roads225;[];[]
Roads226;[];[]
Roads227;[];[]
Roads228;[];[]
Roads229;[];[]
Roads230;[];[]
Roads231;[];[]
Roads232;[];[]
Roads233;[];[]
Roads234;[];[]
Roads235;[];[]
Roads236;[];[]
Roads237;[];[]
Roads238;[];[]
Roads239;[];[]
Roads240;[];[]
Roads241;[];[]
Roads242;[];[]
Roads243;[];[]
Roads244;[];[]
Roads245;[];[]
Roads246;[];[]
Roads247;[];[]
Roads248;[];[]
Roads249;[];[]
Roads250;[];[]
Roads251;[];[]
Roads252;[];[]
Roads253;[];[]
Roads254;[];[]
Roads255;[];[]
Roads256;[];[]
Roads257;[];[]
Roads258;[];[]
Roads259;[];[]
Roads260;[];[]
Roads261;[];[]
Roads262;[];[]
Roads263;[];[]
Roads264;[];[]
Roads265;[];[]
Roads266;[];[]
Roads267;[];[]
Roads268;[];[]
Roads269;[];[]
Roads270;[];[]
Roads271;[];[]
Roads272;[];[]
Roads273;[];[]
Roads274;[];[]
Roads275;[];[]
Roads276;[];[]
Roads277;[];[]
Roads278;[];[]
Roads279;[];[]
Roads280;[];[]
Roads281;[];[]
Roads282;[];[]
Roads283;[];[]
Roads284;[];[]
Roads285;[];[]
Roads286;[];[]
Roads287;[];[]
Roads288;[];[]
Roads289;[];[]
Roads290;[];[]
Roads291;[];[]
Roads292;[];[]
Roads293;[];[]
Roads294;[];[]
Roads295;[];[]
Roads296;[];[]
Roads297;[];[]
Roads298;[];[]
Roads299;[];[]
Roads300;[];[]
Roads301;[];[]
Roads302;[];[]
Roads303;[];[]
Roads304;[];[]
Roads305;[];[]
Roads306;[];[]
Roads307;[];[]
Roads308;[];[]
Roads309;[];[]
Roads310;[];[]
Roads311;[];[]
Roads312;[];[]
Roads313;[];[]
Roads314;[];[]
Roads315;[];[]
Roads316;[];[]
Roads317;[];[]
Roads318;[];[]
Roads319;[];[]
Roads320;[];[]
Roads321;[];[]
Roads322;[];[]
Roads323;[];[]
Roads324;[];[]
Roads325;[];[]
Roads326;[];[]
Roads327;[];[]
Roads328;[];[]
Roads329;[];[]
Roads330;[];[]
Roads331;[];[]
Roads332;[];[]
Roads333;[];[]
Roads334;[];[]
Roads335;[];[]
Roads336;[];[]
Roads337;[];[]
Roads338;[];[]
Roads339;[];[]
Roads340;[];[]
Roads341;[];[]
Roads342;[];[]
Roads343;[];[]
Roads344;[];[]
Roads345;[];[]
Roads346;[];[]
Roads347;[];[]
Roads348;[];[]
Roads349;[];[]
Roads350;[];[]
Roads351;[];[]
Roads352;[];[]
Roads353;[];[]
Roads354;[];[]
Roads355;[];[]
Roads356;[];[]
Roads357;[];[]
Roads358;[];[]
Roads359;[];[]
Roads360;[];[]
Roads361;[];[]
Roads362;[];[]
Roads363;[];[]
Roads364;[];[]
Roads365;[];[]
Roads366;[];[]
Roads367;[];[]
Roads368;[];[]
Roads369;[];[]
Roads370;[];[]
Roads371;[];[]
Roads372;[];[]
Roads373;[];[]
Roads374;[];[]
Roads375;[];[]
Roads376;[];[]
Roads377;[];[]
Roads378;[];[]
Roads379;[];[]
Roads380;[];[]
Roads381;[];[]
Roads382;[];[]
Roads383;[];[]
Roads384;[];[]
Roads385;[];[]
Roads386;[];[]
Roads387;[];[]
Roads388;[];[]
Roads389;[];[]
Roads390;[];[]
Roads391;[];[]
Roads392;[];[]
Roads393;[];[]
Roads394;[];[]
Roads395;[];[]
Roads396;[];[]
Roads397;[];[]
Roads398;[];[]
Roads399;[];[]
Roads400;[];[]
Roads401;[];[]
Roads402;[];[]
Roads403;[];[]
Roads404;[];[]
Roads405;[];[]
Roads406;[];[]
Roads407;[];[]
Roads408;[];[]
Roads409;[];[]
Roads410;[];[]
Roads411;[];[]
Roads412;[];[]
Roads413;[];[]
Roads414;[];[]
Roads415;[];[]
Roads416;[];[]
Roads417;[];[]
Roads418;[];[]
Roads419;[];[]
Roads420;[];[]
Roads421;[];[]
Roads422;[];[]
Roads423;[];[]
Roads424;[];[]
Roads425;[];[]
Roads426;[];[]
Roads427;[];[]
Roads428;[];[]
Roads429;[];[]
Roads430;[];[]
Roads431;[];[]
Roads432;[];[]
Roads433;[];[]
Roads434;[];[]
Roads435;[];[]
Roads436;[];[]
Roads437;[];[]
Roads438;[];[]
Roads439;[];[]
Roads440;[];[]
Roads441;[];[]
Roads442;[];[]
Roads443;[];[]
Roads444;[];[]
Roads445;[];[]
Roads446;[];[]
Roads447;[];[]
Roads448;[];[]
Roads449;[];[]
Roads450;[];[]
Roads451;[];[]
Roads452;[];[]
Roads453;[];[]
Roads454;[];[]
Roads455;[];[]
Roads456;[];[]
Roads457;[];[]
Roads458;[];[]
Roads459;[];[]
Roads460;[];[]
Roads461;[];[]
Roads462;[];[]
Roads463;[];[]
Roads464;[];[]
Roads465;[];[]
Roads466;[];[]
Roads467;[];[]
Roads468;[];[]
Roads469;[];[]
Roads470;[];[]
Roads471;[];[]
Roads472;[];[]
Roads473;[];[]
Roads474;[];[]
Roads475;[];[]
Roads476;[];[]
Roads477;[];[]
Roads478;[];[]
Roads479;[];[]
Roads480;[];[]
Roads481;[];[]
Roads482;[];[]
Roads483;[];[]
Roads484;[];[]
Roads485;[];[]
Roads486;[];[]
Roads487;[];[]
Roads488;[];[]
Roads489;[];[]
Roads490;[];[]
Roads491;[];[]
Roads492;[];[]
Roads493;[];[]
Roads494;[];[]
Roads495;[];[]
Roads496;[];[]
Roads497;[];[]
Roads498;[];[]
Roads499;[];[]
Roads500;[];[]
Roads501;[];[]
Roads502;[];[]
Roads503;[];[]
Roads504;[];[]
Roads505;[];[]
Roads506;[];[]
Roads507;[];[]
Roads508;[];[]
Roads509;[];[]
Roads510;[];[]
Roads511;[];[]
Roads512;[];[]
Roads513;[];[]
Roads514;[];[]
Roads515;[];[]
Roads516;[];[]
Roads517;[];[]
Roads518;[];[]
Roads519;[];[]
Roads520;[];[]
Roads521;[];[]
Roads522;[];[]
Roads523;[];[]
Roads524;[];[]
Roads525;[];[]
Roads526;[];[]
Roads527;[];[]
Roads528;[];[]
Roads529;[];[]
Roads530;[];[]
Roads531;[];[]
Roads532;[];[]
Roads533;[];[]
Roads534;[];[]
Roads535;[];[]
Roads536;[];[]
Roads537;[];[]
Roads538;[];[]
Roads539;[];[]
Roads540;[];[]
Roads541;[];[]
Roads542;[];[]
Roads543;[];[]
Roads544;[];[]
Roads545;[];[]
Roads546;[];[]
Roads547;[];[]
Roads548;[];[]
Roads549;[];[]
Roads550;[];[]
Roads551;[];[]
Roads552;[];[]
Roads553;[];[]
Roads554;[];[]
Roads555;[];[]
Roads556;[];[]
Roads557;[];[]
Roads558;[];[]
Roads559;[];[]
Roads560;[];[]
Roads561;[];[]
Roads562;[];[]
Roads563;[];[]
Roads564;[];[]
Roads565;[];[]
Roads566;[];[]
Roads567;[];[]
Roads568;[];[]
Roads569;[];[]
Roads570;[];[]
Roads571;[];[]
Roads572;[];[]
Roads573;[];[]
Roads574;[];[]
Roads575;[];[]
Roads576;[];[]
Roads577;[];[]
Roads578;[];[]
Roads579;[];[]
Roads580;[];[]
Roads581;[];[]
Roads582;[];[]
Roads583;[];[]
Roads584;[];[]
Roads585;[];[]
Roads586;[];[]
Roads587;[];[]
Roads588;[];[]
Roads589;[];[]
Roads590;[];[]
Roads591;[];[]
Roads592;[];[]
Roads593;[];[]
Roads594;[];[]
Roads595;[];[]
Roads596;[];[]
Roads597;[];[]
Roads598;[];[]
Roads599;[];[]
Roads600;[];[]
Roads601;[];[]
Roads602;[];[]
Roads603;[];[]
Roads604;[];[]
Roads605;[];[]
Roads606;[];[]
Roads607;[];[]
Roads608;[];[]
Roads609;[];[]
Roads610;[];[]
Roads611;[];[]
Roads612;[];[]
Roads613;[];[]
Roads614;[];[]
Roads615;[];[]
Roads616;[];[]
Roads617;[];[]
Roads618;[];[]
Roads619;[];[]
Roads620;[];[]
Roads621;[];[]
Roads622;[];[]
Roads623;[];[]
Roads624;[];[]
Roads625;[];[]
Roads626;[];[]
Roads627;[];[]
Roads628;[];[]
Roads629;[];[]
Roads630;[];[]
Roads631;[];[]
Roads632;[];[]
Roads633;[];[]
Roads634;[];[]
Roads635;[];[]
Roads636;[];[]
Roads637;[];[]
Roads638;[];[]
Roads639;[];[]
Roads640;[];[]
Roads641;[];[]
Roads642;[];[]
Roads643;[];[]
Roads644;[];[]
Roads645;[];[]
Roads646;[];[]
Roads647;[];[]
Roads648;[];[]
Roads649;[];[]
Roads650;[];[]
Roads651;[];[]
Roads652;[];[]
Roads653;[];[]
Roads654;[];[]
Roads655;[];[]
Roads656;[];[]
Roads657;[];[]
Roads658;[];[]
Roads659;[];[]
Roads660;[];[]
Roads661;[];[]
Roads662;[];[]
Roads663;[];[]
Roads664;[];[]
Roads665;[];[]
Roads666;[];[]
Roads667;[];[]
Roads668;[];[]
Roads669;[];[]
Roads670;[];[]
Roads671;[];[]
Roads672;[];[]
Roads673;[];[]
Roads674;[];[]
Roads675;[];[]
Roads676;[];[]
Roads677;[];[]
Roads678;[];[]
Roads679;[];[]
Roads680;[];[]
Roads681;[];[]
Roads682;[];[]
Roads683;[];[]
Roads684;[];[]
Roads685;[];[]
Roads686;[];[]
Roads687;[];[]
Roads688;[];[]
Roads689;[];[]
Roads690;[];[]
Roads691;[];[]
Roads692;[];[]
Roads693;[];[]
Roads694;[];[]
Roads695;[];[]
Roads696;[];[]
Roads697;[];[]
Roads698;[];[]
Roads699;[];[]
Roads700;[];[]
Roads701;[];[]
Roads702;[];[]
Roads703;[];[]
Roads704;[];[]
Roads705;[];[]
Roads706;[];[]
Roads707;[];[]
Roads708;[];[]
Roads709;[];[]
Roads710;[];[]
Roads711;[];[]
Roads712;[];[]
Roads713;[];[]
Roads714;[];[]
Roads715;[];[]
Roads716;[];[]
Roads717;[];[]
Roads718;[];[]
Roads719;[];[]
Roads720;[];[]
Roads721;[];[]
Roads722;[];[]
Roads723;[];[]
Roads724;[];[]
Roads725;[];[]
Roads726;[];[]
Roads727;[];[]
Roads728;[];[]
Roads729;[];[]
Roads730;[];[]
Roads731;[];[]
Roads732;[];[]
Roads733;[];[]
Roads734;[];[]
Roads735;[];[]
Roads736;[];[]
Roads737;[];[]
Roads738;[];[]
Roads739;[];[]
Roads740;[];[]
Roads741;[];[]
Roads742;[];[]
Roads743;[];[]
Roads744;[];[]
Roads745;[];[]
Roads746;[];[]
Roads747;[];[]
Roads748;[];[]
Roads749;[];[]
Roads750;[];[]
Roads751;[];[]
Roads752;[];[]
Roads753;[];[]
Roads754;[];[]
Roads755;[];[]
Roads756;[];[]
Roads757;[];[]
Roads758;[];[]
Roads759;[];[]
Roads760;[];[]
Roads761;[];[]
Roads762;[];[]
Roads763;[];[]
Roads764;[];[]
Roads765;[];[]
Roads766;[];[]
Roads767;[];[]
Roads768;[];[]
Roads769;[];[]
Roads770;[];[]
Roads771;[];[]
Roads772;[];[]
Roads773;[];[]
Roads774;[];[]
Roads775;[];[]
Roads776;[];[]
Roads777;[];[]
Roads778;[];[]
Roads779;[];[]
Roads780;[];[]
Roads781;[];[]
Roads782;[];[]
Roads783;[];[]
Roads784;[];[]
Roads785;[];[]
Roads786;[];[]
Roads787;[];[]
Roads788;[];[]
Roads789;[];[]
Roads790;[];[]
Roads791;[];[]
Roads792;[];[]
Roads793;[];[]
Roads794;[];[]
Roads795;[];[]
Roads796;[];[]
Roads797;[];[]
Roads798;[];[]
Roads799;[];[]
Roads800;[];[]
Roads801;[];[]
Roads802;[];[]
Roads803;[];[]
Roads804;[];[]
Roads805;[];[]
Roads806;[];[]
Roads807;[];[]
Roads808;[];[]
Roads809;[];[]
Roads810;[];[]
Roads811;[];[]
Roads812;[];[]
Roads813;[];[]
Roads814;[];[]
Roads815;[];[]
Roads816;[];[]
Roads817;[];[]
Roads818;[];[]
Roads819;[];[]
Roads820;[];[]
Roads821;[];[]
Roads822;[];[]
Roads823;[];[]
Roads824;[];[]
Roads825;[];[]
Roads826;[];[]
Roads827;[];[]
Roads828;[];[]
Roads829;[];[]
Roads830;[];[]
Roads831;[];[]
Roads832;[];[]
Roads833;[];[]
Roads834;[];[]
Roads835;[];[]
Roads836;[];[]
Roads837;[];[]
Roads838;[];[]
Roads839;[];[]
Roads840;[];[]
Roads841;[];[]
Roads842;[];[]
Roads843;[];[]
Roads844;[];[]
Roads845;[];[]
Roads846;[];[]
Roads847;[];[]
Roads848;[];[]
Roads849;[];[]
Roads850;[];[]
Roads851;[];[]
Roads852;[];[]
Roads853;[];[]
Roads854;[];[]
Roads855;[];[]
Roads856;[];[]
Roads857;[];[]
Roads858;[];[]
Roads859;[];[]
Roads860;[];[]
Roads861;[];[]
Roads862;[];[]
Roads863;[];[]
Roads864;[];[]
Roads865;[];[]
Roads866;[];[]
Roads867;[];[]
Roads868;[];[]
Roads869;[];[]
Roads870;[];[]
Roads871;[];[]
Roads872;[];[]
Roads873;[];[]
Roads874;[];[]
Roads875;[];[]
Roads876;[];[]
Roads877;[];[]
Roads878;[];[]
Roads879;[];[]
Roads880;[];[]
Roads881;[];[]
Roads882;[];[]
Roads883;[];[]
Roads884;[];[]
Roads885;[];[]
Roads886;[];[]
Roads887;[];[]
Roads888;[];[]
Roads889;[];[]
Roads890;[];[]
Roads891;[];[]
Roads892;[];[]
Roads893;[];[]
Roads894;[];[]
Roads895;[];[]
Roads896;[];[]
Roads897;[];[]
Roads898;[];[]
Roads899;[];[]
Roads900;[];[]
Roads901;[];[]
Roads902;[];[]
Roads903;[];[]
Roads904;[];[]
Roads905;[];[]
Roads906;[];[]
Roads907;[];[]
Roads908;[];[]
Roads909;[];[]
Roads910;[];[]
Roads911;[];[]
Roads912;[];[]
Roads913;[];[]
Roads914;[];[]
Roads915;[];[]
Roads916;[];[]
Roads917;[];[]
Roads918;[];[]
Roads919;[];[]
Roads920;[];[]
Roads921;[];[]
Roads922;[];[]
Roads923;[];[]
Roads924;[];[]
Roads925;[];[]
Roads926;[];[]
Roads927;[];[]
Roads928;[];[]
Roads929;[];[]
Roads930;[];[]
Roads931;[];[]
Roads932;[];[]
Roads933;[];[]
Roads934;[];[]
Roads935;[];[]
Roads936;[];[]
Roads937;[];[]
Roads938;[];[]
Roads939;[];[]
Roads940;[];[]
Roads941;[];[]
Roads942;[];[]
Roads943;[];[]
Roads944;[];[]
Roads945;[];[]
Roads946;[];[]
Roads947;[];[]
Roads948;[];[]
Roads949;[];[]
Roads950;[];[]
Roads951;[];[]
Roads952;[];[]
Roads953;[];[]
Roads954;[];[]
Roads955;[];[]
Roads956;[];[]
Roads957;[];[]
Roads958;[];[]
Roads959;[];[]
Roads960;[];[]
Roads961;[];[]
Roads962;[];[]
Roads963;[];[]
Roads964;[];[]
Roads965;[];[]
Roads966;[];[]
Roads967;[];[]
Roads968;[];[]
Roads969;[];[]
Roads970;[];[]
Roads971;[];[]
Roads972;[];[]
Roads973;[];[]
Roads974;[];[]
Roads975;[];[]
Roads976;[];[]
Roads977;[];[]
Roads978;[];[]
Roads979;[];[]
Roads980;[];[]
Roads981;[];[]
Roads982;[];[]
Roads983;[];[]
Roads984;[];[]
Roads985;[];[]
Roads986;[];[]
Roads987;[];[]
Roads988;[];[]
Roads989;[];[]
Roads990;[];[]
Roads991;[];[]
Roads992;[];[]
Roads993;[];[]
Roads994;[];[]
Roads995;[];[]
Roads996;[];[]
Roads997;[];[]
