tramName;tramLine;nPassengers;cycleNo;time;location
Trams182;18;1;1;6:0;{4084.1569000035524,2161.088000001386,0.0}
Trams141;14;1;1;6:0;{2894.896500002593,514.0241999980062,0.0}
Trams141;14;2;13;6:2;{2597.49450000003,904.9190000016242,0.0}
Trams181;18;1;21;6:3;{1782.5218000002205,1208.6106000002474,0.0}
Trams141;14;3;21;6:3;{2839.1857000030577,1180.8036000002176,0.0}
Trams149;14;1;21;6:3;{4672.309900000691,2395.577299999073,0.0}
Trams182;18;3;24;6:4;{5123.508700001985,2583.745899999514,0.0}
Trams142;14;2;31;6:5;{2597.49450000003,904.9190000016242,0.0}
Trams185;18;1;32;6:5;{2589.0274000018835,1538.5219000000507,0.0}
Trams182;18;4;36;6:6;{5689.812200002372,2815.7713999990374,0.0}
Trams181;18;2;39;6:6;{2627.1466000005603,1561.507400000468,0.0}
Trams182;18;6;47;6:7;{6221.943900000304,2968.579499999061,0.0}
Trams181;18;1;48;6:8;{3035.1652000024915,1729.7097000014037,0.0}
Trams143;14;1;54;6:9;{2894.896500002593,514.0241999980062,0.0}
Trams147;14;1;56;6:9;{4672.309900000691,2395.577299999073,0.0}
Trams146;14;1;63;6:10;{5058.904000002891,2546.714799998328,0.0}
Trams183;18;1;66;6:11;{5634.466500002891,2784.006800001487,0.0}
Trams143;14;4;66;6:11;{2597.49450000003,904.9190000016242,0.0}
Trams141;14;8;70;6:11;{4722.0763000026345,2426.624300001189,0.0}
Trams182;18;5;71;6:11;{7223.311400000006,3570.043500000611,0.0}
Trams185;18;0;71;6:11;{845.340600002557,806.1041999999434,0.0}
Trams143;14;7;74;6:12;{2839.1857000030577,1180.8036000002176,0.0}
Trams182;18;0;77;6:12;{7477.508000001311,3581.729000000283,0.0}
Trams183;18;2;78;6:13;{5058.904000002891,2546.714799998328,0.0}
Trams141;14;10;79;6:13;{5123.508700001985,2583.745899999514,0.0}
Trams143;14;8;87;6:14;{3035.1652000024915,1729.7097000014037,0.0}
Trams149;14;2;88;6:14;{2894.896500002593,514.0241999980062,0.0}
Trams141;14;11;91;6:15;{5689.812200002372,2815.7713999990374,0.0}
Trams181;18;3;93;6:15;{5123.508700001985,2583.745899999514,0.0}
Trams185;18;2;93;6:15;{1782.5218000002205,1208.6106000002474,0.0}
Trams147;14;0;93;6:15;{2952.0448504139104,1673.1693294131398,0.0}
Trams142;14;3;97;6:16;{5123.508700001985,2583.745899999514,0.0}
Trams149;14;5;100;6:16;{2597.49450000003,904.9190000016242,0.0}
Trams185;18;6;101;6:16;{2149.2538000009954,1363.784799998626,0.0}
Trams141;14;13;102;6:17;{6221.943900000304,2968.579499999061,0.0}
Trams146;14;0;108;6:18;{2952.0448504139104,1673.1693294131398,0.0}
Trams148;14;1;108;6:18;{2894.896500002593,514.0241999980062,0.0}
Trams149;14;7;108;6:18;{2839.1857000030577,1180.8036000002176,0.0}
Trams182;18;1;109;6:18;{6188.119100000709,2954.7112999986857,0.0}
Trams143;14;10;109;6:18;{4084.1569000035524,2161.088000001386,0.0}
Trams185;18;8;111;6:18;{2627.1466000005603,1561.507400000468,0.0}
Trams181;18;4;116;6:19;{6221.943900000304,2968.579499999061,0.0}
Trams141;14;12;118;6:19;{6883.719200000167,3354.242599999532,0.0}
Trams148;14;2;120;6:20;{2597.49450000003,904.9190000016242,0.0}
Trams143;14;13;123;6:20;{4722.0763000026345,2426.624300001189,0.0}
Trams148;14;3;128;6:21;{2839.1857000030577,1180.8036000002176,0.0}
Trams141;14;0;132;6:22;{7477.508000001311,3581.729000000283,0.0}
Trams143;14;12;132;6:22;{5123.508700001985,2583.745899999514,0.0}
Trams147;14;1;135;6:22;{2597.49450000003,904.9190000016242,0.0}
Trams182;18;2;141;6:23;{4672.309900000691,2395.577299999073,0.0}
Trams147;14;2;143;6:23;{2839.1857000030577,1180.8036000002176,0.0}
Trams149;14;6;143;6:23;{4084.1569000035524,2161.088000001386,0.0}
Trams143;14;16;144;6:24;{5689.812200002372,2815.7713999990374,0.0}
Trams181;18;0;146;6:24;{7477.508000001311,3581.729000000283,0.0}
Trams142;14;0;150;6:25;{7477.508000001311,3581.729000000283,0.0}
Trams146;14;1;150;6:25;{2597.49450000003,904.9190000016242,0.0}
Trams184;18;3;155;6:25;{2149.2538000009954,1363.784799998626,0.0}
Trams185;18;12;156;6:26;{4722.0763000026345,2426.624300001189,0.0}
Trams143;14;15;156;6:26;{6271.932036142039,2982.903802087056,0.0}
Trams146;14;5;158;6:26;{2839.1857000030577,1180.8036000002176,0.0}
Trams148;14;2;163;6:27;{4084.1569000035524,2161.088000001386,0.0}
Trams143;14;14;164;6:27;{6609.992500003427,3161.7836000006646,0.0}
Trams184;18;5;165;6:27;{2627.1466000005603,1561.507400000468,0.0}
Trams185;18;15;165;6:27;{5123.508700001985,2583.745899999514,0.0}
Trams183;18;0;170;6:28;{845.340600002557,806.1041999999434,0.0}
Trams143;14;13;170;6:28;{6864.837443928478,3341.6995773341046,0.0}
Trams144;14;1;173;6:28;{2894.896500002593,514.0241999980062,0.0}
Trams185;18;18;177;6:29;{5689.812200002372,2815.7713999990374,0.0}
Trams143;14;0;185;6:30;{7477.508000001311,3581.729000000283,0.0}
Trams144;14;3;185;6:30;{2597.49450000003,904.9190000016242,0.0}
Trams148;14;4;186;6:31;{5123.508700001985,2583.745899999514,0.0}
Trams185;18;19;188;6:31;{6221.943900000304,2968.579499999061,0.0}
Trams147;14;4;192;6:32;{4722.0763000026345,2426.624300001189,0.0}
Trams144;14;4;193;6:32;{2839.1857000030577,1180.8036000002176,0.0}
Trams141;14;1;196;6:32;{4672.309900000691,2395.577299999073,0.0}
Trams183;18;3;200;6:33;{2149.2538000009954,1363.784799998626,0.0}
Trams185;18;18;203;6:33;{6864.837443928478,3341.6995773341046,0.0}
Trams149;14;5;205;6:34;{6883.719200000167,3354.242599999532,0.0}
Trams146;14;7;207;6:34;{4722.0763000026345,2426.624300001189,0.0}
Trams148;14;5;209;6:34;{6221.943900000304,2968.579499999061,0.0}
Trams141;14;2;210;6:35;{4031.8555000014603,2128.9623999986798,0.0}
Trams185;18;17;213;6:35;{7267.007879060962,3598.2324644667874,0.0}
Trams149;14;6;213;6:35;{7223.311400000006,3570.043500000611,0.0}
Trams185;18;3;218;6:36;{7477.508000001311,3581.729000000283,0.0}
Trams185;18;0;219;6:36;{7477.508000001311,3581.729000000283,0.0}
Trams149;14;1;219;6:36;{7477.508000001311,3581.729000000283,0.0}
Trams182;18;0;225;6:37;{845.340600002557,806.1041999999434,0.0}
Trams146;14;8;228;6:38;{5689.812200002372,2815.7713999990374,0.0}
Trams145;14;1;231;6:38;{5123.508700001985,2583.745899999514,0.0}
Trams184;18;4;232;6:38;{5739.764803540053,2830.2159521656795,0.0}
Trams146;14;9;239;6:39;{6221.943900000304,2968.579499999061,0.0}
Trams148;14;1;239;6:39;{7477.508000001311,3581.729000000283,0.0}
Trams148;14;0;240;6:40;{7477.508000001311,3581.729000000283,0.0}
Trams143;14;1;241;6:40;{5058.904000002891,2546.714799998328,0.0}
Trams184;18;5;242;6:40;{6221.943900000304,2968.579499999061,0.0}
Trams145;14;3;243;6:40;{5689.812200002372,2815.7713999990374,0.0}
Trams181;18;1;246;6:41;{2992.747200001031,1703.0900999996811,0.0}
Trams141;14;1;246;6:41;{2774.94460455129,1095.9101807449765,0.0}
Trams182;18;3;247;6:41;{1782.5218000002205,1208.6106000002474,0.0}
Trams143;14;2;249;6:41;{4672.309900000691,2395.577299999073,0.0}
Trams141;14;0;253;6:42;{2567.6414284064917,825.1840510346515,0.0}
Trams146;14;8;254;6:42;{6864.837443928478,3341.6995773341046,0.0}
Trams147;14;2;254;6:42;{7477.508000001311,3581.729000000283,0.0}
Trams181;18;4;255;6:42;{2589.0274000018835,1538.5219000000507,0.0}
Trams147;14;0;255;6:42;{7477.508000001311,3581.729000000283,0.0}
Trams185;18;1;262;6:43;{5634.466500002891,2784.006800001487,0.0}
Trams141;14;1;263;6:43;{2894.896500002593,514.0241999980062,0.0}
Trams142;14;1;263;6:43;{2808.1955000013113,1135.889900000766,0.0}
Trams143;14;1;263;6:43;{4031.8555000014603,2128.9623999986798,0.0}
Trams144;14;6;263;6:43;{5689.812200002372,2815.7713999990374,0.0}
Trams183;18;5;264;6:44;{5123.508700001985,2583.745899999514,0.0}
Trams141;14;2;264;6:44;{2892.683600001037,511.3241000007838,0.0}
Trams182;18;4;265;6:44;{2627.1466000005603,1561.507400000468,0.0}
Trams146;14;0;269;6:44;{7477.508000001311,3581.729000000283,0.0}
Trams184;18;0;272;6:45;{7477.508000001311,3581.729000000283,0.0}
Trams185;18;2;274;6:45;{5058.904000002891,2546.714799998328,0.0}
Trams141;14;13;275;6:45;{2597.49450000003,904.9190000016242,0.0}
Trams149;14;2;275;6:45;{5058.904000002891,2546.714799998328,0.0}
Trams183;18;8;276;6:46;{5689.812200002372,2815.7713999990374,0.0}
Trams183;18;7;277;6:46;{5739.764803540053,2830.2159521656795,0.0}
Trams141;14;20;283;6:47;{2839.1857000030577,1180.8036000002176,0.0}
Trams145;14;0;284;6:47;{7477.508000001311,3581.729000000283,0.0}
Trams181;18;3;285;6:47;{1208.916700001806,962.1525999996811,0.0}
Trams142;14;3;293;6:48;{2597.49450000003,904.9190000016242,0.0}
Trams181;18;0;294;6:49;{845.340600002557,806.1041999999434,0.0}
Trams185;18;1;295;6:49;{4048.297289360261,2135.7927898531034,0.0}
Trams185;18;2;296;6:49;{4031.8555000014603,2128.9623999986798,0.0}
Trams141;14;19;297;6:49;{3084.0353342962862,1747.4296273253601,0.0}
Trams142;14;4;301;6:50;{2839.1857000030577,1180.8036000002176,0.0}
Trams144;14;2;304;6:50;{7477.508000001311,3581.729000000283,0.0}
Trams144;14;0;305;6:50;{7477.508000001311,3581.729000000283,0.0}
Trams143;14;0;306;6:51;{2567.6414284064917,825.1840510346515,0.0}
Trams182;18;3;309;6:51;{4707.823850244834,2420.7529164061234,0.0}
Trams182;18;5;310;6:51;{4722.0763000026345,2426.624300001189,0.0}
Trams142;14;5;314;6:52;{3035.1652000024915,1729.7097000014037,0.0}
Trams183;18;0;317;6:52;{7477.508000001311,3581.729000000283,0.0}
Trams182;18;4;318;6:53;{5108.905971347362,2577.745680309252,0.0}
Trams141;14;18;318;6:53;{4084.1569000035524,2161.088000001386,0.0}
Trams182;18;5;319;6:53;{5123.508700001985,2583.745899999514,0.0}
Trams181;18;2;324;6:54;{2149.2538000009954,1363.784799998626,0.0}
Trams143;14;1;328;6:54;{2597.49450000003,904.9190000016242,0.0}
Trams182;18;8;331;6:55;{5689.812200002372,2815.7713999990374,0.0}
Trams141;14;19;332;6:55;{4722.0763000026345,2426.624300001189,0.0}
Trams181;18;3;334;6:55;{2627.1466000005603,1561.507400000468,0.0}
Trams184;18;1;336;6:56;{4672.309900000691,2395.577299999073,0.0}
Trams143;14;5;336;6:56;{2839.1857000030577,1180.8036000002176,0.0}
Trams141;14;20;341;6:56;{5123.508700001985,2583.745899999514,0.0}
Trams142;14;8;350;6:58;{4722.0763000026345,2426.624300001189,0.0}
Trams143;14;4;350;6:58;{3084.0353342962862,1747.4296273253601,0.0}
Trams149;14;1;350;6:58;{2894.896500002593,514.0241999980062,0.0}
Trams141;14;19;354;6:59;{5739.764803540053,2830.2159521656795,0.0}
Trams182;18;7;358;6:59;{6883.719200000167,3354.242599999532,0.0}
Trams142;14;9;359;6:59;{5123.508700001985,2583.745899999514,0.0}
Trams141;14;17;364;7:0;{6221.943900000304,2968.579499999061,0.0}
Trams181;18;4;365;7:0;{4084.1569000035524,2161.088000001386,0.0}
Trams185;18;0;366;7:1;{845.340600002557,806.1041999999434,0.0}
Trams148;14;2;370;7:1;{2894.896500002593,514.0241999980062,0.0}
Trams149;14;2;370;7:1;{2839.1857000030577,1180.8036000002176,0.0}
Trams142;14;12;371;7:1;{5689.812200002372,2815.7713999990374,0.0}
Trams182;18;0;372;7:2;{7477.508000001311,3581.729000000283,0.0}
Trams142;14;11;372;7:2;{5739.764803540053,2830.2159521656795,0.0}
Trams183;18;1;373;7:2;{5058.904000002891,2546.714799998328,0.0}
Trams181;18;7;379;7:3;{4722.0763000026345,2426.624300001189,0.0}
Trams141;14;16;380;7:3;{6883.719200000167,3354.242599999532,0.0}
Trams183;18;2;381;7:3;{4672.309900000691,2395.577299999073,0.0}
Trams142;14;12;382;7:3;{6221.943900000304,2968.579499999061,0.0}
Trams144;14;1;382;7:3;{4031.8555000014603,2128.9623999986798,0.0}
Trams148;14;6;382;7:3;{2597.49450000003,904.9190000016242,0.0}
Trams143;14;7;385;7:4;{4722.0763000026345,2426.624300001189,0.0}
Trams147;14;2;385;7:4;{2894.896500002593,514.0241999980062,0.0}
Trams181;18;14;388;7:4;{5123.508700001985,2583.745899999514,0.0}
Trams185;18;1;388;7:4;{1782.5218000002205,1208.6106000002474,0.0}
Trams141;14;15;389;7:4;{7267.007879060962,3598.2324644667874,0.0}
Trams148;14;9;390;7:5;{2839.1857000030577,1180.8036000002176,0.0}
Trams141;14;1;394;7:5;{7477.508000001311,3581.729000000283,0.0}
Trams183;18;1;395;7:5;{4031.8555000014603,2128.9623999986798,0.0}
Trams141;14;0;395;7:5;{7477.508000001311,3581.729000000283,0.0}
Trams185;18;8;396;7:6;{2149.2538000009954,1363.784799998626,0.0}
Trams147;14;5;397;7:6;{2597.49450000003,904.9190000016242,0.0}
Trams181;18;17;400;7:6;{5689.812200002372,2815.7713999990374,0.0}
Trams146;14;2;400;7:6;{2894.896500002593,514.0241999980062,0.0}
Trams182;18;1;404;7:7;{6188.119100000709,2954.7112999986857,0.0}
Trams148;14;8;404;7:7;{3084.0353342962862,1747.4296273253601,0.0}
Trams147;14;10;405;7:7;{2839.1857000030577,1180.8036000002176,0.0}
Trams149;14;3;405;7:7;{4084.1569000035524,2161.088000001386,0.0}
Trams185;18;9;406;7:7;{2627.1466000005603,1561.507400000468,0.0}
Trams181;18;19;411;7:8;{6221.943900000304,2968.579499999061,0.0}
Trams142;14;2;412;7:8;{7477.508000001311,3581.729000000283,0.0}
Trams146;14;4;412;7:8;{2597.49450000003,904.9190000016242,0.0}
Trams142;14;1;413;7:8;{7477.508000001311,3581.729000000283,0.0}
Trams145;14;3;415;7:9;{2894.896500002593,514.0241999980062,0.0}
Trams144;14;0;418;7:9;{2774.94460455129,1095.9101807449765,0.0}
Trams149;14;8;419;7:9;{4722.0763000026345,2426.624300001189,0.0}
Trams184;18;0;420;7:10;{845.340600002557,806.1041999999434,0.0}
Trams146;14;7;420;7:10;{2839.1857000030577,1180.8036000002176,0.0}
Trams148;14;9;425;7:10;{4084.1569000035524,2161.088000001386,0.0}
Trams183;18;2;426;7:11;{2589.0274000018835,1538.5219000000507,0.0}
Trams145;14;7;427;7:11;{2597.49450000003,904.9190000016242,0.0}
Trams149;14;11;428;7:11;{5123.508700001985,2583.745899999514,0.0}
Trams144;14;3;435;7:12;{2894.896500002593,514.0241999980062,0.0}
Trams145;14;9;435;7:12;{2839.1857000030577,1180.8036000002176,0.0}
Trams185;18;11;437;7:12;{4084.1569000035524,2161.088000001386,0.0}
Trams148;14;13;439;7:13;{4722.0763000026345,2426.624300001189,0.0}
Trams149;14;17;440;7:13;{5689.812200002372,2815.7713999990374,0.0}
Trams181;18;1;441;7:13;{7477.508000001311,3581.729000000283,0.0}
Trams149;14;16;441;7:13;{5739.764803540053,2830.2159521656795,0.0}
Trams181;18;0;442;7:13;{7477.508000001311,3581.729000000283,0.0}
Trams184;18;3;442;7:13;{1782.5218000002205,1208.6106000002474,0.0}
Trams183;18;0;445;7:14;{1692.722305299079,1166.6255241828771,0.0}
Trams143;14;0;447;7:14;{7477.508000001311,3581.729000000283,0.0}
Trams144;14;4;447;7:14;{2597.49450000003,904.9190000016242,0.0}
Trams148;14;17;448;7:14;{5123.508700001985,2583.745899999514,0.0}
Trams185;18;14;451;7:15;{4722.0763000026345,2426.624300001189,0.0}
Trams149;14;17;451;7:15;{6221.943900000304,2968.579499999061,0.0}
Trams144;14;8;455;7:15;{2839.1857000030577,1180.8036000002176,0.0}
Trams184;18;7;460;7:16;{2627.1466000005603,1561.507400000468,0.0}
Trams185;18;15;460;7:16;{5123.508700001985,2583.745899999514,0.0}
Trams148;14;20;460;7:16;{5689.812200002372,2815.7713999990374,0.0}
Trams146;14;10;469;7:18;{4722.0763000026345,2426.624300001189,0.0}
Trams182;18;0;472;7:18;{2992.747200001031,1703.0900999996811,0.0}
Trams185;18;18;472;7:18;{5689.812200002372,2815.7713999990374,0.0}
Trams146;14;13;478;7:19;{5123.508700001985,2583.745899999514,0.0}
Trams182;18;1;481;7:20;{2589.0274000018835,1538.5219000000507,0.0}
Trams149;14;2;481;7:20;{7477.508000001311,3581.729000000283,0.0}
Trams149;14;1;482;7:20;{7477.508000001311,3581.729000000283,0.0}
Trams185;18;19;483;7:20;{6221.943900000304,2968.579499999061,0.0}
Trams145;14;11;484;7:20;{4722.0763000026345,2426.624300001189,0.0}
Trams183;18;1;487;7:21;{1782.5218000002205,1208.6106000002474,0.0}
Trams144;14;9;490;7:21;{4084.1569000035524,2161.088000001386,0.0}
Trams146;14;14;490;7:21;{5689.812200002372,2815.7713999990374,0.0}
Trams145;14;12;493;7:22;{5123.508700001985,2583.745899999514,0.0}
Trams183;18;5;495;7:22;{2149.2538000009954,1363.784799998626,0.0}
Trams147;14;9;495;7:22;{6609.992500003427,3161.7836000006646,0.0}
Trams148;14;19;496;7:22;{7267.007879060962,3598.2324644667874,0.0}
Trams181;18;1;497;7:22;{5058.904000002891,2546.714799998328,0.0}
Trams146;14;13;501;7:23;{6221.943900000304,2968.579499999061,0.0}
Trams148;14;3;501;7:23;{7477.508000001311,3581.729000000283,0.0}
Trams146;14;12;502;7:23;{6271.932036142039,2982.903802087056,0.0}
Trams148;14;1;502;7:23;{7477.508000001311,3581.729000000283,0.0}
Trams144;14;11;504;7:24;{4722.0763000026345,2426.624300001189,0.0}
Trams181;18;2;505;7:24;{4672.309900000691,2395.577299999073,0.0}
Trams183;18;9;505;7:24;{2627.1466000005603,1561.507400000468,0.0}
Trams145;14;14;505;7:24;{5689.812200002372,2815.7713999990374,0.0}
Trams182;18;0;510;7:25;{1213.7785956119094,964.194963392883,0.0}
Trams182;18;1;511;7:25;{1208.916700001806,962.1525999996811,0.0}
Trams185;18;3;513;7:25;{7477.508000001311,3581.729000000283,0.0}
Trams144;14;13;513;7:25;{5123.508700001985,2583.745899999514,0.0}
Trams185;18;1;514;7:25;{7477.508000001311,3581.729000000283,0.0}
Trams147;14;0;516;7:26;{7477.508000001311,3581.729000000283,0.0}
Trams182;18;2;520;7:26;{845.340600002557,806.1041999999434,0.0}
Trams145;14;13;524;7:27;{6593.146138654794,3149.575753243163,0.0}
Trams141;14;13;525;7:27;{2894.896500002593,514.0241999980062,0.0}
Trams144;14;14;525;7:27;{5689.812200002372,2815.7713999990374,0.0}
Trams149;14;2;525;7:27;{5634.466500002891,2784.006800001487,0.0}
Trams184;18;6;527;7:27;{5739.764803540053,2830.2159521656795,0.0}
Trams146;14;1;531;7:28;{7477.508000001311,3581.729000000283,0.0}
Trams144;14;15;536;7:29;{6221.943900000304,2968.579499999061,0.0}
Trams141;14;24;537;7:29;{2597.49450000003,904.9190000016242,0.0}
Trams182;18;1;541;7:30;{1768.882714616512,1202.84636491075,0.0}
Trams142;14;5;543;7:30;{2894.896500002593,514.0241999980062,0.0}
Trams145;14;0;546;7:31;{7477.508000001311,3581.729000000283,0.0}
Trams182;18;6;550;7:31;{2149.2538000009954,1363.784799998626,0.0}
Trams183;18;15;550;7:31;{4722.0763000026345,2426.624300001189,0.0}
Trams142;14;17;555;7:32;{2597.49450000003,904.9190000016242,0.0}
Trams185;18;2;557;7:32;{5634.466500002891,2784.006800001487,0.0}
Trams149;14;1;558;7:33;{4048.297289360261,2135.7927898531034,0.0}
Trams183;18;24;559;7:33;{5123.508700001985,2583.745899999514,0.0}
Trams141;14;23;559;7:33;{3084.0353342962862,1747.4296273253601,0.0}
Trams182;18;7;560;7:33;{2627.1466000005603,1561.507400000468,0.0}
Trams142;14;24;563;7:33;{2839.1857000030577,1180.8036000002176,0.0}
Trams1411;14;7;563;7:33;{2839.1857000030577,1180.8036000002176,0.0}
Trams148;14;2;565;7:34;{4672.309900000691,2395.577299999073,0.0}
Trams144;14;1;566;7:34;{7477.508000001311,3581.729000000283,0.0}
Trams184;18;0;567;7:34;{7477.508000001311,3581.729000000283,0.0}
Trams181;18;3;568;7:34;{1740.6504000015557,1186.7970000002533,0.0}
Trams185;18;4;569;7:34;{5058.904000002891,2546.714799998328,0.0}
Trams142;14;23;576;7:36;{3035.1652000024915,1729.7097000014037,0.0}
Trams185;18;6;577;7:36;{4672.309900000691,2395.577299999073,0.0}
Trams143;14;3;578;7:36;{2894.896500002593,514.0241999980062,0.0}
Trams181;18;2;589;7:38;{845.340600002557,806.1041999999434,0.0}
Trams143;14;12;590;7:38;{2597.49450000003,904.9190000016242,0.0}
Trams182;18;8;591;7:38;{4084.1569000035524,2161.088000001386,0.0}
Trams185;18;5;591;7:38;{4031.8555000014603,2128.9623999986798,0.0}
Trams141;14;24;594;7:39;{4722.0763000026345,2426.624300001189,0.0}
Trams183;18;23;598;7:39;{6883.719200000167,3354.242599999532,0.0}
Trams143;14;15;598;7:39;{2839.1857000030577,1180.8036000002176,0.0}
Trams148;14;1;601;7:40;{2992.747200001031,1703.0900999996811,0.0}
Trams182;18;14;605;7:40;{4722.0763000026345,2426.624300001189,0.0}
Trams144;14;2;610;7:41;{5634.466500002891,2784.006800001487,0.0}
Trams184;18;1;611;7:41;{5634.466500002891,2784.006800001487,0.0}
Trams183;18;0;612;7:42;{7477.508000001311,3581.729000000283,0.0}
Trams142;14;24;612;7:42;{4722.0763000026345,2426.624300001189,0.0}
Trams149;14;8;612;7:42;{2894.896500002593,514.0241999980062,0.0}
Trams185;18;6;613;7:42;{2992.747200001031,1703.0900999996811,0.0}
Trams182;18;22;614;7:42;{5123.508700001985,2583.745899999514,0.0}
Trams181;18;5;619;7:43;{2149.2538000009954,1363.784799998626,0.0}
Trams184;18;2;623;7:43;{5058.904000002891,2546.714799998328,0.0}
Trams149;14;16;624;7:44;{2597.49450000003,904.9190000016242,0.0}
Trams182;18;24;626;7:44;{5689.812200002372,2815.7713999990374,0.0}
Trams181;18;7;629;7:44;{2627.1466000005603,1561.507400000468,0.0}
Trams144;14;1;630;7:45;{4672.309900000691,2395.577299999073,0.0}
Trams148;14;5;632;7:45;{2894.896500002593,514.0241999980062,0.0}
Trams149;14;21;632;7:45;{2839.1857000030577,1180.8036000002176,0.0}
Trams185;18;5;633;7:45;{2064.0685709043055,1320.5282183098925,0.0}
Trams143;14;16;633;7:45;{4084.1569000035524,2161.088000001386,0.0}
Trams1411;14;10;633;7:45;{5689.812200002372,2815.7713999990374,0.0}
Trams182;18;23;637;7:46;{6221.943900000304,2968.579499999061,0.0}
Trams185;18;4;641;7:46;{1692.722305299079,1166.6255241828771,0.0}
Trams148;14;11;644;7:47;{2597.49450000003,904.9190000016242,0.0}
Trams149;14;20;646;7:47;{3084.0353342962862,1747.4296273253601,0.0}
Trams143;14;22;647;7:47;{4722.0763000026345,2426.624300001189,0.0}
Trams147;14;3;647;7:47;{2894.896500002593,514.0241999980062,0.0}
Trams185;18;3;651;7:48;{1213.7785956119094,964.194963392883,0.0}
Trams141;14;23;651;7:48;{7267.007879060962,3598.2324644667874,0.0}
Trams148;14;16;652;7:48;{2839.1857000030577,1180.8036000002176,0.0}
Trams183;18;1;656;7:49;{5634.466500002891,2784.006800001487,0.0}
Trams141;14;1;656;7:49;{7477.508000001311,3581.729000000283,0.0}
Trams143;14;24;656;7:49;{5123.508700001985,2583.745899999514,0.0}
Trams141;14;0;657;7:49;{7477.508000001311,3581.729000000283,0.0}
Trams147;14;4;659;7:49;{2597.49450000003,904.9190000016242,0.0}
Trams1411;14;9;660;7:50;{6883.719200000167,3354.242599999532,0.0}
Trams182;18;22;661;7:50;{7223.311400000006,3570.043500000611,0.0}
Trams185;18;1;661;7:50;{845.340600002557,806.1041999999434,0.0}
Trams146;14;5;662;7:50;{2894.896500002593,514.0241999980062,0.0}
Trams148;14;15;665;7:50;{3035.1652000024915,1729.7097000014037,0.0}
Trams182;18;3;667;7:51;{7477.508000001311,3581.729000000283,0.0}
Trams147;14;6;667;7:51;{2839.1857000030577,1180.8036000002176,0.0}
Trams182;18;2;668;7:51;{7477.508000001311,3581.729000000283,0.0}
Trams183;18;2;668;7:51;{5058.904000002891,2546.714799998328,0.0}
Trams1410;14;3;668;7:51;{5689.812200002372,2815.7713999990374,0.0}
Trams1411;14;8;669;7:51;{7267.007879060962,3598.2324644667874,0.0}
Trams181;18;10;674;7:52;{4722.0763000026345,2426.624300001189,0.0}
Trams142;14;2;674;7:52;{7477.508000001311,3581.729000000283,0.0}
Trams146;14;8;674;7:52;{2597.49450000003,904.9190000016242,0.0}
Trams1411;14;0;674;7:52;{7477.508000001311,3581.729000000283,0.0}
Trams142;14;1;675;7:52;{7477.508000001311,3581.729000000283,0.0}
Trams184;18;1;676;7:52;{2589.0274000018835,1538.5219000000507,0.0}
Trams145;14;4;677;7:52;{2894.896500002593,514.0241999980062,0.0}
Trams145;14;6;678;7:53;{2892.683600001037,511.3241000007838,0.0}
Trams149;14;21;681;7:53;{4722.0763000026345,2426.624300001189,0.0}
Trams146;14;9;682;7:53;{2839.1857000030577,1180.8036000002176,0.0}
Trams181;18;12;683;7:53;{5123.508700001985,2583.745899999514,0.0}
Trams185;18;4;683;7:53;{1782.5218000002205,1208.6106000002474,0.0}
Trams141;14;1;688;7:54;{6188.119100000709,2954.7112999986857,0.0}
Trams148;14;14;688;7:54;{4132.967545312427,2178.980077572535,0.0}
Trams149;14;23;690;7:55;{5123.508700001985,2583.745899999514,0.0}
Trams185;18;10;691;7:55;{2149.2538000009954,1363.784799998626,0.0}
Trams181;18;17;695;7:55;{5689.812200002372,2815.7713999990374,0.0}
Trams144;14;2;697;7:56;{2894.896500002593,514.0241999980062,0.0}
Trams145;14;9;697;7:56;{2839.1857000030577,1180.8036000002176,0.0}
Trams185;18;16;701;7:56;{2627.1466000005603,1561.507400000468,0.0}
Trams148;14;16;701;7:56;{4722.0763000026345,2426.624300001189,0.0}
Trams149;14;24;702;7:57;{5689.812200002372,2815.7713999990374,0.0}
Trams143;14;1;709;7:58;{7477.508000001311,3581.729000000283,0.0}
Trams144;14;9;709;7:58;{2597.49450000003,904.9190000016242,0.0}
Trams1410;14;0;709;7:58;{7477.508000001311,3581.729000000283,0.0}
Trams143;14;0;710;7:58;{7477.508000001311,3581.729000000283,0.0}
Trams148;14;18;710;7:58;{5123.508700001985,2583.745899999514,0.0}
Trams182;18;4;711;7:58;{5634.466500002891,2784.006800001487,0.0}
Trams183;18;1;712;7:58;{2992.747200001031,1703.0900999996811,0.0}
Trams184;18;0;715;7:59;{845.340600002557,806.1041999999434,0.0}
Trams147;14;5;715;7:59;{4707.823850244834,2420.7529164061234,0.0}
Trams147;14;7;716;7:59;{4722.0763000026345,2426.624300001189,0.0}
Trams144;14;13;717;7:59;{2839.1857000030577,1180.8036000002176,0.0}
Trams141;14;2;720;8:0;{4672.309900000691,2395.577299999073,0.0}
Trams148;14;19;722;8:0;{5689.812200002372,2815.7713999990374,0.0}
Trams147;14;9;725;8:0;{5123.508700001985,2583.745899999514,0.0}
Trams149;14;23;729;8:1;{6883.719200000167,3354.242599999532,0.0}
Trams182;18;6;731;8:1;{4672.309900000691,2395.577299999073,0.0}
Trams141;14;1;734;8:2;{4031.8555000014603,2128.9623999986798,0.0}
Trams181;18;0;736;8:2;{7477.508000001311,3581.729000000283,0.0}
Trams184;18;1;737;8:2;{1782.5218000002205,1208.6106000002474,0.0}
Trams149;14;22;737;8:2;{7223.311400000006,3570.043500000611,0.0}
Trams146;14;10;740;8:3;{5123.508700001985,2583.745899999514,0.0}
Trams149;14;1;743;8:3;{7477.508000001311,3581.729000000283,0.0}
Trams184;18;3;745;8:4;{2149.2538000009954,1363.784799998626,0.0}
Trams185;18;17;746;8:4;{4722.0763000026345,2426.624300001189,0.0}
Trams148;14;18;749;8:4;{6883.719200000167,3354.242599999532,0.0}
Trams146;14;11;752;8:5;{5689.812200002372,2815.7713999990374,0.0}
Trams144;14;12;753;8:5;{4132.967545312427,2178.980077572535,0.0}
Trams184;18;6;755;8:5;{2627.1466000005603,1561.507400000468,0.0}
Trams185;18;18;755;8:5;{5123.508700001985,2583.745899999514,0.0}
Trams141;14;0;756;8:6;{2992.747200001031,1703.0900999996811,0.0}
Trams183;18;0;760;8:6;{845.340600002557,806.1041999999434,0.0}
Trams147;14;8;763;8:7;{6864.837443928478,3341.6995773341046,0.0}
Trams148;14;1;763;8:7;{7477.508000001311,3581.729000000283,0.0}
Trams144;14;13;766;8:7;{4722.0763000026345,2426.624300001189,0.0}
Trams185;18;17;767;8:7;{5689.812200002372,2815.7713999990374,0.0}
Trams144;14;15;775;8:9;{5123.508700001985,2583.745899999514,0.0}
Trams182;18;8;776;8:9;{2589.0274000018835,1538.5219000000507,0.0}
Trams147;14;0;778;8:9;{7477.508000001311,3581.729000000283,0.0}
Trams185;18;16;779;8:9;{6271.932036142039,2982.903802087056,0.0}
Trams183;18;1;782;8:10;{1782.5218000002205,1208.6106000002474,0.0}
Trams184;18;7;786;8:11;{4084.1569000035524,2161.088000001386,0.0}
Trams145;14;8;786;8:11;{6593.146138654794,3149.575753243163,0.0}
Trams182;18;7;787;8:11;{2064.0685709043055,1320.5282183098925,0.0}
Trams141;14;7;787;8:11;{2894.896500002593,514.0241999980062,0.0}
Trams183;18;4;790;8:11;{2149.2538000009954,1363.784799998626,0.0}
Trams181;18;3;792;8:12;{5058.904000002891,2546.714799998328,0.0}
Trams146;14;2;793;8:12;{7477.508000001311,3581.729000000283,0.0}
Trams182;18;6;794;8:12;{1740.6504000015557,1186.7970000002533,0.0}
Trams146;14;1;794;8:12;{7477.508000001311,3581.729000000283,0.0}
Trams141;14;17;799;8:13;{2597.49450000003,904.9190000016242,0.0}
Trams149;14;2;799;8:13;{5058.904000002891,2546.714799998328,0.0}
Trams183;18;6;800;8:13;{2627.1466000005603,1561.507400000468,0.0}
Trams142;14;3;805;8:14;{2894.896500002593,514.0241999980062,0.0}
Trams141;14;24;807;8:14;{2839.1857000030577,1180.8036000002176,0.0}
Trams185;18;1;808;8:14;{7477.508000001311,3581.729000000283,0.0}
Trams145;14;0;808;8:14;{7477.508000001311,3581.729000000283,0.0}
Trams184;18;9;809;8:14;{5123.508700001985,2583.745899999514,0.0}
Trams144;14;14;813;8:15;{6864.837443928478,3341.6995773341046,0.0}
Trams182;18;2;815;8:15;{845.340600002557,806.1041999999434,0.0}
Trams142;14;4;817;8:16;{2597.49450000003,904.9190000016242,0.0}
Trams148;14;2;819;8:16;{5058.904000002891,2546.714799998328,0.0}
Trams141;14;23;821;8:16;{3084.0353342962862,1747.4296273253601,0.0}
Trams184;18;8;822;8:17;{5739.764803540053,2830.2159521656795,0.0}
Trams142;14;6;825;8:17;{2839.1857000030577,1180.8036000002176,0.0}
Trams144;14;1;828;8:18;{7477.508000001311,3581.729000000283,0.0}
Trams183;18;7;831;8:18;{4084.1569000035524,2161.088000001386,0.0}
Trams183;18;6;832;8:18;{4132.967545312427,2178.980077572535,0.0}
Trams143;14;4;840;8:20;{2894.896500002593,514.0241999980062,0.0}
Trams141;14;22;843;8:20;{4132.967545312427,2178.980077572535,0.0}
Trams181;18;2;845;8:20;{2589.0274000018835,1538.5219000000507,0.0}
Trams183;18;8;845;8:20;{4722.0763000026345,2426.624300001189,0.0}
Trams146;14;2;849;8:21;{5058.904000002891,2546.714799998328,0.0}
Trams143;14;6;852;8:22;{2597.49450000003,904.9190000016242,0.0}
Trams183;18;12;854;8:22;{5123.508700001985,2583.745899999514,0.0}
Trams182;18;6;855;8:22;{2627.1466000005603,1561.507400000468,0.0}
Trams141;14;21;856;8:22;{4722.0763000026345,2426.624300001189,0.0}
Trams149;14;1;856;8:22;{2808.1955000013113,1135.889900000766,0.0}
Trams142;14;7;860;8:23;{4084.1569000035524,2161.088000001386,0.0}
Trams143;14;9;860;8:23;{2839.1857000030577,1180.8036000002176,0.0}
Trams184;18;0;862;8:23;{7477.508000001311,3581.729000000283,0.0}
Trams148;14;1;863;8:23;{2992.747200001031,1703.0900999996811,0.0}
Trams185;18;2;864;8:24;{5058.904000002891,2546.714799998328,0.0}
Trams141;14;20;864;8:24;{5108.905971347362,2577.745680309252,0.0}
Trams145;14;1;864;8:24;{5058.904000002891,2546.714799998328,0.0}
Trams141;14;19;865;8:24;{5123.508700001985,2583.745899999514,0.0}
Trams183;18;15;866;8:24;{5689.812200002372,2815.7713999990374,0.0}
Trams185;18;3;872;8:25;{4672.309900000691,2395.577299999073,0.0}
Trams142;14;11;874;8:25;{4722.0763000026345,2426.624300001189,0.0}
Trams149;14;2;874;8:25;{2894.896500002593,514.0241999980062,0.0}
Trams181;18;1;884;8:27;{845.340600002557,806.1041999999434,0.0}
Trams183;18;14;885;8:27;{6593.146138654794,3149.575753243163,0.0}
Trams149;14;3;886;8:27;{2597.49450000003,904.9190000016242,0.0}
Trams183;18;13;892;8:28;{6864.837443928478,3341.6995773341046,0.0}
Trams183;18;12;893;8:28;{6883.719200000167,3354.242599999532,0.0}
Trams146;14;1;893;8:28;{2992.747200001031,1703.0900999996811,0.0}
Trams184;18;2;894;8:29;{6188.119100000709,2954.7112999986857,0.0}
Trams148;14;3;894;8:29;{2894.896500002593,514.0241999980062,0.0}
Trams149;14;5;894;8:29;{2839.1857000030577,1180.8036000002176,0.0}
Trams142;14;10;895;8:29;{5689.812200002372,2815.7713999990374,0.0}
Trams182;18;7;900;8:30;{4722.0763000026345,2426.624300001189,0.0}
Trams184;18;3;906;8:31;{5634.466500002891,2784.006800001487,0.0}
Trams148;14;7;906;8:31;{2597.49450000003,904.9190000016242,0.0}
Trams183;18;0;907;8:31;{7477.508000001311,3581.729000000283,0.0}
Trams182;18;9;909;8:31;{5123.508700001985,2583.745899999514,0.0}
Trams141;14;18;913;8:32;{7267.007879060962,3598.2324644667874,0.0}
Trams181;18;8;914;8:32;{2149.2538000009954,1363.784799998626,0.0}
Trams148;14;8;914;8:32;{2839.1857000030577,1180.8036000002176,0.0}
Trams143;14;8;917;8:32;{5108.905971347362,2577.745680309252,0.0}
Trams184;18;4;918;8:33;{5058.904000002891,2546.714799998328,0.0}
Trams141;14;2;918;8:33;{7477.508000001311,3581.729000000283,0.0}
Trams143;14;9;918;8:33;{5123.508700001985,2583.745899999514,0.0}
Trams141;14;0;919;8:33;{7477.508000001311,3581.729000000283,0.0}
Trams142;14;9;921;8:33;{6864.837443928478,3341.6995773341046,0.0}
Trams147;14;1;921;8:33;{2597.49450000003,904.9190000016242,0.0}
Trams145;14;0;922;8:33;{2774.94460455129,1095.9101807449765,0.0}
Trams181;18;10;924;8:34;{2627.1466000005603,1561.507400000468,0.0}
Trams142;14;1;936;8:36;{7477.508000001311,3581.729000000283,0.0}
Trams146;14;2;936;8:36;{2597.49450000003,904.9190000016242,0.0}
Trams183;18;2;939;8:36;{6188.119100000709,2954.7112999986857,0.0}
Trams145;14;1;939;8:36;{2894.896500002593,514.0241999980062,0.0}
Trams182;18;8;940;8:36;{6593.146138654794,3149.575753243163,0.0}
Trams184;18;3;940;8:36;{4031.8555000014603,2128.9623999986798,0.0}
Trams149;14;6;943;8:37;{4722.0763000026345,2426.624300001189,0.0}
Trams146;14;3;944;8:37;{2839.1857000030577,1180.8036000002176,0.0}
Trams182;18;7;948;8:38;{6883.719200000167,3354.242599999532,0.0}
Trams183;18;4;951;8:38;{5634.466500002891,2784.006800001487,0.0}
Trams145;14;2;951;8:38;{2597.49450000003,904.9190000016242,0.0}
Trams149;14;10;952;8:38;{5123.508700001985,2583.745899999514,0.0}
Trams185;18;2;954;8:39;{874.5067790792331,818.4381949221134,0.0}
Trams185;18;1;956;8:39;{845.340600002557,806.1041999999434,0.0}
Trams145;14;3;959;8:39;{2839.1857000030577,1180.8036000002176,0.0}
Trams144;14;2;960;8:40;{2892.683600001037,511.3241000007838,0.0}
Trams182;18;2;962;8:40;{7477.508000001311,3581.729000000283,0.0}
Trams141;14;1;962;8:40;{5634.466500002891,2784.006800001487,0.0}
Trams148;14;10;963;8:40;{4722.0763000026345,2426.624300001189,0.0}
Trams183;18;3;964;8:40;{5010.473492013262,2527.781076226536,0.0}
Trams143;14;8;965;8:40;{7223.311400000006,3570.043500000611,0.0}
Trams183;18;4;971;8:41;{4672.309900000691,2395.577299999073,0.0}
Trams184;18;4;971;8:41;{2589.0274000018835,1538.5219000000507,0.0}
Trams143;14;0;971;8:41;{7477.508000001311,3581.729000000283,0.0}
Trams148;14;13;972;8:42;{5123.508700001985,2583.745899999514,0.0}
Trams149;14;9;976;8:42;{6271.932036142039,2982.903802087056,0.0}
Trams181;18;12;978;8:43;{5123.508700001985,2583.745899999514,0.0}
Trams144;14;3;979;8:43;{2839.1857000030577,1180.8036000002176,0.0}
Trams184;18;3;981;8:43;{2110.2352000027895,1344.0613000001758,0.0}
Trams184;18;2;982;8:43;{2064.0685709043055,1320.5282183098925,0.0}
Trams183;18;3;984;8:44;{4048.297289360261,2135.7927898531034,0.0}
Trams148;14;14;984;8:44;{5689.812200002372,2815.7713999990374,0.0}
Trams185;18;5;986;8:44;{2149.2538000009954,1363.784799998626,0.0}
Trams181;18;13;990;8:45;{5689.812200002372,2815.7713999990374,0.0}
Trams181;18;12;991;8:45;{5739.764803540053,2830.2159521656795,0.0}
Trams146;14;4;993;8:45;{4722.0763000026345,2426.624300001189,0.0}
Trams185;18;7;996;8:46;{2627.1466000005603,1561.507400000468,0.0}
Trams181;18;11;1002;8:47;{6271.932036142039,2982.903802087056,0.0}
Trams146;14;5;1002;8:47;{5123.508700001985,2583.745899999514,0.0}
Trams185;18;6;1005;8:47;{3035.1652000024915,1729.7097000014037,0.0}
Trams149;14;1;1005;8:47;{7477.508000001311,3581.729000000283,0.0}
Trams183;18;1;1007;8:47;{2992.747200001031,1703.0900999996811,0.0}
Trams184;18;0;1010;8:48;{845.340600002557,806.1041999999434,0.0}
Trams148;14;13;1011;8:48;{6883.719200000167,3354.242599999532,0.0}
Trams146;14;7;1014;8:49;{5689.812200002372,2815.7713999990374,0.0}
Trams183;18;2;1016;8:49;{2589.0274000018835,1538.5219000000507,0.0}
Trams148;14;2;1025;8:50;{7477.508000001311,3581.729000000283,0.0}
Trams181;18;10;1026;8:51;{7267.007879060962,3598.2324644667874,0.0}
Trams182;18;5;1026;8:51;{4672.309900000691,2395.577299999073,0.0}
Trams148;14;1;1026;8:51;{7477.508000001311,3581.729000000283,0.0}
Trams185;18;7;1027;8:51;{4084.1569000035524,2161.088000001386,0.0}
Trams143;14;1;1027;8:51;{5058.904000002891,2546.714799998328,0.0}
Trams144;14;4;1028;8:51;{4722.0763000026345,2426.624300001189,0.0}
Trams145;14;4;1029;8:51;{5689.812200002372,2815.7713999990374,0.0}
Trams181;18;1;1031;8:51;{7477.508000001311,3581.729000000283,0.0}
Trams184;18;2;1032;8:52;{1782.5218000002205,1208.6106000002474,0.0}
Trams144;14;6;1037;8:52;{5123.508700001985,2583.745899999514,0.0}
Trams141;14;0;1039;8:53;{2567.6414284064917,825.1840510346515,0.0}
Trams184;18;7;1040;8:53;{2149.2538000009954,1363.784799998626,0.0}
Trams145;14;6;1040;8:53;{6221.943900000304,2968.579499999061,0.0}
Trams147;14;0;1040;8:53;{7477.508000001311,3581.729000000283,0.0}
Trams185;18;8;1041;8:53;{4722.0763000026345,2426.624300001189,0.0}
Trams141;14;9;1049;8:54;{2894.896500002593,514.0241999980062,0.0}
Trams149;14;2;1049;8:54;{5634.466500002891,2784.006800001487,0.0}
Trams184;18;8;1050;8:55;{2627.1466000005603,1561.507400000468,0.0}
Trams185;18;7;1050;8:55;{5123.508700001985,2583.745899999514,0.0}
Trams144;14;5;1050;8:55;{5739.764803540053,2830.2159521656795,0.0}
Trams183;18;1;1055;8:55;{845.340600002557,806.1041999999434,0.0}
Trams146;14;3;1055;8:55;{7477.508000001311,3581.729000000283,0.0}
Trams146;14;1;1056;8:56;{7477.508000001311,3581.729000000283,0.0}
Trams144;14;6;1060;8:56;{6221.943900000304,2968.579499999061,0.0}
Trams141;14;23;1061;8:56;{2597.49450000003,904.9190000016242,0.0}
Trams149;14;4;1061;8:56;{5058.904000002891,2546.714799998328,0.0}
Trams182;18;4;1062;8:57;{2992.747200001031,1703.0900999996811,0.0}
Trams141;14;24;1069;8:58;{2839.1857000030577,1180.8036000002176,0.0}
Trams145;14;0;1070;8:58;{7477.508000001311,3581.729000000283,0.0}
Trams182;18;6;1071;8:58;{2589.0274000018835,1538.5219000000507,0.0}
Trams181;18;2;1075;8:59;{5634.466500002891,2784.006800001487,0.0}
Trams144;14;5;1076;8:59;{6883.719200000167,3354.242599999532,0.0}
Trams142;14;2;1079;8:59;{2597.49450000003,904.9190000016242,0.0}
Trams184;18;9;1081;9:0;{4084.1569000035524,2161.088000001386,0.0}
Trams149;14;3;1082;9:0;{4048.297289360261,2135.7927898531034,0.0}
Trams141;14;22;1083;9:0;{3084.0353342962862,1747.4296273253601,0.0}
Trams181;18;3;1087;9:1;{5058.904000002891,2546.714799998328,0.0}
Trams142;14;8;1087;9:1;{2839.1857000030577,1180.8036000002176,0.0}
Trams146;14;2;1087;9:1;{6188.119100000709,2954.7112999986857,0.0}
Trams144;14;2;1090;9:1;{7477.508000001311,3581.729000000283,0.0}
Trams144;14;1;1091;9:1;{7477.508000001311,3581.729000000283,0.0}
Trams183;18;2;1095;9:2;{2627.1466000005603,1561.507400000468,0.0}
Trams184;18;10;1095;9:2;{4722.0763000026345,2426.624300001189,0.0}
Trams143;14;0;1102;9:3;{2894.896500002593,514.0241999980062,0.0}
Trams185;18;1;1103;9:3;{7477.508000001311,3581.729000000283,0.0}
Trams184;18;11;1104;9:4;{5123.508700001985,2583.745899999514,0.0}
Trams149;14;1;1105;9:4;{2992.747200001031,1703.0900999996811,0.0}
Trams182;18;2;1110;9:5;{845.340600002557,806.1041999999434,0.0}
Trams184;18;12;1116;9:6;{5689.812200002372,2815.7713999990374,0.0}
Trams184;18;11;1117;9:6;{5739.764803540053,2830.2159521656795,0.0}
Trams184;18;10;1135;9:9;{6593.146138654794,3149.575753243163,0.0}
Trams185;18;2;1135;9:9;{6188.119100000709,2954.7112999986857,0.0}
Trams141;14;21;1150;9:11;{6221.943900000304,2968.579499999061,0.0}
Trams146;14;1;1155;9:12;{2992.747200001031,1703.0900999996811,0.0}
Trams184;18;3;1157;9:12;{7477.508000001311,3581.729000000283,0.0}
Trams184;18;0;1158;9:13;{7477.508000001311,3581.729000000283,0.0}
Trams181;18;1;1159;9:13;{1692.722305299079,1166.6255241828771,0.0}
Trams142;14;7;1169;9:14;{6271.932036142039,2982.903802087056,0.0}
Trams141;14;1;1180;9:16;{7477.508000001311,3581.729000000283,0.0}
Trams141;14;0;1181;9:16;{7477.508000001311,3581.729000000283,0.0}
Trams142;14;6;1192;9:18;{7223.311400000006,3570.043500000611,0.0}
Trams142;14;1;1198;9:19;{7477.508000001311,3581.729000000283,0.0}
Trams183;18;1;1202;9:20;{7477.508000001311,3581.729000000283,0.0}
Trams185;18;1;1212;9:22;{2589.0274000018835,1538.5219000000507,0.0}
Trams184;18;1;3617;16:2;{2992.747200001031,1703.0900999996811,0.0}
Trams182;18;4;3618;16:3;{7477.508000001311,3581.729000000283,0.0}
Trams149;14;7;3626;16:4;{7477.508000001311,3581.729000000283,0.0}
Trams182;18;5;3634;16:5;{6831.853600002825,3315.144899999723,0.0}
Trams149;14;8;3634;16:5;{7172.43200000003,3532.2607999984175,0.0}
Trams149;14;9;3642;16:7;{6831.853600002825,3315.144899999723,0.0}
Trams184;18;0;3644;16:7;{1740.6504000015557,1186.7970000002533,0.0}
Trams148;14;9;3646;16:7;{7477.508000001311,3581.729000000283,0.0}
Trams182;18;6;3649;16:8;{6188.119100000709,2954.7112999986857,0.0}
Trams149;14;10;3657;16:9;{6188.119100000709,2954.7112999986857,0.0}
Trams185;18;3;3660;16:10;{3035.1652000024915,1729.7097000014037,0.0}
Trams147;14;5;3661;16:10;{7477.508000001311,3581.729000000283,0.0}
Trams184;18;2;3665;16:10;{845.340600002557,806.1041999999434,0.0}
Trams184;18;3;3667;16:11;{902.5305000022054,834.7037000004202,0.0}
Trams149;14;9;3668;16:11;{5641.738919684285,2786.998382666919,0.0}
Trams141;14;1;3669;16:11;{2894.896500002593,514.0241999980062,0.0}
Trams148;14;10;3669;16:11;{6563.806600000709,3123.2601999994367,0.0}
Trams182;18;7;3673;16:12;{5058.904000002891,2546.714799998328,0.0}
Trams182;18;6;3674;16:12;{5010.473492013262,2527.781076226536,0.0}
Trams146;14;4;3676;16:12;{7477.508000001311,3581.729000000283,0.0}
Trams147;14;6;3677;16:12;{6831.853600002825,3315.144899999723,0.0}
Trams148;14;8;3678;16:13;{6138.21238208538,2940.1058384544613,0.0}
Trams182;18;5;3681;16:13;{4672.309900000691,2395.577299999073,0.0}
Trams149;14;8;3681;16:13;{5058.904000002891,2546.714799998328,0.0}
Trams182;18;4;3682;16:13;{4624.179771982149,2375.8925514936154,0.0}
Trams181;18;8;3687;16:14;{7477.508000001311,3581.729000000283,0.0}
Trams148;14;7;3688;16:14;{5641.738919684285,2786.998382666919,0.0}
Trams148;14;8;3689;16:14;{5634.466500002891,2784.006800001487,0.0}
Trams145;14;6;3691;16:15;{7477.508000001311,3581.729000000283,0.0}
Trams147;14;3;3693;16:15;{6138.21238208538,2940.1058384544613,0.0}
Trams182;18;3;3695;16:15;{4031.8555000014603,2128.9623999986798,0.0}
Trams185;18;2;3696;16:16;{4722.0763000026345,2426.624300001189,0.0}
Trams149;14;9;3703;16:17;{4031.8555000014603,2128.9623999986798,0.0}
Trams185;18;1;3704;16:17;{5108.905971347362,2577.745680309252,0.0}
Trams184;18;2;3706;16:17;{2675.4015184145933,1580.8842637522473,0.0}
Trams183;18;3;3710;16:18;{845.340600002557,806.1041999999434,0.0}
Trams148;14;7;3710;16:18;{4624.179771982149,2375.8925514936154,0.0}
Trams144;14;8;3711;16:18;{7477.508000001311,3581.729000000283,0.0}
Trams147;14;2;3716;16:19;{5058.904000002891,2546.714799998328,0.0}
Trams182;18;2;3718;16:19;{2942.963136644313,1688.2069726773154,0.0}
Trams148;14;8;3723;16:20;{4031.8555000014603,2128.9623999986798,0.0}
Trams147;14;1;3724;16:20;{4672.309900000691,2395.577299999073,0.0}
Trams149;14;10;3725;16:20;{2992.747200001031,1703.0900999996811,0.0}
Trams146;14;3;3732;16:22;{5010.473492013262,2527.781076226536,0.0}
Trams141;14;0;3738;16:23;{4722.0763000026345,2426.624300001189,0.0}
Trams149;14;9;3738;16:23;{2808.1955000013113,1135.889900000766,0.0}
Trams146;14;2;3739;16:23;{4672.309900000691,2395.577299999073,0.0}
Trams149;14;8;3739;16:23;{2774.94460455129,1095.9101807449765,0.0}
Trams149;14;7;3745;16:24;{2569.3393000029027,869.8653000015765,0.0}
Trams145;14;5;3746;16:24;{5058.904000002891,2546.714799998328,0.0}
Trams149;14;4;3746;16:24;{2567.6414284064917,825.1840510346515,0.0}
Trams145;14;4;3747;16:24;{5010.473492013262,2527.781076226536,0.0}
Trams145;14;3;3754;16:25;{4672.309900000691,2395.577299999073,0.0}
Trams149;14;2;3756;16:26;{2894.896500002593,514.0241999980062,0.0}
Trams148;14;6;3758;16:26;{2808.1955000013113,1135.889900000766,0.0}
Trams184;18;1;3759;16:26;{5123.508700001985,2583.745899999514,0.0}
Trams185;18;18;3759;16:26;{7477.508000001311,3581.729000000283,0.0}
Trams148;14;5;3759;16:26;{2774.94460455129,1095.9101807449765,0.0}
Trams148;14;4;3765;16:27;{2569.3393000029027,869.8653000015765,0.0}
Trams148;14;2;3766;16:27;{2567.6414284064917,825.1840510346515,0.0}
Trams144;14;7;3767;16:27;{5010.473492013262,2527.781076226536,0.0}
Trams149;14;3;3768;16:28;{2597.49450000003,904.9190000016242,0.0}
Trams184;18;0;3772;16:28;{5739.764803540053,2830.2159521656795,0.0}
Trams147;14;2;3773;16:28;{2808.1955000013113,1135.889900000766,0.0}
Trams144;14;5;3774;16:29;{4672.309900000691,2395.577299999073,0.0}
Trams185;18;19;3775;16:29;{6831.853600002825,3315.144899999723,0.0}
Trams147;14;1;3781;16:30;{2567.6414284064917,825.1840510346515,0.0}
Trams144;14;3;3788;16:31;{4031.8555000014603,2128.9623999986798,0.0}
Trams185;18;18;3791;16:31;{6138.21238208538,2940.1058384544613,0.0}
Trams183;18;2;3794;16:32;{4707.823850244834,2420.7529164061234,0.0}
Trams185;18;14;3801;16:33;{5641.738919684285,2786.998382666919,0.0}
Trams141;14;20;3801;16:33;{7477.508000001311,3581.729000000283,0.0}
Trams185;18;15;3802;16:33;{5634.466500002891,2784.006800001487,0.0}
Trams145;14;2;3803;16:33;{2808.1955000013113,1135.889900000766,0.0}
Trams181;18;5;3805;16:34;{2110.2352000027895,1344.0613000001758,0.0}
Trams181;18;4;3806;16:34;{2064.0685709043055,1320.5282183098925,0.0}
Trams146;14;1;3806;16:34;{2894.896500002593,514.0241999980062,0.0}
Trams145;14;1;3811;16:35;{2567.6414284064917,825.1840510346515,0.0}
Trams181;18;2;3813;16:35;{1740.6504000015557,1186.7970000002533,0.0}
Trams184;18;3;3813;16:35;{7477.508000001311,3581.729000000283,0.0}
Trams185;18;13;3814;16:35;{5058.904000002891,2546.714799998328,0.0}
Trams185;18;12;3815;16:35;{5010.473492013262,2527.781076226536,0.0}
Trams141;14;21;3817;16:36;{6831.853600002825,3315.144899999723,0.0}
Trams146;14;2;3818;16:36;{2597.49450000003,904.9190000016242,0.0}
Trams142;14;4;3819;16:36;{7477.508000001311,3581.729000000283,0.0}
Trams145;14;2;3820;16:36;{2894.896500002593,514.0241999980062,0.0}
Trams145;14;1;3821;16:36;{2894.896500002593,514.0241999980062,0.0}
Trams185;18;10;3822;16:37;{4672.309900000691,2395.577299999073,0.0}
Trams144;14;2;3823;16:37;{2808.1955000013113,1135.889900000766,0.0}
Trams149;14;1;3824;16:37;{4707.823850244834,2420.7529164061234,0.0}
Trams183;18;1;3827;16:37;{6221.943900000304,2968.579499999061,0.0}
Trams184;18;4;3829;16:38;{6831.853600002825,3315.144899999723,0.0}
Trams148;14;3;3831;16:38;{4084.1569000035524,2161.088000001386,0.0}
Trams141;14;22;3832;16:38;{6188.119100000709,2954.7112999986857,0.0}
Trams141;14;20;3833;16:38;{6138.21238208538,2940.1058384544613,0.0}
Trams181;18;6;3834;16:39;{845.340600002557,806.1041999999434,0.0}
Trams144;14;3;3840;16:40;{2894.896500002593,514.0241999980062,0.0}
Trams144;14;2;3841;16:40;{2894.896500002593,514.0241999980062,0.0}
Trams181;18;7;3844;16:40;{1241.924200002104,980.4126999992877,0.0}
Trams148;14;2;3853;16:42;{5108.905971347362,2577.745680309252,0.0}
Trams143;14;14;3854;16:42;{7477.508000001311,3581.729000000283,0.0}
Trams141;14;19;3857;16:42;{5010.473492013262,2527.781076226536,0.0}
Trams146;14;3;3861;16:43;{4084.1569000035524,2161.088000001386,0.0}
Trams143;14;15;3862;16:43;{7172.43200000003,3532.2607999984175,0.0}
Trams141;14;16;3864;16:44;{4672.309900000691,2395.577299999073,0.0}
Trams185;18;6;3867;16:44;{2589.0274000018835,1538.5219000000507,0.0}
Trams184;18;5;3868;16:44;{5058.904000002891,2546.714799998328,0.0}
Trams181;18;5;3874;16:45;{2627.1466000005603,1561.507400000468,0.0}
Trams142;14;5;3874;16:45;{5058.904000002891,2546.714799998328,0.0}
Trams181;18;4;3875;16:45;{2675.4015184145933,1580.8842637522473,0.0}
Trams146;14;2;3875;16:45;{4722.0763000026345,2426.624300001189,0.0}
Trams185;18;2;3878;16:46;{2064.0685709043055,1320.5282183098925,0.0}
Trams141;14;17;3878;16:46;{4031.8555000014603,2128.9623999986798,0.0}
Trams181;18;3;3883;16:47;{3035.1652000024915,1729.7097000014037,0.0}
Trams185;18;1;3886;16:47;{1692.722305299079,1166.6255241828771,0.0}
Trams143;14;13;3886;16:47;{6138.21238208538,2940.1058384544613,0.0}
Trams149;14;14;3888;16:48;{7477.508000001311,3581.729000000283,0.0}
Trams142;14;4;3896;16:49;{4031.8555000014603,2128.9623999986798,0.0}
Trams143;14;12;3896;16:49;{5641.738919684285,2786.998382666919,0.0}
Trams143;14;10;3897;16:49;{5634.466500002891,2784.006800001487,0.0}
Trams146;14;1;3897;16:49;{5739.764803540053,2830.2159521656795,0.0}
Trams141;14;18;3900;16:50;{2992.747200001031,1703.0900999996811,0.0}
Trams149;14;15;3904;16:50;{6831.853600002825,3315.144899999723,0.0}
Trams185;18;2;3906;16:51;{845.340600002557,806.1041999999434,0.0}
Trams148;14;7;3908;16:51;{7477.508000001311,3581.729000000283,0.0}
Trams143;14;7;3910;16:51;{5010.473492013262,2527.781076226536,0.0}
Trams182;18;5;3913;16:52;{7477.508000001311,3581.729000000283,0.0}
Trams141;14;14;3913;16:52;{2808.1955000013113,1135.889900000766,0.0}
Trams141;14;10;3914;16:52;{2774.94460455129,1095.9101807449765,0.0}
Trams149;14;16;3919;16:53;{6188.119100000709,2954.7112999986857,0.0}
Trams141;14;6;3920;16:53;{2569.3393000029027,869.8653000015765,0.0}
Trams184;18;4;3921;16:53;{2589.0274000018835,1538.5219000000507,0.0}
Trams141;14;3;3921;16:53;{2567.6414284064917,825.1840510346515,0.0}
Trams147;14;2;3923;16:53;{7477.508000001311,3581.729000000283,0.0}
Trams181;18;2;3927;16:54;{5108.905971347362,2577.745680309252,0.0}
Trams141;14;4;3930;16:55;{2894.896500002593,514.0241999980062,0.0}
Trams149;14;14;3930;16:55;{5641.738919684285,2786.998382666919,0.0}
Trams184;18;2;3932;16:55;{2064.0685709043055,1320.5282183098925,0.0}
Trams142;14;3;3932;16:55;{2774.94460455129,1095.9101807449765,0.0}
Trams146;14;5;3938;16:56;{7477.508000001311,3581.729000000283,0.0}
Trams184;18;0;3939;16:56;{1740.6504000015557,1186.7970000002533,0.0}
Trams142;14;2;3939;16:56;{2567.6414284064917,825.1840510346515,0.0}
Trams148;14;8;3939;16:56;{6188.119100000709,2954.7112999986857,0.0}
Trams149;14;13;3943;16:57;{5058.904000002891,2546.714799998328,0.0}
Trams149;14;12;3944;16:57;{5010.473492013262,2527.781076226536,0.0}
Trams142;14;1;3949;16:58;{2894.896500002593,514.0241999980062,0.0}
Trams148;14;6;3950;16:58;{5641.738919684285,2786.998382666919,0.0}
Trams149;14;11;3952;16:58;{4624.179771982149,2375.8925514936154,0.0}
Trams143;14;8;3953;16:58;{2992.747200001031,1703.0900999996811,0.0}
Trams145;14;6;3953;16:58;{7477.508000001311,3581.729000000283,0.0}
Trams145;14;8;3954;16:59;{7446.12100000307,3545.9720000009984,0.0}
Trams184;18;1;3960;17:0;{845.340600002557,806.1041999999434,0.0}
Trams141;14;5;3964;17:0;{3035.1652000024915,1729.7097000014037,0.0}
Trams148;14;5;3964;17:0;{5010.473492013262,2527.781076226536,0.0}
Trams143;14;7;3966;17:1;{2808.1955000013113,1135.889900000766,0.0}
Trams143;14;6;3967;17:1;{2774.94460455129,1095.9101807449765,0.0}
Trams182;18;6;3968;17:1;{5058.904000002891,2546.714799998328,0.0}
Trams142;14;2;3969;17:1;{2839.1857000030577,1180.8036000002176,0.0}
Trams143;14;2;3973;17:2;{2569.3393000029027,869.8653000015765,0.0}
Trams144;14;19;3973;17:2;{7477.508000001311,3581.729000000283,0.0}
Trams143;14;1;3974;17:2;{2567.6414284064917,825.1840510346515,0.0}
Trams182;18;5;3976;17:2;{4672.309900000691,2395.577299999073,0.0}
Trams146;14;4;3981;17:3;{5634.466500002891,2784.006800001487,0.0}
Trams181;18;8;3982;17:3;{7477.508000001311,3581.729000000283,0.0}
Trams184;18;2;3982;17:3;{1782.5218000002205,1208.6106000002474,0.0}
Trams145;14;9;3984;17:4;{6188.119100000709,2954.7112999986857,0.0}
Trams185;18;1;3991;17:5;{4722.0763000026345,2426.624300001189,0.0}
Trams146;14;3;3994;17:5;{5010.473492013262,2527.781076226536,0.0}
Trams144;14;20;3996;17:6;{6563.806600000709,3123.2601999994367,0.0}
Trams145;14;10;3996;17:6;{5634.466500002891,2784.006800001487,0.0}
Trams149;14;9;4000;17:6;{2808.1955000013113,1135.889900000766,0.0}
Trams142;14;1;4004;17:7;{4084.1569000035524,2161.088000001386,0.0}
Trams144;14;18;4005;17:7;{6138.21238208538,2940.1058384544613,0.0}
Trams149;14;8;4007;17:7;{2569.3393000029027,869.8653000015765,0.0}
Trams145;14;9;4008;17:8;{5058.904000002891,2546.714799998328,0.0}
Trams149;14;3;4008;17:8;{2567.6414284064917,825.1840510346515,0.0}
Trams141;14;4;4009;17:8;{5123.508700001985,2583.745899999514,0.0}
Trams144;14;15;4015;17:9;{5641.738919684285,2786.998382666919,0.0}
Trams144;14;14;4016;17:9;{5634.466500002891,2784.006800001487,0.0}
Trams145;14;7;4016;17:9;{4672.309900000691,2395.577299999073,0.0}
Trams145;14;6;4017;17:9;{4624.179771982149,2375.8925514936154,0.0}
Trams149;14;2;4018;17:9;{2894.896500002593,514.0241999980062,0.0}
Trams148;14;4;4020;17:10;{2808.1955000013113,1135.889900000766,0.0}
Trams183;18;2;4027;17:11;{1782.5218000002205,1208.6106000002474,0.0}
Trams148;14;3;4027;17:11;{2569.3393000029027,869.8653000015765,0.0}
Trams144;14;12;4028;17:11;{5058.904000002891,2546.714799998328,0.0}
Trams148;14;2;4028;17:11;{2567.6414284064917,825.1840510346515,0.0}
Trams144;14;8;4029;17:11;{5010.473492013262,2527.781076226536,0.0}
Trams145;14;4;4030;17:11;{4031.8555000014603,2128.9623999986798,0.0}
Trams182;18;4;4031;17:11;{2110.2352000027895,1344.0613000001758,0.0}
Trams182;18;3;4032;17:12;{2064.0685709043055,1320.5282183098925,0.0}
Trams141;14;3;4032;17:12;{6221.943900000304,2968.579499999061,0.0}
Trams144;14;7;4036;17:12;{4672.309900000691,2395.577299999073,0.0}
Trams147;14;1;4036;17:12;{2774.94460455129,1095.9101807449765,0.0}
Trams144;14;5;4037;17:12;{4624.179771982149,2375.8925514936154,0.0}
Trams147;14;2;4042;17:13;{2569.3393000029027,869.8653000015765,0.0}
Trams183;18;1;4045;17:14;{2627.1466000005603,1561.507400000468,0.0}
Trams184;18;1;4045;17:14;{4722.0763000026345,2426.624300001189,0.0}
Trams146;14;1;4051;17:15;{2774.94460455129,1095.9101807449765,0.0}
Trams145;14;5;4052;17:15;{2992.747200001031,1703.0900999996811,0.0}
Trams184;18;0;4053;17:15;{5108.905971347362,2577.745680309252,0.0}
Trams185;18;24;4054;17:15;{7477.508000001311,3581.729000000283,0.0}
Trams182;18;4;4060;17:16;{845.340600002557,806.1041999999434,0.0}
Trams141;14;24;4063;17:17;{7477.508000001311,3581.729000000283,0.0}
Trams145;14;4;4065;17:17;{2808.1955000013113,1135.889900000766,0.0}
Trams142;14;24;4081;17:20;{7477.508000001311,3581.729000000283,0.0}
Trams1411;14;24;4081;17:20;{7477.508000001311,3581.729000000283,0.0}
Trams145;14;1;4083;17:20;{2894.896500002593,514.0241999980062,0.0}
Trams185;18;21;4086;17:21;{6138.21238208538,2940.1058384544613,0.0}
Trams144;14;4;4086;17:21;{2774.94460455129,1095.9101807449765,0.0}
Trams181;18;7;4090;17:21;{2589.0274000018835,1538.5219000000507,0.0}
Trams144;14;3;4092;17:22;{2569.3393000029027,869.8653000015765,0.0}
Trams144;14;2;4093;17:22;{2567.6414284064917,825.1840510346515,0.0}
Trams185;18;17;4096;17:22;{5641.738919684285,2786.998382666919,0.0}
Trams185;18;16;4097;17:22;{5634.466500002891,2784.006800001487,0.0}
Trams181;18;5;4100;17:23;{2110.2352000027895,1344.0613000001758,0.0}
Trams181;18;3;4101;17:23;{2064.0685709043055,1320.5282183098925,0.0}
Trams182;18;3;4101;17:23;{2675.4015184145933,1580.8842637522473,0.0}
Trams141;14;19;4105;17:24;{5641.738919684285,2786.998382666919,0.0}
Trams181;18;2;4108;17:24;{1740.6504000015557,1186.7970000002533,0.0}
Trams184;18;24;4108;17:24;{7477.508000001311,3581.729000000283,0.0}
Trams147;14;3;4108;17:24;{4084.1569000035524,2161.088000001386,0.0}
Trams185;18;13;4109;17:24;{5058.904000002891,2546.714799998328,0.0}
Trams142;14;22;4113;17:25;{6138.21238208538,2940.1058384544613,0.0}
Trams143;14;24;4116;17:26;{7477.508000001311,3581.729000000283,0.0}
Trams1410;14;14;4116;17:26;{7477.508000001311,3581.729000000283,0.0}
Trams185;18;11;4118;17:26;{4624.179771982149,2375.8925514936154,0.0}
Trams1410;14;15;4124;17:27;{7172.43200000003,3532.2607999984175,0.0}
Trams181;18;3;4129;17:28;{845.340600002557,806.1041999999434,0.0}
Trams185;18;8;4131;17:28;{4031.8555000014603,2128.9623999986798,0.0}
Trams1410;14;16;4132;17:28;{6831.853600002825,3315.144899999723,0.0}
Trams142;14;23;4136;17:29;{5058.904000002891,2546.714799998328,0.0}
Trams146;14;0;4137;17:29;{4722.0763000026345,2426.624300001189,0.0}
Trams1411;14;16;4137;17:29;{5010.473492013262,2527.781076226536,0.0}
Trams181;18;4;4139;17:29;{1241.924200002104,980.4126999992877,0.0}
Trams1410;14;17;4139;17:29;{6563.806600000709,3123.2601999994367,0.0}
Trams142;14;22;4144;17:30;{4672.309900000691,2395.577299999073,0.0}
Trams147;14;2;4144;17:30;{5739.764803540053,2830.2159521656795,0.0}
Trams1411;14;11;4144;17:30;{4672.309900000691,2395.577299999073,0.0}
Trams182;18;2;4145;17:30;{4722.0763000026345,2426.624300001189,0.0}
Trams1411;14;9;4145;17:30;{4624.179771982149,2375.8925514936154,0.0}
Trams1410;14;19;4147;17:31;{6188.119100000709,2954.7112999986857,0.0}
Trams149;14;24;4150;17:31;{7477.508000001311,3581.729000000283,0.0}
Trams181;18;5;4151;17:31;{1782.5218000002205,1208.6106000002474,0.0}
Trams183;18;11;4153;17:32;{7477.508000001311,3581.729000000283,0.0}
Trams142;14;21;4158;17:33;{4031.8555000014603,2128.9623999986798,0.0}
Trams144;14;3;4158;17:33;{4084.1569000035524,2161.088000001386,0.0}
Trams1410;14;18;4158;17:33;{5641.738919684285,2786.998382666919,0.0}
Trams181;18;6;4159;17:33;{2149.2538000009954,1363.784799998626,0.0}
Trams143;14;23;4159;17:33;{5634.466500002891,2784.006800001487,0.0}
Trams185;18;6;4162;17:33;{2589.0274000018835,1538.5219000000507,0.0}
Trams141;14;20;4162;17:33;{2992.747200001031,1703.0900999996811,0.0}
Trams184;18;23;4163;17:33;{5058.904000002891,2546.714799998328,0.0}
Trams184;18;21;4164;17:34;{5010.473492013262,2527.781076226536,0.0}
Trams148;14;13;4170;17:35;{7477.508000001311,3581.729000000283,0.0}
Trams184;18;18;4171;17:35;{4672.309900000691,2395.577299999073,0.0}
Trams143;14;22;4171;17:35;{5058.904000002891,2546.714799998328,0.0}
Trams184;18;16;4172;17:35;{4624.179771982149,2375.8925514936154,0.0}
Trams143;14;21;4172;17:35;{5010.473492013262,2527.781076226536,0.0}
Trams1410;14;16;4172;17:35;{5010.473492013262,2527.781076226536,0.0}
Trams185;18;5;4173;17:35;{2064.0685709043055,1320.5282183098925,0.0}
Trams141;14;13;4175;17:35;{2808.1955000013113,1135.889900000766,0.0}
Trams141;14;11;4176;17:36;{2774.94460455129,1095.9101807449765,0.0}
Trams181;18;7;4178;17:36;{3035.1652000024915,1729.7097000014037,0.0}
Trams148;14;16;4178;17:36;{7172.43200000003,3532.2607999984175,0.0}
Trams1410;14;9;4179;17:36;{4672.309900000691,2395.577299999073,0.0}
Trams185;18;4;4180;17:36;{1740.6504000015557,1186.7970000002533,0.0}
Trams143;14;20;4180;17:36;{4624.179771982149,2375.8925514936154,0.0}
Trams144;14;2;4180;17:36;{5108.905971347362,2577.745680309252,0.0}
Trams141;14;9;4182;17:37;{2569.3393000029027,869.8653000015765,0.0}
Trams149;14;23;4182;17:37;{6138.21238208538,2940.1058384544613,0.0}
Trams141;14;6;4183;17:37;{2567.6414284064917,825.1840510346515,0.0}
Trams183;18;12;4184;17:37;{6188.119100000709,2954.7112999986857,0.0}
Trams184;18;17;4185;17:37;{4031.8555000014603,2128.9623999986798,0.0}
Trams147;14;18;4185;17:37;{7477.508000001311,3581.729000000283,0.0}
Trams148;14;17;4186;17:37;{6831.853600002825,3315.144899999723,0.0}
Trams141;14;4;4193;17:38;{2894.896500002593,514.0241999980062,0.0}
Trams142;14;19;4193;17:38;{2808.1955000013113,1135.889900000766,0.0}
Trams149;14;22;4193;17:38;{5634.466500002891,2784.006800001487,0.0}
Trams142;14;12;4194;17:39;{2774.94460455129,1095.9101807449765,0.0}
Trams142;14;9;4200;17:40;{2569.3393000029027,869.8653000015765,0.0}
Trams146;14;12;4200;17:40;{7477.508000001311,3581.729000000283,0.0}
Trams185;18;8;4201;17:40;{845.340600002557,806.1041999999434,0.0}
Trams142;14;7;4201;17:40;{2567.6414284064917,825.1840510346515,0.0}
Trams1411;14;3;4201;17:40;{2567.6414284064917,825.1840510346515,0.0}
Trams149;14;18;4205;17:40;{5058.904000002891,2546.714799998328,0.0}
Trams149;14;16;4206;17:41;{5010.473492013262,2527.781076226536,0.0}
Trams182;18;9;4208;17:41;{7477.508000001311,3581.729000000283,0.0}
Trams183;18;11;4208;17:41;{5058.904000002891,2546.714799998328,0.0}
Trams183;18;9;4209;17:41;{5010.473492013262,2527.781076226536,0.0}
Trams142;14;3;4211;17:41;{2894.896500002593,514.0241999980062,0.0}
Trams1411;14;0;4211;17:41;{2894.896500002593,514.0241999980062,0.0}
Trams148;14;16;4212;17:42;{5641.738919684285,2786.998382666919,0.0}
Trams148;14;15;4213;17:42;{5634.466500002891,2784.006800001487,0.0}
Trams149;14;14;4213;17:42;{4672.309900000691,2395.577299999073,0.0}
Trams181;18;6;4214;17:42;{4722.0763000026345,2426.624300001189,0.0}
Trams143;14;21;4215;17:42;{2992.747200001031,1703.0900999996811,0.0}
Trams145;14;5;4215;17:42;{7477.508000001311,3581.729000000283,0.0}
Trams183;18;6;4216;17:42;{4672.309900000691,2395.577299999073,0.0}
Trams184;18;12;4216;17:42;{2589.0274000018835,1538.5219000000507,0.0}
Trams146;14;13;4216;17:42;{6831.853600002825,3315.144899999723,0.0}
Trams181;18;4;4222;17:43;{5108.905971347362,2577.745680309252,0.0}
Trams185;18;7;4223;17:43;{1782.5218000002205,1208.6106000002474,0.0}
Trams148;14;16;4225;17:44;{5058.904000002891,2546.714799998328,0.0}
Trams184;18;8;4226;17:44;{2110.2352000027895,1344.0613000001758,0.0}
Trams184;18;5;4227;17:44;{2064.0685709043055,1320.5282183098925,0.0}
Trams143;14;20;4228;17:44;{2808.1955000013113,1135.889900000766,0.0}
Trams1410;14;7;4228;17:44;{2808.1955000013113,1135.889900000766,0.0}
Trams143;14;17;4229;17:44;{2774.94460455129,1095.9101807449765,0.0}
Trams148;14;14;4233;17:45;{4672.309900000691,2395.577299999073,0.0}
Trams184;18;2;4234;17:45;{1740.6504000015557,1186.7970000002533,0.0}
Trams148;14;13;4234;17:45;{4624.179771982149,2375.8925514936154,0.0}
Trams143;14;11;4235;17:45;{2569.3393000029027,869.8653000015765,0.0}
Trams144;14;21;4235;17:45;{7477.508000001311,3581.729000000283,0.0}
Trams181;18;2;4236;17:46;{5739.764803540053,2830.2159521656795,0.0}
Trams143;14;8;4236;17:46;{2567.6414284064917,825.1840510346515,0.0}
Trams144;14;23;4236;17:46;{7446.12100000307,3545.9720000009984,0.0}
Trams147;14;16;4240;17:46;{5058.904000002891,2546.714799998328,0.0}
Trams185;18;8;4241;17:46;{2627.1466000005603,1561.507400000468,0.0}
Trams147;14;15;4241;17:46;{5010.473492013262,2527.781076226536,0.0}
Trams144;14;24;4243;17:47;{7172.43200000003,3532.2607999984175,0.0}
Trams142;14;4;4244;17:47;{3035.1652000024915,1729.7097000014037,0.0}
Trams143;14;3;4246;17:47;{2894.896500002593,514.0241999980062,0.0}
Trams1410;14;0;4246;17:47;{2894.896500002593,514.0241999980062,0.0}
Trams148;14;14;4247;17:47;{4031.8555000014603,2128.9623999986798,0.0}
Trams147;14;12;4248;17:48;{4672.309900000691,2395.577299999073,0.0}
Trams149;14;15;4249;17:48;{2992.747200001031,1703.0900999996811,0.0}
Trams185;18;7;4250;17:48;{3035.1652000024915,1729.7097000014037,0.0}
Trams184;18;3;4255;17:49;{845.340600002557,806.1041999999434,0.0}
Trams146;14;12;4255;17:49;{5058.904000002891,2546.714799998328,0.0}
Trams146;14;11;4256;17:49;{5010.473492013262,2527.781076226536,0.0}
Trams183;18;5;4261;17:50;{2589.0274000018835,1538.5219000000507,0.0}
Trams147;14;11;4262;17:50;{4031.8555000014603,2128.9623999986798,0.0}
Trams149;14;13;4262;17:50;{2808.1955000013113,1135.889900000766,0.0}
Trams146;14;12;4263;17:50;{4672.309900000691,2395.577299999073,0.0}
Trams149;14;12;4263;17:50;{2774.94460455129,1095.9101807449765,0.0}
Trams182;18;8;4264;17:50;{5010.473492013262,2527.781076226536,0.0}
Trams149;14;11;4269;17:51;{2569.3393000029027,869.8653000015765,0.0}
Trams149;14;5;4270;17:51;{2567.6414284064917,825.1840510346515,0.0}
Trams183;18;3;4271;17:51;{2110.2352000027895,1344.0613000001758,0.0}
Trams183;18;1;4272;17:52;{2064.0685709043055,1320.5282183098925,0.0}
Trams181;18;24;4277;17:52;{7477.508000001311,3581.729000000283,0.0}
Trams144;14;22;4278;17:53;{5634.466500002891,2784.006800001487,0.0}
Trams145;14;4;4278;17:53;{4672.309900000691,2395.577299999073,0.0}
Trams143;14;4;4279;17:53;{3035.1652000024915,1729.7097000014037,0.0}
Trams149;14;2;4280;17:53;{2894.896500002593,514.0241999980062,0.0}
Trams148;14;13;4282;17:53;{2808.1955000013113,1135.889900000766,0.0}
Trams148;14;12;4283;17:53;{2774.94460455129,1095.9101807449765,0.0}
Trams185;18;6;4285;17:54;{4707.823850244834,2420.7529164061234,0.0}
Trams142;14;3;4288;17:54;{5108.905971347362,2577.745680309252,0.0}
Trams148;14;10;4289;17:54;{2569.3393000029027,869.8653000015765,0.0}
Trams148;14;7;4290;17:55;{2567.6414284064917,825.1840510346515,0.0}
Trams144;14;21;4291;17:55;{5010.473492013262,2527.781076226536,0.0}
Trams147;14;10;4297;17:56;{2808.1955000013113,1135.889900000766,0.0}
Trams144;14;18;4298;17:56;{4672.309900000691,2395.577299999073,0.0}
Trams148;14;8;4299;17:56;{2894.896500002593,514.0241999980062,0.0}
Trams183;18;3;4300;17:56;{845.340600002557,806.1041999999434,0.0}
Trams148;14;4;4300;17:56;{2894.896500002593,514.0241999980062,0.0}
Trams147;14;5;4304;17:57;{2569.3393000029027,869.8653000015765,0.0}
Trams147;14;4;4305;17:57;{2567.6414284064917,825.1840510346515,0.0}
Trams185;18;7;4307;17:57;{5689.812200002372,2815.7713999990374,0.0}
Trams185;18;6;4308;17:58;{5739.764803540053,2830.2159521656795,0.0}
Trams146;14;10;4312;17:58;{2808.1955000013113,1135.889900000766,0.0}
Trams147;14;2;4315;17:59;{2894.896500002593,514.0241999980062,0.0}
Trams182;18;7;4316;17:59;{2589.0274000018835,1538.5219000000507,0.0}
Trams146;14;7;4319;17:59;{2569.3393000029027,869.8653000015765,0.0}
Trams181;18;22;4320;18:0;{5634.466500002891,2784.006800001487,0.0}
Trams146;14;3;4320;18:0;{2567.6414284064917,825.1840510346515,0.0}
Trams183;18;4;4322;18:0;{1782.5218000002205,1208.6106000002474,0.0}
Trams141;14;24;4325;18:0;{7477.508000001311,3581.729000000283,0.0}
Trams184;18;4;4326;18:1;{4084.1569000035524,2161.088000001386,0.0}
Trams182;18;5;4327;18:1;{2064.0685709043055,1320.5282183098925,0.0}
Trams146;14;0;4330;18:1;{2894.896500002593,514.0241999980062,0.0}
Trams181;18;19;4333;18:2;{5010.473492013262,2527.781076226536,0.0}
Trams145;14;3;4335;18:2;{2567.6414284064917,825.1840510346515,0.0}
Trams184;18;3;4339;18:3;{4707.823850244834,2420.7529164061234,0.0}
Trams181;18;12;4340;18:3;{4672.309900000691,2395.577299999073,0.0}
Trams183;18;5;4340;18:3;{2627.1466000005603,1561.507400000468,0.0}
Trams142;14;24;4343;18:3;{7477.508000001311,3581.729000000283,0.0}
Trams1411;14;19;4343;18:3;{7477.508000001311,3581.729000000283,0.0}
Trams1411;14;21;4344;18:4;{7446.12100000307,3545.9720000009984,0.0}
Trams145;14;1;4345;18:4;{2894.896500002593,514.0241999980062,0.0}
Trams143;14;3;4347;18:4;{6221.943900000304,2968.579499999061,0.0}
Trams144;14;14;4347;18:4;{2808.1955000013113,1135.889900000766,0.0}
Trams144;14;13;4348;18:4;{2774.94460455129,1095.9101807449765,0.0}
Trams185;18;17;4349;18:4;{7477.508000001311,3581.729000000283,0.0}
Trams185;18;18;4350;18:5;{7446.12100000307,3545.9720000009984,0.0}
Trams181;18;11;4354;18:5;{4031.8555000014603,2128.9623999986798,0.0}
Trams182;18;4;4355;18:5;{845.340600002557,806.1041999999434,0.0}
Trams144;14;8;4355;18:5;{2567.6414284064917,825.1840510346515,0.0}
Trams1411;14;23;4359;18:6;{6831.853600002825,3315.144899999723,0.0}
Trams184;18;2;4361;18:6;{5689.812200002372,2815.7713999990374,0.0}
Trams144;14;3;4365;18:7;{2894.896500002593,514.0241999980062,0.0}
Trams1411;14;24;4366;18:7;{6563.806600000709,3123.2601999994367,0.0}
Trams141;14;21;4367;18:7;{5641.738919684285,2786.998382666919,0.0}
Trams141;14;19;4368;18:8;{5634.466500002891,2784.006800001487,0.0}
Trams143;14;8;4378;18:9;{7477.508000001311,3581.729000000283,0.0}
Trams185;18;19;4380;18:10;{6188.119100000709,2954.7112999986857,0.0}
Trams141;14;21;4380;18:10;{5058.904000002891,2546.714799998328,0.0}
Trams181;18;8;4385;18:10;{2589.0274000018835,1538.5219000000507,0.0}
Trams182;18;5;4385;18:10;{2149.2538000009954,1363.784799998626,0.0}
Trams183;18;4;4385;18:10;{4722.0763000026345,2426.624300001189,0.0}
Trams1411;14;22;4385;18:10;{5641.738919684285,2786.998382666919,0.0}
Trams141;14;22;4388;18:11;{4672.309900000691,2395.577299999073,0.0}
Trams141;14;21;4389;18:11;{4624.179771982149,2375.8925514936154,0.0}
Trams185;18;20;4392;18:12;{5634.466500002891,2784.006800001487,0.0}
Trams183;18;3;4394;18:12;{5123.508700001985,2583.745899999514,0.0}
Trams143;14;9;4394;18:12;{6831.853600002825,3315.144899999723,0.0}
Trams181;18;6;4395;18:12;{2110.2352000027895,1344.0613000001758,0.0}
Trams181;18;4;4396;18:12;{2064.0685709043055,1320.5282183098925,0.0}
Trams182;18;4;4396;18:12;{2675.4015184145933,1580.8842637522473,0.0}
Trams142;14;23;4398;18:13;{5058.904000002891,2546.714799998328,0.0}
Trams1411;14;15;4399;18:13;{5010.473492013262,2527.781076226536,0.0}
Trams141;14;23;4402;18:13;{4031.8555000014603,2128.9623999986798,0.0}
Trams181;18;3;4403;18:13;{1740.6504000015557,1186.7970000002533,0.0}
Trams184;18;9;4403;18:13;{7477.508000001311,3581.729000000283,0.0}
Trams1411;14;12;4406;18:14;{4672.309900000691,2395.577299999073,0.0}
Trams183;18;1;4407;18:14;{5739.764803540053,2830.2159521656795,0.0}
Trams142;14;22;4407;18:14;{4624.179771982149,2375.8925514936154,0.0}
Trams143;14;10;4409;18:14;{6188.119100000709,2954.7112999986857,0.0}
Trams185;18;19;4412;18:15;{4672.309900000691,2395.577299999073,0.0}
Trams149;14;13;4412;18:15;{7477.508000001311,3581.729000000283,0.0}
Trams184;18;10;4419;18:16;{6831.853600002825,3315.144899999723,0.0}
Trams149;14;15;4420;18:16;{7172.43200000003,3532.2607999984175,0.0}
Trams143;14;11;4421;18:16;{5634.466500002891,2784.006800001487,0.0}
Trams181;18;6;4424;18:17;{845.340600002557,806.1041999999434,0.0}
Trams141;14;24;4424;18:17;{2992.747200001031,1703.0900999996811,0.0}
Trams185;18;20;4426;18:17;{4031.8555000014603,2128.9623999986798,0.0}
Trams149;14;16;4428;18:18;{6831.853600002825,3315.144899999723,0.0}
Trams148;14;6;4432;18:18;{7477.508000001311,3581.729000000283,0.0}
Trams143;14;10;4433;18:18;{5058.904000002891,2546.714799998328,0.0}
Trams143;14;9;4434;18:19;{5010.473492013262,2527.781076226536,0.0}
Trams149;14;17;4435;18:19;{6563.806600000709,3123.2601999994367,0.0}
Trams141;14;17;4437;18:19;{2808.1955000013113,1135.889900000766,0.0}
Trams141;14;14;4438;18:19;{2774.94460455129,1095.9101807449765,0.0}
Trams143;14;8;4442;18:20;{4624.179771982149,2375.8925514936154,0.0}
Trams141;14;13;4444;18:20;{2569.3393000029027,869.8653000015765,0.0}
Trams141;14;7;4445;18:20;{2567.6414284064917,825.1840510346515,0.0}
Trams184;18;11;4446;18:21;{5634.466500002891,2784.006800001487,0.0}
Trams147;14;13;4447;18:21;{7477.508000001311,3581.729000000283,0.0}
Trams182;18;3;4448;18:21;{5108.905971347362,2577.745680309252,0.0}
Trams183;18;2;4448;18:21;{7477.508000001311,3581.729000000283,0.0}
Trams141;14;9;4454;18:22;{2894.896500002593,514.0241999980062,0.0}
Trams141;14;7;4455;18:22;{2894.896500002593,514.0241999980062,0.0}
Trams142;14;21;4455;18:22;{2808.1955000013113,1135.889900000766,0.0}
Trams142;14;18;4456;18:22;{2774.94460455129,1095.9101807449765,0.0}
Trams185;18;14;4457;18:22;{2589.0274000018835,1538.5219000000507,0.0}
Trams184;18;10;4458;18:23;{5058.904000002891,2546.714799998328,0.0}
Trams184;18;9;4459;18:23;{5010.473492013262,2527.781076226536,0.0}
Trams142;14;14;4462;18:23;{2569.3393000029027,869.8653000015765,0.0}
Trams146;14;2;4462;18:23;{7477.508000001311,3581.729000000283,0.0}
Trams142;14;8;4463;18:23;{2567.6414284064917,825.1840510346515,0.0}
Trams1411;14;11;4463;18:23;{2567.6414284064917,825.1840510346515,0.0}
Trams183;18;3;4464;18:24;{6831.853600002825,3315.144899999723,0.0}
Trams181;18;5;4465;18:24;{2675.4015184145933,1580.8842637522473,0.0}
Trams149;14;18;4467;18:24;{5058.904000002891,2546.714799998328,0.0}
Trams185;18;10;4468;18:24;{2064.0685709043055,1320.5282183098925,0.0}
Trams149;14;16;4468;18:24;{5010.473492013262,2527.781076226536,0.0}
Trams183;18;4;4471;18:25;{6563.806600000709,3123.2601999994367,0.0}
Trams181;18;7;4473;18:25;{3035.1652000024915,1729.7097000014037,0.0}
Trams142;14;3;4473;18:25;{2894.896500002593,514.0241999980062,0.0}
Trams1411;14;0;4473;18:25;{2894.896500002593,514.0241999980062,0.0}
Trams185;18;6;4475;18:25;{1740.6504000015557,1186.7970000002533,0.0}
Trams141;14;9;4475;18:25;{2839.1857000030577,1180.8036000002176,0.0}
Trams149;14;15;4476;18:26;{4624.179771982149,2375.8925514936154,0.0}
Trams145;14;7;4477;18:26;{7477.508000001311,3581.729000000283,0.0}
Trams146;14;3;4478;18:26;{6831.853600002825,3315.144899999723,0.0}
Trams183;18;5;4479;18:26;{6188.119100000709,2954.7112999986857,0.0}
Trams184;18;7;4480;18:26;{4031.8555000014603,2128.9623999986798,0.0}
Trams147;14;11;4489;18:28;{5641.738919684285,2786.998382666919,0.0}
Trams147;14;10;4490;18:28;{5634.466500002891,2784.006800001487,0.0}
Trams143;14;7;4491;18:28;{2774.94460455129,1095.9101807449765,0.0}
Trams181;18;8;4495;18:29;{4084.1569000035524,2161.088000001386,0.0}
Trams185;18;8;4496;18:29;{845.340600002557,806.1041999999434,0.0}
Trams143;14;6;4497;18:29;{2569.3393000029027,869.8653000015765,0.0}
Trams144;14;10;4497;18:29;{7477.508000001311,3581.729000000283,0.0}
Trams143;14;5;4498;18:29;{2567.6414284064917,825.1840510346515,0.0}
Trams182;18;8;4503;18:30;{7477.508000001311,3581.729000000283,0.0}
Trams147;14;8;4503;18:30;{5010.473492013262,2527.781076226536,0.0}
Trams143;14;3;4508;18:31;{2894.896500002593,514.0241999980062,0.0}
Trams147;14;7;4510;18:31;{4672.309900000691,2395.577299999073,0.0}
Trams184;18;4;4511;18:31;{2589.0274000018835,1538.5219000000507,0.0}
Trams181;18;4;4517;18:32;{5108.905971347362,2577.745680309252,0.0}
Trams143;14;4;4520;18:33;{2597.49450000003,904.9190000016242,0.0}
Trams184;18;3;4522;18:33;{2064.0685709043055,1320.5282183098925,0.0}
Trams147;14;5;4524;18:34;{4031.8555000014603,2128.9623999986798,0.0}
Trams149;14;11;4524;18:34;{2808.1955000013113,1135.889900000766,0.0}
Trams146;14;2;4525;18:34;{4672.309900000691,2395.577299999073,0.0}
Trams149;14;9;4525;18:34;{2774.94460455129,1095.9101807449765,0.0}
Trams185;18;10;4526;18:34;{2149.2538000009954,1363.784799998626,0.0}
Trams142;14;4;4528;18:34;{4084.1569000035524,2161.088000001386,0.0}
Trams144;14;11;4528;18:34;{6188.119100000709,2954.7112999986857,0.0}
Trams141;14;8;4532;18:35;{5108.905971347362,2577.745680309252,0.0}
Trams149;14;7;4532;18:35;{2567.6414284064917,825.1840510346515,0.0}
Trams145;14;4;4540;18:36;{4672.309900000691,2395.577299999073,0.0}
Trams181;18;3;4541;18:36;{6221.943900000304,2968.579499999061,0.0}
Trams143;14;5;4541;18:36;{3035.1652000024915,1729.7097000014037,0.0}
Trams149;14;3;4542;18:37;{2894.896500002593,514.0241999980062,0.0}
Trams182;18;9;4546;18:37;{5634.466500002891,2784.006800001487,0.0}
Trams141;14;7;4546;18:37;{5739.764803540053,2830.2159521656795,0.0}
Trams184;18;4;4550;18:38;{845.340600002557,806.1041999999434,0.0}
Trams144;14;10;4552;18:38;{5058.904000002891,2546.714799998328,0.0}
Trams144;14;9;4553;18:38;{5010.473492013262,2527.781076226536,0.0}
Trams183;18;2;4556;18:39;{2589.0274000018835,1538.5219000000507,0.0}
Trams147;14;4;4560;18:40;{2774.94460455129,1095.9101807449765,0.0}
Trams144;14;8;4561;18:40;{4624.179771982149,2375.8925514936154,0.0}
Trams148;14;4;4562;18:40;{2894.896500002593,514.0241999980062,0.0}
Trams182;18;8;4566;18:41;{4672.309900000691,2395.577299999073,0.0}
Trams183;18;1;4566;18:41;{2110.2352000027895,1344.0613000001758,0.0}
Trams147;14;3;4567;18:41;{2567.6414284064917,825.1840510346515,0.0}
Trams181;18;21;4572;18:42;{7477.508000001311,3581.729000000283,0.0}
Trams142;14;3;4574;18:42;{6221.943900000304,2968.579499999061,0.0}
Trams146;14;1;4574;18:42;{2808.1955000013113,1135.889900000766,0.0}
Trams149;14;4;4575;18:42;{3035.1652000024915,1729.7097000014037,0.0}
Trams181;18;22;4580;18:43;{7172.43200000003,3532.2607999984175,0.0}
Trams185;18;9;4581;18:43;{4722.0763000026345,2426.624300001189,0.0}
Trams146;14;0;4581;18:43;{2569.3393000029027,869.8653000015765,0.0}
Trams141;14;22;4587;18:44;{7477.508000001311,3581.729000000283,0.0}
Trams181;18;23;4588;18:44;{6831.853600002825,3315.144899999723,0.0}
Trams145;14;3;4589;18:44;{2808.1955000013113,1135.889900000766,0.0}
Trams145;14;2;4590;18:45;{2774.94460455129,1095.9101807449765,0.0}
Trams184;18;3;4591;18:45;{2675.4015184145933,1580.8842637522473,0.0}
Trams183;18;3;4595;18:45;{845.340600002557,806.1041999999434,0.0}
Trams183;18;4;4597;18:46;{902.5305000022054,834.7037000004202,0.0}
Trams143;14;4;4598;18:46;{5689.812200002372,2815.7713999990374,0.0}
Trams143;14;3;4599;18:46;{5739.764803540053,2830.2159521656795,0.0}
Trams182;18;9;4602;18:47;{2992.747200001031,1703.0900999996811,0.0}
Trams185;18;8;4602;18:47;{5689.812200002372,2815.7713999990374,0.0}
Trams141;14;23;4603;18:47;{6831.853600002825,3315.144899999723,0.0}
Trams181;18;22;4604;18:47;{6138.21238208538,2940.1058384544613,0.0}
Trams142;14;14;4605;18:47;{7477.508000001311,3581.729000000283,0.0}
Trams145;14;1;4607;18:47;{2894.896500002593,514.0241999980062,0.0}
Trams182;18;8;4611;18:48;{2589.0274000018835,1538.5219000000507,0.0}
Trams149;14;3;4611;18:48;{4722.0763000026345,2426.624300001189,0.0}
Trams185;18;6;4613;18:48;{6221.943900000304,2968.579499999061,0.0}
Trams181;18;20;4614;18:49;{5641.738919684285,2786.998382666919,0.0}
Trams181;18;21;4615;18:49;{5634.466500002891,2784.006800001487,0.0}
Trams144;14;7;4616;18:49;{2569.3393000029027,869.8653000015765,0.0}
Trams144;14;5;4617;18:49;{2567.6414284064917,825.1840510346515,0.0}
Trams141;14;24;4618;18:49;{6188.119100000709,2954.7112999986857,0.0}
Trams182;18;5;4621;18:50;{2110.2352000027895,1344.0613000001758,0.0}
Trams182;18;3;4622;18:50;{2064.0685709043055,1320.5282183098925,0.0}
Trams146;14;1;4625;18:50;{3035.1652000024915,1729.7097000014037,0.0}
Trams144;14;6;4626;18:51;{2894.896500002593,514.0241999980062,0.0}
Trams181;18;18;4627;18:51;{5058.904000002891,2546.714799998328,0.0}
Trams144;14;5;4627;18:51;{2894.896500002593,514.0241999980062,0.0}
Trams181;18;14;4628;18:51;{5010.473492013262,2527.781076226536,0.0}
Trams181;18;13;4636;18:52;{4624.179771982149,2375.8925514936154,0.0}
Trams183;18;3;4636;18:52;{2675.4015184145933,1580.8842637522473,0.0}
Trams143;14;24;4640;18:53;{7477.508000001311,3581.729000000283,0.0}
Trams145;14;2;4640;18:53;{3035.1652000024915,1729.7097000014037,0.0}
Trams1410;14;1;4640;18:53;{7477.508000001311,3581.729000000283,0.0}
Trams141;14;23;4642;18:53;{5058.904000002891,2546.714799998328,0.0}
Trams141;14;22;4643;18:53;{5010.473492013262,2527.781076226536,0.0}
Trams185;18;13;4644;18:54;{7477.508000001311,3581.729000000283,0.0}
Trams182;18;5;4650;18:55;{845.340600002557,806.1041999999434,0.0}
Trams141;14;21;4650;18:55;{4672.309900000691,2395.577299999073,0.0}
Trams142;14;13;4660;18:56;{5058.904000002891,2546.714799998328,0.0}
Trams144;14;6;4660;18:56;{3035.1652000024915,1729.7097000014037,0.0}
Trams146;14;0;4661;18:56;{4722.0763000026345,2426.624300001189,0.0}
Trams145;14;3;4662;18:57;{4084.1569000035524,2161.088000001386,0.0}
Trams185;18;14;4667;18:57;{6563.806600000709,3123.2601999994367,0.0}
Trams1410;14;2;4671;18:58;{6188.119100000709,2954.7112999986857,0.0}
Trams182;18;7;4672;18:58;{1782.5218000002205,1208.6106000002474,0.0}
Trams143;14;22;4672;18:58;{6138.21238208538,2940.1058384544613,0.0}
Trams149;14;8;4674;18:59;{7477.508000001311,3581.729000000283,0.0}
Trams185;18;13;4676;18:59;{6138.21238208538,2940.1058384544613,0.0}
Trams181;18;11;4680;19:0;{2589.0274000018835,1538.5219000000507,0.0}
Trams183;18;1;4680;19:0;{4722.0763000026345,2426.624300001189,0.0}
Trams143;14;20;4682;19:0;{5641.738919684285,2786.998382666919,0.0}
Trams149;14;9;4682;19:0;{7172.43200000003,3532.2607999984175,0.0}
Trams143;14;19;4683;19:0;{5634.466500002891,2784.006800001487,0.0}
Trams145;14;2;4684;19:0;{5108.905971347362,2577.745680309252,0.0}
Trams141;14;23;4686;19:1;{2992.747200001031,1703.0900999996811,0.0}
Trams183;18;0;4688;19:1;{5108.905971347362,2577.745680309252,0.0}
Trams181;18;8;4690;19:1;{2110.2352000027895,1344.0613000001758,0.0}
Trams182;18;6;4690;19:1;{2627.1466000005603,1561.507400000468,0.0}
Trams181;18;5;4691;19:1;{2064.0685709043055,1320.5282183098925,0.0}
Trams143;14;18;4695;19:2;{5058.904000002891,2546.714799998328,0.0}
Trams143;14;17;4696;19:2;{5010.473492013262,2527.781076226536,0.0}
Trams145;14;1;4697;19:2;{5689.812200002372,2815.7713999990374,0.0}
Trams181;18;4;4698;19:3;{1740.6504000015557,1186.7970000002533,0.0}
Trams184;18;4;4698;19:3;{7477.508000001311,3581.729000000283,0.0}
Trams182;18;7;4699;19:3;{3035.1652000024915,1729.7097000014037,0.0}
Trams141;14;20;4699;19:3;{2808.1955000013113,1135.889900000766,0.0}
Trams143;14;15;4703;19:3;{4672.309900000691,2395.577299999073,0.0}
Trams144;14;4;4704;19:4;{5108.905971347362,2577.745680309252,0.0}
Trams141;14;15;4706;19:4;{2569.3393000029027,869.8653000015765,0.0}
Trams185;18;12;4707;19:4;{4672.309900000691,2395.577299999073,0.0}
Trams141;14;11;4707;19:4;{2567.6414284064917,825.1840510346515,0.0}
Trams141;14;7;4717;19:6;{2894.896500002593,514.0241999980062,0.0}
Trams142;14;12;4717;19:6;{2808.1955000013113,1135.889900000766,0.0}
Trams143;14;14;4717;19:6;{4031.8555000014603,2128.9623999986798,0.0}
Trams149;14;8;4717;19:6;{5634.466500002891,2784.006800001487,0.0}
Trams142;14;10;4718;19:6;{2774.94460455129,1095.9101807449765,0.0}
Trams142;14;7;4724;19:7;{2569.3393000029027,869.8653000015765,0.0}
Trams142;14;6;4725;19:7;{2567.6414284064917,825.1840510346515,0.0}
Trams149;14;7;4729;19:8;{5058.904000002891,2546.714799998328,0.0}
Trams142;14;8;4734;19:9;{2894.896500002593,514.0241999980062,0.0}
Trams142;14;5;4735;19:9;{2894.896500002593,514.0241999980062,0.0}
Trams149;14;6;4737;19:9;{4672.309900000691,2395.577299999073,0.0}
Trams182;18;6;4743;19:10;{5108.905971347362,2577.745680309252,0.0}
Trams149;14;5;4751;19:11;{4031.8555000014603,2128.9623999986798,0.0}
Trams185;18;11;4752;19:12;{2589.0274000018835,1538.5219000000507,0.0}
Trams143;14;13;4752;19:12;{2808.1955000013113,1135.889900000766,0.0}
Trams143;14;11;4753;19:12;{2774.94460455129,1095.9101807449765,0.0}
Trams182;18;5;4757;19:12;{5739.764803540053,2830.2159521656795,0.0}
Trams143;14;7;4759;19:13;{2569.3393000029027,869.8653000015765,0.0}
Trams1410;14;1;4760;19:13;{2567.6414284064917,825.1840510346515,0.0}
Trams185;18;9;4762;19:13;{2110.2352000027895,1344.0613000001758,0.0}
Trams185;18;7;4763;19:13;{2064.0685709043055,1320.5282183098925,0.0}
Trams182;18;3;4767;19:14;{6221.943900000304,2968.579499999061,0.0}
Trams185;18;6;4770;19:15;{1740.6504000015557,1186.7970000002533,0.0}
Trams143;14;4;4770;19:15;{2894.896500002593,514.0241999980062,0.0}
Trams1410;14;0;4770;19:15;{2894.896500002593,514.0241999980062,0.0}
Trams149;14;3;4787;19:17;{2774.94460455129,1095.9101807449765,0.0}
Trams184;18;3;4806;19:21;{2589.0274000018835,1538.5219000000507,0.0}
Trams148;14;5;4806;19:21;{2808.1955000013113,1135.889900000766,0.0}
Trams184;18;5;4816;19:22;{2110.2352000027895,1344.0613000001758,0.0}
Trams184;18;4;4845;19:27;{845.340600002557,806.1041999999434,0.0}
