tramName;tramLine;nPassengers;cycleNo;time;location
Trams143;14;5;6537;6:3;{4672.309900000691,2395.577299999073,0.0}
Trams144;14;5;6539;6:3;{5123.508700001985,2583.745899999514,0.0}
Trams141;14;9;6551;6:5;{2894.896500002593,514.0241999980062,0.0}
Trams144;14;6;6551;6:5;{5689.812200002372,2815.7713999990374,0.0}
Trams181;18;5;6560;6:6;{4084.1569000035524,2161.088000001386,0.0}
Trams144;14;8;6562;6:7;{6221.943900000304,2968.579499999061,0.0}
Trams141;14;14;6563;6:7;{2597.49450000003,904.9190000016242,0.0}
Trams183;18;1;6568;6:8;{5058.904000002891,2546.714799998328,0.0}
Trams141;14;18;6571;6:8;{2839.1857000030577,1180.8036000002176,0.0}
Trams149;14;4;6571;6:8;{4672.309900000691,2395.577299999073,0.0}
Trams181;18;8;6574;6:9;{4722.0763000026345,2426.624300001189,0.0}
Trams184;18;5;6576;6:9;{2589.0274000018835,1538.5219000000507,0.0}
Trams142;14;6;6581;6:10;{2597.49450000003,904.9190000016242,0.0}
Trams181;18;10;6583;6:10;{5123.508700001985,2583.745899999514,0.0}
Trams185;18;8;6583;6:10;{1782.5218000002205,1208.6106000002474,0.0}
Trams148;14;6;6583;6:10;{5058.904000002891,2546.714799998328,0.0}
Trams144;14;7;6586;6:11;{7223.311400000006,3570.043500000611,0.0}
Trams185;18;10;6591;6:12;{2149.2538000009954,1363.784799998626,0.0}
Trams144;14;4;6592;6:12;{7477.508000001311,3581.729000000283,0.0}
Trams182;18;4;6599;6:13;{6188.119100000709,2954.7112999986857,0.0}
Trams143;14;4;6604;6:14;{2894.896500002593,514.0241999980062,0.0}
Trams181;18;12;6606;6:14;{6221.943900000304,2968.579499999061,0.0}
Trams149;14;3;6608;6:14;{2952.0448504139104,1673.1693294131398,0.0}
Trams185;18;9;6610;6:15;{3035.1652000024915,1729.7097000014037,0.0}
Trams182;18;5;6611;6:15;{5634.466500002891,2784.006800001487,0.0}
Trams184;18;4;6615;6:16;{845.340600002557,806.1041999999434,0.0}
Trams143;14;7;6616;6:16;{2597.49450000003,904.9190000016242,0.0}
Trams141;14;22;6620;6:16;{4722.0763000026345,2426.624300001189,0.0}
Trams181;18;11;6622;6:17;{6883.719200000167,3354.242599999532,0.0}
Trams142;14;7;6624;6:17;{4084.1569000035524,2161.088000001386,0.0}
Trams143;14;9;6624;6:17;{2839.1857000030577,1180.8036000002176,0.0}
Trams148;14;5;6628;6:18;{2952.0448504139104,1673.1693294131398,0.0}
Trams141;14;24;6629;6:18;{5123.508700001985,2583.745899999514,0.0}
Trams182;18;6;6631;6:18;{4672.309900000691,2395.577299999073,0.0}
Trams185;18;10;6632;6:18;{4084.1569000035524,2161.088000001386,0.0}
Trams181;18;3;6636;6:19;{7477.508000001311,3581.729000000283,0.0}
Trams184;18;5;6637;6:19;{1782.5218000002205,1208.6106000002474,0.0}
Trams142;14;8;6638;6:19;{4722.0763000026345,2426.624300001189,0.0}
Trams184;18;9;6645;6:21;{2149.2538000009954,1363.784799998626,0.0}
Trams142;14;10;6647;6:21;{5123.508700001985,2583.745899999514,0.0}
Trams149;14;5;6650;6:21;{2597.49450000003,904.9190000016242,0.0}
Trams141;14;23;6653;6:22;{6271.932036142039,2982.903802087056,0.0}
Trams184;18;11;6655;6:22;{2627.1466000005603,1561.507400000468,0.0}
Trams149;14;6;6658;6:23;{2839.1857000030577,1180.8036000002176,0.0}
Trams142;14;12;6659;6:23;{5689.812200002372,2815.7713999990374,0.0}
Trams143;14;8;6659;6:23;{4084.1569000035524,2161.088000001386,0.0}
Trams183;18;0;6660;6:23;{845.340600002557,806.1041999999434,0.0}
Trams185;18;12;6667;6:24;{5689.812200002372,2815.7713999990374,0.0}
Trams141;14;22;6667;6:24;{6864.837443928478,3341.6995773341046,0.0}
Trams142;14;13;6670;6:25;{6221.943900000304,2968.579499999061,0.0}
Trams148;14;6;6670;6:25;{2597.49450000003,904.9190000016242,0.0}
Trams143;14;12;6673;6:25;{4722.0763000026345,2426.624300001189,0.0}
Trams148;14;10;6678;6:26;{2839.1857000030577,1180.8036000002176,0.0}
Trams142;14;12;6679;6:26;{6609.992500003427,3161.7836000006646,0.0}
Trams141;14;5;6682;6:27;{7477.508000001311,3581.729000000283,0.0}
Trams143;14;15;6682;6:27;{5123.508700001985,2583.745899999514,0.0}
Trams146;14;1;6688;6:28;{2894.896500002593,514.0241999980062,0.0}
Trams183;18;2;6690;6:28;{2149.2538000009954,1363.784799998626,0.0}
Trams143;14;17;6694;6:29;{5689.812200002372,2815.7713999990374,0.0}
Trams183;18;4;6700;6:30;{2627.1466000005603,1561.507400000468,0.0}
Trams184;18;12;6700;6:30;{4722.0763000026345,2426.624300001189,0.0}
Trams142;14;5;6700;6:30;{7477.508000001311,3581.729000000283,0.0}
Trams146;14;3;6700;6:30;{2597.49450000003,904.9190000016242,0.0}
Trams143;14;18;6705;6:31;{6221.943900000304,2968.579499999061,0.0}
Trams185;18;7;6708;6:31;{7477.508000001311,3581.729000000283,0.0}
Trams146;14;4;6708;6:31;{2839.1857000030577,1180.8036000002176,0.0}
Trams184;18;14;6709;6:31;{5123.508700001985,2583.745899999514,0.0}
Trams185;18;6;6709;6:31;{7477.508000001311,3581.729000000283,0.0}
Trams182;18;3;6715;6:32;{845.340600002557,806.1041999999434,0.0}
Trams149;14;5;6716;6:32;{5123.508700001985,2583.745899999514,0.0}
Trams143;14;17;6720;6:33;{6864.837443928478,3341.6995773341046,0.0}
Trams143;14;16;6721;6:33;{6883.719200000167,3354.242599999532,0.0}
Trams145;14;3;6723;6:34;{2839.1857000030577,1180.8036000002176,0.0}
Trams148;14;12;6727;6:34;{4722.0763000026345,2426.624300001189,0.0}
Trams147;14;2;6728;6:34;{4084.1569000035524,2161.088000001386,0.0}
Trams143;14;15;6730;6:35;{7267.007879060962,3598.2324644667874,0.0}
Trams184;18;15;6732;6:35;{6221.943900000304,2968.579499999061,0.0}
Trams143;14;6;6735;6:36;{7477.508000001311,3581.729000000283,0.0}
Trams144;14;6;6735;6:36;{2597.49450000003,904.9190000016242,0.0}
Trams181;18;4;6736;6:36;{2992.747200001031,1703.0900999996811,0.0}
Trams143;14;4;6736;6:36;{7477.508000001311,3581.729000000283,0.0}
Trams182;18;4;6737;6:36;{1782.5218000002205,1208.6106000002474,0.0}
Trams141;14;6;6738;6:36;{5058.904000002891,2546.714799998328,0.0}
Trams181;18;7;6745;6:37;{2589.0274000018835,1538.5219000000507,0.0}
Trams182;18;6;6745;6:37;{2149.2538000009954,1363.784799998626,0.0}
Trams141;14;8;6746;6:37;{4672.309900000691,2395.577299999073,0.0}
Trams148;14;13;6748;6:38;{5689.812200002372,2815.7713999990374,0.0}
Trams147;14;3;6751;6:38;{5123.508700001985,2583.745899999514,0.0}
Trams182;18;7;6755;6:39;{2627.1466000005603,1561.507400000468,0.0}
Trams184;18;16;6756;6:39;{7223.311400000006,3570.043500000611,0.0}
Trams148;14;15;6759;6:40;{6221.943900000304,2968.579499999061,0.0}
Trams184;18;7;6762;6:40;{7477.508000001311,3581.729000000283,0.0}
Trams184;18;5;6763;6:40;{7477.508000001311,3581.729000000283,0.0}
Trams147;14;4;6763;6:40;{5689.812200002372,2815.7713999990374,0.0}
Trams185;18;7;6764;6:40;{5058.904000002891,2546.714799998328,0.0}
Trams183;18;2;6767;6:41;{5739.764803540053,2830.2159521656795,0.0}
Trams149;14;2;6769;6:41;{7477.508000001311,3581.729000000283,0.0}
Trams148;14;14;6774;6:42;{6864.837443928478,3341.6995773341046,0.0}
Trams181;18;6;6775;6:42;{1208.916700001806,962.1525999996811,0.0}
Trams142;14;4;6778;6:43;{4031.8555000014603,2128.9623999986798,0.0}
Trams146;14;6;6778;6:43;{5689.812200002372,2815.7713999990374,0.0}
Trams143;14;5;6779;6:43;{5634.466500002891,2784.006800001487,0.0}
Trams145;14;4;6781;6:43;{5123.508700001985,2583.745899999514,0.0}
Trams181;18;3;6784;6:44;{845.340600002557,806.1041999999434,0.0}
Trams148;14;4;6789;6:45;{7477.508000001311,3581.729000000283,0.0}
Trams143;14;6;6791;6:45;{5058.904000002891,2546.714799998328,0.0}
Trams145;14;5;6793;6:45;{5689.812200002372,2815.7713999990374,0.0}
Trams141;14;7;6796;6:46;{2774.94460455129,1095.9101807449765,0.0}
Trams144;14;7;6801;6:47;{5123.508700001985,2583.745899999514,0.0}
Trams141;14;5;6803;6:47;{2567.6414284064917,825.1840510346515,0.0}
Trams145;14;4;6804;6:47;{6221.943900000304,2968.579499999061,0.0}
Trams147;14;2;6804;6:47;{7477.508000001311,3581.729000000283,0.0}
Trams181;18;5;6806;6:47;{1782.5218000002205,1208.6106000002474,0.0}
Trams183;18;0;6807;6:48;{7477.508000001311,3581.729000000283,0.0}
Trams182;18;8;6809;6:48;{5123.508700001985,2583.745899999514,0.0}
Trams143;14;5;6812;6:48;{4048.297289360261,2135.7927898531034,0.0}
Trams141;14;7;6813;6:49;{2894.896500002593,514.0241999980062,0.0}
Trams142;14;5;6813;6:49;{2808.1955000013113,1135.889900000766,0.0}
Trams144;14;9;6813;6:49;{5689.812200002372,2815.7713999990374,0.0}
Trams181;18;7;6814;6:49;{2149.2538000009954,1363.784799998626,0.0}
Trams144;14;8;6814;6:49;{5739.764803540053,2830.2159521656795,0.0}
Trams146;14;2;6819;6:50;{7477.508000001311,3581.729000000283,0.0}
Trams146;14;0;6820;6:50;{7477.508000001311,3581.729000000283,0.0}
Trams182;18;9;6821;6:50;{5689.812200002372,2815.7713999990374,0.0}
Trams141;14;18;6825;6:51;{2597.49450000003,904.9190000016242,0.0}
Trams181;18;8;6833;6:52;{3035.1652000024915,1729.7097000014037,0.0}
Trams141;14;24;6833;6:52;{2839.1857000030577,1180.8036000002176,0.0}
Trams145;14;0;6834;6:52;{7477.508000001311,3581.729000000283,0.0}
Trams184;18;6;6840;6:53;{4031.8555000014603,2128.9623999986798,0.0}
Trams141;14;23;6847;6:54;{3084.0353342962862,1747.4296273253601,0.0}
Trams182;18;8;6848;6:54;{6883.719200000167,3354.242599999532,0.0}
Trams142;14;7;6851;6:55;{2839.1857000030577,1180.8036000002176,0.0}
Trams144;14;3;6854;6:55;{7477.508000001311,3581.729000000283,0.0}
Trams185;18;6;6856;6:56;{845.340600002557,806.1041999999434,0.0}
Trams182;18;3;6862;6:57;{7477.508000001311,3581.729000000283,0.0}
Trams183;18;1;6863;6:57;{5058.904000002891,2546.714799998328,0.0}
Trams142;14;6;6865;6:57;{3084.0353342962862,1747.4296273253601,0.0}
Trams143;14;4;6866;6:57;{2894.896500002593,514.0241999980062,0.0}
Trams181;18;7;6868;6:58;{4707.823850244834,2420.7529164061234,0.0}
Trams141;14;24;6868;6:58;{4084.1569000035524,2161.088000001386,0.0}
Trams181;18;13;6869;6:58;{4722.0763000026345,2426.624300001189,0.0}
Trams183;18;2;6871;6:58;{4672.309900000691,2395.577299999073,0.0}
Trams181;18;12;6877;6:59;{5108.905971347362,2577.745680309252,0.0}
Trams181;18;14;6878;6:59;{5123.508700001985,2583.745899999514,0.0}
Trams185;18;9;6886;7:1;{2149.2538000009954,1363.784799998626,0.0}
Trams143;14;6;6886;7:1;{2839.1857000030577,1180.8036000002176,0.0}
Trams144;14;4;6886;7:1;{6188.119100000709,2954.7112999986857,0.0}
Trams181;18;18;6890;7:1;{5689.812200002372,2815.7713999990374,0.0}
Trams182;18;2;6895;7:2;{6138.21238208538,2940.1058384544613,0.0}
Trams185;18;10;6896;7:2;{2627.1466000005603,1561.507400000468,0.0}
Trams146;14;1;6897;7:3;{4031.8555000014603,2128.9623999986798,0.0}
Trams145;14;1;6898;7:3;{4672.309900000691,2395.577299999073,0.0}
Trams142;14;9;6900;7:3;{4722.0763000026345,2426.624300001189,0.0}
Trams149;14;5;6900;7:3;{2894.896500002593,514.0241999980062,0.0}
Trams181;18;19;6901;7:3;{6221.943900000304,2968.579499999061,0.0}
Trams141;14;23;6904;7:4;{5739.764803540053,2830.2159521656795,0.0}
Trams142;14;15;6909;7:5;{5123.508700001985,2583.745899999514,0.0}
Trams184;18;5;6910;7:5;{845.340600002557,806.1041999999434,0.0}
Trams145;14;0;6912;7:5;{4031.8555000014603,2128.9623999986798,0.0}
Trams149;14;12;6912;7:5;{2597.49450000003,904.9190000016242,0.0}
Trams183;18;3;6916;7:6;{2589.0274000018835,1538.5219000000507,0.0}
Trams148;14;7;6920;7:6;{2894.896500002593,514.0241999980062,0.0}
Trams149;14;19;6920;7:6;{2839.1857000030577,1180.8036000002176,0.0}
Trams142;14;17;6921;7:7;{5689.812200002372,2815.7713999990374,0.0}
Trams143;14;7;6921;7:7;{4084.1569000035524,2161.088000001386,0.0}
Trams185;18;11;6927;7:8;{4084.1569000035524,2161.088000001386,0.0}
Trams141;14;22;6930;7:8;{6883.719200000167,3354.242599999532,0.0}
Trams181;18;4;6931;7:8;{7477.508000001311,3581.729000000283,0.0}
Trams181;18;3;6932;7:8;{7477.508000001311,3581.729000000283,0.0}
Trams184;18;7;6932;7:8;{1782.5218000002205,1208.6106000002474,0.0}
Trams142;14;19;6932;7:8;{6221.943900000304,2968.579499999061,0.0}
Trams148;14;9;6932;7:8;{2597.49450000003,904.9190000016242,0.0}
Trams146;14;0;6933;7:9;{2774.94460455129,1095.9101807449765,0.0}
Trams149;14;18;6934;7:9;{3084.0353342962862,1747.4296273253601,0.0}
Trams183;18;1;6935;7:9;{1692.722305299079,1166.6255241828771,0.0}
Trams143;14;15;6935;7:9;{4722.0763000026345,2426.624300001189,0.0}
Trams147;14;5;6935;7:9;{2894.896500002593,514.0241999980062,0.0}
Trams141;14;21;6939;7:10;{7267.007879060962,3598.2324644667874,0.0}
Trams184;18;10;6940;7:10;{2149.2538000009954,1363.784799998626,0.0}
Trams148;14;13;6940;7:10;{2839.1857000030577,1180.8036000002176,0.0}
Trams185;18;12;6941;7:10;{4722.0763000026345,2426.624300001189,0.0}
Trams141;14;6;6944;7:10;{7477.508000001311,3581.729000000283,0.0}
Trams143;14;16;6944;7:10;{5123.508700001985,2583.745899999514,0.0}
Trams141;14;4;6945;7:11;{7477.508000001311,3581.729000000283,0.0}
Trams147;14;9;6947;7:11;{2597.49450000003,904.9190000016242,0.0}
Trams184;18;12;6950;7:11;{2627.1466000005603,1561.507400000468,0.0}
Trams185;18;14;6950;7:11;{5123.508700001985,2583.745899999514,0.0}
Trams146;14;2;6950;7:11;{2894.896500002593,514.0241999980062,0.0}
Trams146;14;3;6951;7:12;{2892.683600001037,511.3241000007838,0.0}
Trams144;14;3;6954;7:12;{2992.747200001031,1703.0900999996811,0.0}
Trams183;18;0;6955;7:12;{845.340600002557,806.1041999999434,0.0}
Trams147;14;10;6955;7:12;{2839.1857000030577,1180.8036000002176,0.0}
Trams149;14;20;6955;7:12;{4084.1569000035524,2161.088000001386,0.0}
Trams143;14;20;6956;7:12;{5689.812200002372,2815.7713999990374,0.0}
Trams143;14;19;6957;7:13;{5739.764803540053,2830.2159521656795,0.0}
Trams142;14;6;6962;7:13;{7477.508000001311,3581.729000000283,0.0}
Trams146;14;4;6962;7:13;{2597.49450000003,904.9190000016242,0.0}
Trams142;14;5;6963;7:14;{7477.508000001311,3581.729000000283,0.0}
Trams145;14;4;6965;7:14;{2894.896500002593,514.0241999980062,0.0}
Trams149;14;24;6969;7:15;{4722.0763000026345,2426.624300001189,0.0}
Trams146;14;8;6970;7:15;{2839.1857000030577,1180.8036000002176,0.0}
Trams185;18;15;6973;7:15;{6221.943900000304,2968.579499999061,0.0}
Trams143;14;18;6975;7:16;{6593.146138654794,3149.575753243163,0.0}
Trams183;18;2;6977;7:16;{1782.5218000002205,1208.6106000002474,0.0}
Trams144;14;5;6985;7:17;{2894.896500002593,514.0241999980062,0.0}
Trams145;14;7;6985;7:17;{2839.1857000030577,1180.8036000002176,0.0}
Trams148;14;17;6989;7:18;{4722.0763000026345,2426.624300001189,0.0}
Trams181;18;4;6995;7:19;{4672.309900000691,2395.577299999073,0.0}
Trams183;18;6;6995;7:19;{2627.1466000005603,1561.507400000468,0.0}
Trams184;18;14;6995;7:19;{4722.0763000026345,2426.624300001189,0.0}
Trams143;14;1;6997;7:19;{7477.508000001311,3581.729000000283,0.0}
Trams144;14;8;6997;7:19;{2597.49450000003,904.9190000016242,0.0}
Trams185;18;14;6998;7:19;{7267.007879060962,3598.2324644667874,0.0}
Trams148;14;24;6998;7:19;{5123.508700001985,2583.745899999514,0.0}
Trams145;14;6;6999;7:20;{3084.0353342962862,1747.4296273253601,0.0}
Trams185;18;4;7003;7:20;{7477.508000001311,3581.729000000283,0.0}
Trams184;18;16;7004;7:20;{5123.508700001985,2583.745899999514,0.0}
Trams185;18;2;7004;7:20;{7477.508000001311,3581.729000000283,0.0}
Trams144;14;10;7005;7:21;{2839.1857000030577,1180.8036000002176,0.0}
Trams146;14;9;7005;7:21;{4084.1569000035524,2161.088000001386,0.0}
Trams182;18;3;7010;7:21;{845.340600002557,806.1041999999434,0.0}
Trams149;14;23;7010;7:21;{6609.992500003427,3161.7836000006646,0.0}
Trams184;18;22;7016;7:22;{5689.812200002372,2815.7713999990374,0.0}
Trams146;14;10;7019;7:23;{4722.0763000026345,2426.624300001189,0.0}
Trams148;14;23;7022;7:23;{6271.932036142039,2982.903802087056,0.0}
Trams147;14;11;7025;7:24;{5689.812200002372,2815.7713999990374,0.0}
Trams146;14;12;7028;7:24;{5123.508700001985,2583.745899999514,0.0}
Trams182;18;2;7031;7:25;{1768.882714616512,1202.84636491075,0.0}
Trams149;14;2;7031;7:25;{7477.508000001311,3581.729000000283,0.0}
Trams182;18;3;7032;7:25;{1782.5218000002205,1208.6106000002474,0.0}
Trams149;14;1;7032;7:25;{7477.508000001311,3581.729000000283,0.0}
Trams145;14;8;7034;7:25;{4722.0763000026345,2426.624300001189,0.0}
Trams181;18;5;7040;7:26;{2589.0274000018835,1538.5219000000507,0.0}
Trams182;18;9;7040;7:26;{2149.2538000009954,1363.784799998626,0.0}
Trams183;18;7;7040;7:26;{4722.0763000026345,2426.624300001189,0.0}
Trams146;14;13;7040;7:26;{5689.812200002372,2815.7713999990374,0.0}
Trams143;14;2;7041;7:27;{5634.466500002891,2784.006800001487,0.0}
Trams145;14;14;7043;7:27;{5123.508700001985,2583.745899999514,0.0}
Trams182;18;11;7050;7:28;{2627.1466000005603,1561.507400000468,0.0}
Trams146;14;14;7051;7:28;{6221.943900000304,2968.579499999061,0.0}
Trams148;14;6;7051;7:28;{7477.508000001311,3581.729000000283,0.0}
Trams148;14;5;7052;7:28;{7477.508000001311,3581.729000000283,0.0}
Trams144;14;12;7054;7:29;{4722.0763000026345,2426.624300001189,0.0}
Trams184;18;5;7057;7:29;{7477.508000001311,3581.729000000283,0.0}
Trams184;18;4;7058;7:29;{7477.508000001311,3581.729000000283,0.0}
Trams185;18;3;7059;7:30;{5058.904000002891,2546.714799998328,0.0}
Trams183;18;8;7061;7:30;{5689.812200002372,2815.7713999990374,0.0}
Trams183;18;7;7062;7:30;{5739.764803540053,2830.2159521656795,0.0}
Trams144;14;16;7063;7:30;{5123.508700001985,2583.745899999514,0.0}
Trams147;14;1;7066;7:31;{7477.508000001311,3581.729000000283,0.0}
Trams185;18;4;7067;7:31;{4672.309900000691,2395.577299999073,0.0}
Trams181;18;4;7069;7:31;{1213.7785956119094,964.194963392883,0.0}
Trams181;18;5;7070;7:31;{1208.916700001806,962.1525999996811,0.0}
Trams143;14;1;7074;7:32;{4048.297289360261,2135.7927898531034,0.0}
Trams141;14;15;7075;7:32;{2894.896500002593,514.0241999980062,0.0}
Trams181;18;4;7079;7:33;{845.340600002557,806.1041999999434,0.0}
Trams146;14;1;7081;7:33;{7477.508000001311,3581.729000000283,0.0}
Trams145;14;13;7082;7:33;{6883.719200000167,3354.242599999532,0.0}
Trams141;14;24;7087;7:34;{2597.49450000003,904.9190000016242,0.0}
Trams149;14;2;7087;7:34;{5058.904000002891,2546.714799998328,0.0}
Trams142;14;6;7093;7:35;{2894.896500002593,514.0241999980062,0.0}
Trams182;18;17;7095;7:36;{4722.0763000026345,2426.624300001189,0.0}
Trams149;14;3;7095;7:36;{4672.309900000691,2395.577299999073,0.0}
Trams145;14;0;7096;7:36;{7477.508000001311,3581.729000000283,0.0}
Trams183;18;0;7102;7:37;{7477.508000001311,3581.729000000283,0.0}
Trams185;18;5;7103;7:37;{2992.747200001031,1703.0900999996811,0.0}
Trams182;18;21;7104;7:37;{5123.508700001985,2583.745899999514,0.0}
Trams142;14;24;7105;7:37;{2597.49450000003,904.9190000016242,0.0}
Trams1411;14;1;7105;7:37;{2597.49450000003,904.9190000016242,0.0}
Trams181;18;8;7109;7:38;{2149.2538000009954,1363.784799998626,0.0}
Trams149;14;2;7109;7:38;{4031.8555000014603,2128.9623999986798,0.0}
Trams184;18;5;7113;7:39;{5058.904000002891,2546.714799998328,0.0}
Trams1411;14;13;7113;7:39;{2839.1857000030577,1180.8036000002176,0.0}
Trams182;18;23;7116;7:39;{5689.812200002372,2815.7713999990374,0.0}
Trams144;14;3;7116;7:39;{7477.508000001311,3581.729000000283,0.0}
Trams181;18;9;7119;7:40;{2627.1466000005603,1561.507400000468,0.0}
Trams184;18;6;7121;7:40;{4672.309900000691,2395.577299999073,0.0}
Trams146;14;2;7125;7:41;{5634.466500002891,2784.006800001487,0.0}
Trams142;14;23;7126;7:41;{3035.1652000024915,1729.7097000014037,0.0}
Trams143;14;8;7128;7:41;{2894.896500002593,514.0241999980062,0.0}
Trams185;18;6;7130;7:41;{1740.6504000015557,1186.7970000002533,0.0}
Trams185;18;5;7131;7:42;{1692.722305299079,1166.6255241828771,0.0}
Trams149;14;1;7131;7:42;{2992.747200001031,1703.0900999996811,0.0}
Trams143;14;17;7140;7:43;{2597.49450000003,904.9190000016242,0.0}
Trams185;18;4;7141;7:43;{1213.7785956119094,964.194963392883,0.0}
Trams146;14;1;7145;7:44;{4672.309900000691,2395.577299999073,0.0}
Trams183;18;1;7146;7:44;{5634.466500002891,2784.006800001487,0.0}
Trams142;14;24;7148;7:44;{4084.1569000035524,2161.088000001386,0.0}
Trams143;14;21;7148;7:44;{2839.1857000030577,1180.8036000002176,0.0}
Trams1411;14;14;7148;7:44;{4084.1569000035524,2161.088000001386,0.0}
Trams181;18;8;7150;7:45;{4084.1569000035524,2161.088000001386,0.0}
Trams182;18;22;7151;7:45;{7223.311400000006,3570.043500000611,0.0}
Trams185;18;2;7151;7:45;{845.340600002557,806.1041999999434,0.0}
Trams182;18;21;7152;7:45;{7267.007879060962,3598.2324644667874,0.0}
Trams182;18;2;7157;7:46;{7477.508000001311,3581.729000000283,0.0}
Trams182;18;0;7158;7:46;{7477.508000001311,3581.729000000283,0.0}
Trams143;14;20;7162;7:47;{3084.0353342962862,1747.4296273253601,0.0}
Trams149;14;7;7162;7:47;{2894.896500002593,514.0241999980062,0.0}
Trams1411;14;24;7162;7:47;{4722.0763000026345,2426.624300001189,0.0}
Trams144;14;4;7172;7:48;{5058.904000002891,2546.714799998328,0.0}
Trams181;18;12;7173;7:49;{5123.508700001985,2583.745899999514,0.0}
Trams185;18;5;7173;7:49;{1782.5218000002205,1208.6106000002474,0.0}
Trams149;14;14;7174;7:49;{2597.49450000003,904.9190000016242,0.0}
Trams184;18;5;7177;7:49;{2064.0685709043055,1320.5282183098925,0.0}
Trams185;18;10;7181;7:50;{2149.2538000009954,1363.784799998626,0.0}
Trams148;14;9;7182;7:50;{2894.896500002593,514.0241999980062,0.0}
Trams149;14;21;7182;7:50;{2839.1857000030577,1180.8036000002176,0.0}
Trams143;14;21;7183;7:50;{4084.1569000035524,2161.088000001386,0.0}
Trams181;18;16;7185;7:51;{5689.812200002372,2815.7713999990374,0.0}
Trams185;18;13;7191;7:52;{2627.1466000005603,1561.507400000468,0.0}
Trams148;14;12;7194;7:52;{2597.49450000003,904.9190000016242,0.0}
Trams149;14;20;7195;7:52;{3035.1652000024915,1729.7097000014037,0.0}
Trams181;18;15;7196;7:52;{6221.943900000304,2968.579499999061,0.0}
Trams143;14;24;7197;7:53;{4722.0763000026345,2426.624300001189,0.0}
Trams147;14;7;7197;7:53;{2894.896500002593,514.0241999980062,0.0}
Trams1410;14;1;7197;7:53;{4722.0763000026345,2426.624300001189,0.0}
Trams182;18;2;7201;7:53;{5634.466500002891,2784.006800001487,0.0}
Trams148;14;13;7202;7:53;{2839.1857000030577,1180.8036000002176,0.0}
Trams184;18;4;7205;7:54;{845.340600002557,806.1041999999434,0.0}
Trams141;14;2;7206;7:54;{7477.508000001311,3581.729000000283,0.0}
Trams1410;14;4;7206;7:54;{5123.508700001985,2583.745899999514,0.0}
Trams141;14;1;7209;7:55;{7399.735580409566,3546.353579350148,0.0}
Trams1411;14;23;7210;7:55;{6883.719200000167,3354.242599999532,0.0}
Trams183;18;0;7211;7:55;{2589.0274000018835,1538.5219000000507,0.0}
Trams146;14;2;7212;7:55;{2894.896500002593,514.0241999980062,0.0}
Trams144;14;3;7216;7:56;{2992.747200001031,1703.0900999996811,0.0}
Trams147;14;9;7217;7:56;{2839.1857000030577,1180.8036000002176,0.0}
Trams149;14;19;7218;7:56;{4132.967545312427,2178.980077572535,0.0}
Trams1410;14;9;7218;7:56;{5689.812200002372,2815.7713999990374,0.0}
Trams142;14;23;7219;7:56;{7267.007879060962,3598.2324644667874,0.0}
Trams182;18;4;7221;7:57;{4672.309900000691,2395.577299999073,0.0}
Trams142;14;5;7224;7:57;{7477.508000001311,3581.729000000283,0.0}
Trams146;14;6;7224;7:57;{2597.49450000003,904.9190000016242,0.0}
Trams1411;14;1;7224;7:57;{7477.508000001311,3581.729000000283,0.0}
Trams142;14;4;7225;7:57;{7477.508000001311,3581.729000000283,0.0}
Trams1411;14;0;7225;7:57;{7477.508000001311,3581.729000000283,0.0}
Trams181;18;3;7226;7:57;{7477.508000001311,3581.729000000283,0.0}
Trams145;14;1;7227;7:58;{2894.896500002593,514.0241999980062,0.0}
Trams149;14;18;7230;7:58;{4707.823850244834,2420.7529164061234,0.0}
Trams149;14;20;7231;7:58;{4722.0763000026345,2426.624300001189,0.0}
Trams146;14;9;7232;7:58;{2839.1857000030577,1180.8036000002176,0.0}
Trams184;18;7;7235;7:59;{2149.2538000009954,1363.784799998626,0.0}
Trams185;18;15;7236;7:59;{4722.0763000026345,2426.624300001189,0.0}
Trams141;14;2;7238;7:59;{6188.119100000709,2954.7112999986857,0.0}
Trams145;14;6;7239;8:0;{2597.49450000003,904.9190000016242,0.0}
Trams149;14;24;7240;8:0;{5123.508700001985,2583.745899999514,0.0}
Trams184;18;12;7245;8:1;{2627.1466000005603,1561.507400000468,0.0}
Trams185;18;17;7245;8:1;{5123.508700001985,2583.745899999514,0.0}
Trams143;14;23;7245;8:1;{6883.719200000167,3354.242599999532,0.0}
Trams144;14;5;7247;8:1;{2894.896500002593,514.0241999980062,0.0}
Trams145;14;8;7247;8:1;{2839.1857000030577,1180.8036000002176,0.0}
Trams148;14;14;7251;8:2;{4722.0763000026345,2426.624300001189,0.0}
Trams143;14;22;7253;8:2;{7223.311400000006,3570.043500000611,0.0}
Trams185;18;18;7257;8:3;{5689.812200002372,2815.7713999990374,0.0}
Trams143;14;1;7259;8:3;{7477.508000001311,3581.729000000283,0.0}
Trams144;14;6;7259;8:3;{2597.49450000003,904.9190000016242,0.0}
Trams1410;14;0;7259;8:3;{7477.508000001311,3581.729000000283,0.0}
Trams144;14;7;7267;8:4;{2839.1857000030577,1180.8036000002176,0.0}
Trams146;14;8;7268;8:4;{4132.967545312427,2178.980077572535,0.0}
Trams181;18;4;7270;8:5;{5634.466500002891,2784.006800001487,0.0}
Trams141;14;3;7270;8:5;{4672.309900000691,2395.577299999073,0.0}
Trams183;18;2;7272;8:5;{1782.5218000002205,1208.6106000002474,0.0}
Trams148;14;15;7272;8:5;{5689.812200002372,2815.7713999990374,0.0}
Trams147;14;11;7275;8:6;{5123.508700001985,2583.745899999514,0.0}
Trams182;18;3;7277;8:6;{2064.0685709043055,1320.5282183098925,0.0}
Trams149;14;23;7278;8:6;{6864.837443928478,3341.6995773341046,0.0}
Trams149;14;22;7279;8:6;{6883.719200000167,3354.242599999532,0.0}
Trams146;14;9;7281;8:7;{4722.0763000026345,2426.624300001189,0.0}
Trams181;18;6;7282;8:7;{5058.904000002891,2546.714799998328,0.0}
Trams145;14;7;7282;8:7;{4084.1569000035524,2161.088000001386,0.0}
Trams141;14;2;7284;8:7;{4031.8555000014603,2128.9623999986798,0.0}
Trams148;14;14;7284;8:7;{6271.932036142039,2982.903802087056,0.0}
Trams183;18;3;7290;8:8;{2627.1466000005603,1561.507400000468,0.0}
Trams149;14;1;7293;8:9;{7477.508000001311,3581.729000000283,0.0}
Trams185;18;0;7298;8:9;{7477.508000001311,3581.729000000283,0.0}
Trams184;18;13;7299;8:10;{5123.508700001985,2583.745899999514,0.0}
Trams145;14;6;7304;8:10;{5108.905971347362,2577.745680309252,0.0}
Trams182;18;0;7305;8:11;{845.340600002557,806.1041999999434,0.0}
Trams141;14;1;7306;8:11;{2992.747200001031,1703.0900999996811,0.0}
Trams147;14;10;7306;8:11;{6593.146138654794,3149.575753243163,0.0}
Trams184;18;12;7312;8:12;{5739.764803540053,2830.2159521656795,0.0}
Trams148;14;4;7313;8:12;{7477.508000001311,3581.729000000283,0.0}
Trams148;14;3;7314;8:12;{7477.508000001311,3581.729000000283,0.0}
Trams143;14;2;7315;8:12;{5058.904000002891,2546.714799998328,0.0}
Trams183;18;4;7321;8:13;{4084.1569000035524,2161.088000001386,0.0}
Trams144;14;9;7325;8:14;{5123.508700001985,2583.745899999514,0.0}
Trams147;14;1;7328;8:14;{7477.508000001311,3581.729000000283,0.0}
Trams181;18;7;7335;8:16;{2589.0274000018835,1538.5219000000507,0.0}
Trams182;18;3;7335;8:16;{2149.2538000009954,1363.784799998626,0.0}
Trams184;18;11;7337;8:16;{6864.837443928478,3341.6995773341046,0.0}
Trams141;14;10;7337;8:16;{2894.896500002593,514.0241999980062,0.0}
Trams146;14;1;7343;8:17;{7477.508000001311,3581.729000000283,0.0}
Trams183;18;5;7344;8:17;{5123.508700001985,2583.745899999514,0.0}
Trams182;18;7;7345;8:17;{2627.1466000005603,1561.507400000468,0.0}
Trams141;14;18;7349;8:18;{2597.49450000003,904.9190000016242,0.0}
Trams149;14;2;7349;8:18;{5058.904000002891,2546.714799998328,0.0}
Trams184;18;3;7352;8:18;{7477.508000001311,3581.729000000283,0.0}
Trams181;18;6;7353;8:19;{1740.6504000015557,1186.7970000002533,0.0}
Trams185;18;2;7354;8:19;{5058.904000002891,2546.714799998328,0.0}
Trams142;14;5;7355;8:19;{2894.896500002593,514.0241999980062,0.0}
Trams141;14;24;7357;8:19;{2839.1857000030577,1180.8036000002176,0.0}
Trams145;14;0;7358;8:19;{7477.508000001311,3581.729000000283,0.0}
Trams185;18;3;7362;8:20;{4672.309900000691,2395.577299999073,0.0}
Trams142;14;6;7367;8:21;{2597.49450000003,904.9190000016242,0.0}
Trams148;14;4;7369;8:21;{5058.904000002891,2546.714799998328,0.0}
Trams141;14;23;7371;8:22;{3084.0353342962862,1747.4296273253601,0.0}
Trams143;14;1;7372;8:22;{2808.1955000013113,1135.889900000766,0.0}
Trams181;18;4;7374;8:22;{845.340600002557,806.1041999999434,0.0}
Trams142;14;8;7375;8:22;{2839.1857000030577,1180.8036000002176,0.0}
Trams182;18;10;7376;8:22;{4084.1569000035524,2161.088000001386,0.0}
Trams182;18;9;7377;8:23;{4132.967545312427,2178.980077572535,0.0}
Trams144;14;3;7378;8:23;{7477.508000001311,3581.729000000283,0.0}
Trams144;14;2;7379;8:23;{7477.508000001311,3581.729000000283,0.0}
Trams184;18;4;7384;8:24;{6188.119100000709,2954.7112999986857,0.0}
Trams147;14;2;7384;8:24;{5058.904000002891,2546.714799998328,0.0}
Trams182;18;15;7390;8:25;{4722.0763000026345,2426.624300001189,0.0}
Trams145;14;1;7390;8:25;{6188.119100000709,2954.7112999986857,0.0}
Trams141;14;22;7393;8:25;{4132.967545312427,2178.980077572535,0.0}
Trams149;14;1;7393;8:25;{2992.747200001031,1703.0900999996811,0.0}
Trams184;18;5;7396;8:26;{5634.466500002891,2784.006800001487,0.0}
Trams183;18;0;7397;8:26;{7477.508000001311,3581.729000000283,0.0}
Trams182;18;18;7399;8:26;{5123.508700001985,2583.745899999514,0.0}
Trams143;14;2;7402;8:27;{2597.49450000003,904.9190000016242,0.0}
Trams181;18;6;7404;8:27;{2149.2538000009954,1363.784799998626,0.0}
Trams141;14;21;7406;8:27;{4722.0763000026345,2426.624300001189,0.0}
Trams143;14;5;7410;8:28;{2839.1857000030577,1180.8036000002176,0.0}
Trams182;18;20;7411;8:28;{5689.812200002372,2815.7713999990374,0.0}
Trams148;14;3;7413;8:29;{2992.747200001031,1703.0900999996811,0.0}
Trams181;18;9;7414;8:29;{2627.1466000005603,1561.507400000468,0.0}
Trams141;14;22;7415;8:29;{5123.508700001985,2583.745899999514,0.0}
Trams144;14;3;7422;8:30;{5634.466500002891,2784.006800001487,0.0}
Trams142;14;9;7424;8:30;{4722.0763000026345,2426.624300001189,0.0}
Trams149;14;3;7424;8:30;{2894.896500002593,514.0241999980062,0.0}
Trams141;14;21;7427;8:31;{5689.812200002372,2815.7713999990374,0.0}
Trams182;18;19;7430;8:31;{6593.146138654794,3149.575753243163,0.0}
Trams142;14;8;7432;8:32;{5108.905971347362,2577.745680309252,0.0}
Trams142;14;9;7433;8:32;{5123.508700001985,2583.745899999514,0.0}
Trams145;14;0;7436;8:32;{4031.8555000014603,2128.9623999986798,0.0}
Trams149;14;7;7436;8:32;{2597.49450000003,904.9190000016242,0.0}
Trams182;18;17;7437;8:33;{6864.837443928478,3341.6995773341046,0.0}
Trams182;18;16;7438;8:33;{6883.719200000167,3354.242599999532,0.0}
Trams147;14;1;7442;8:33;{2774.94460455129,1095.9101807449765,0.0}
Trams185;18;2;7444;8:34;{874.5067790792331,818.4381949221134,0.0}
Trams149;14;8;7444;8:34;{2839.1857000030577,1180.8036000002176,0.0}
Trams142;14;10;7445;8:34;{5689.812200002372,2815.7713999990374,0.0}
Trams185;18;0;7446;8:34;{845.340600002557,806.1041999999434,0.0}
Trams182;18;0;7452;8:35;{7477.508000001311,3581.729000000283,0.0}
Trams183;18;1;7453;8:35;{5058.904000002891,2546.714799998328,0.0}
Trams148;14;5;7456;8:36;{2597.49450000003,904.9190000016242,0.0}
Trams181;18;10;7459;8:36;{4722.0763000026345,2426.624300001189,0.0}
Trams184;18;6;7461;8:37;{2589.0274000018835,1538.5219000000507,0.0}
Trams141;14;20;7462;8:37;{7223.311400000006,3570.043500000611,0.0}
Trams141;14;19;7463;8:37;{7267.007879060962,3598.2324644667874,0.0}
Trams148;14;6;7464;8:37;{2839.1857000030577,1180.8036000002176,0.0}
Trams181;18;14;7468;8:38;{5123.508700001985,2583.745899999514,0.0}
Trams141;14;2;7468;8:38;{7477.508000001311,3581.729000000283,0.0}
Trams141;14;1;7469;8:38;{7477.508000001311,3581.729000000283,0.0}
Trams184;18;5;7471;8:38;{2110.2352000027895,1344.0613000001758,0.0}
Trams147;14;2;7471;8:38;{2597.49450000003,904.9190000016242,0.0}
Trams185;18;8;7476;8:39;{2149.2538000009954,1363.784799998626,0.0}
Trams147;14;3;7479;8:40;{2839.1857000030577,1180.8036000002176,0.0}
Trams182;18;2;7484;8:40;{6188.119100000709,2954.7112999986857,0.0}
Trams185;18;10;7486;8:41;{2627.1466000005603,1561.507400000468,0.0}
Trams142;14;3;7486;8:41;{7477.508000001311,3581.729000000283,0.0}
Trams145;14;2;7489;8:41;{2894.896500002593,514.0241999980062,0.0}
Trams181;18;12;7492;8:42;{6271.932036142039,2982.903802087056,0.0}
Trams149;14;10;7493;8:42;{4722.0763000026345,2426.624300001189,0.0}
Trams146;14;2;7494;8:42;{2839.1857000030577,1180.8036000002176,0.0}
Trams182;18;4;7496;8:42;{5634.466500002891,2784.006800001487,0.0}
Trams181;18;11;7499;8:43;{6593.146138654794,3149.575753243163,0.0}
Trams144;14;2;7499;8:43;{2567.6414284064917,825.1840510346515,0.0}
Trams184;18;3;7500;8:43;{845.340600002557,806.1041999999434,0.0}
Trams145;14;3;7501;8:43;{2597.49450000003,904.9190000016242,0.0}
Trams149;14;15;7502;8:43;{5123.508700001985,2583.745899999514,0.0}
Trams183;18;2;7506;8:44;{2589.0274000018835,1538.5219000000507,0.0}
Trams181;18;10;7507;8:44;{6883.719200000167,3354.242599999532,0.0}
Trams182;18;3;7509;8:45;{5010.473492013262,2527.781076226536,0.0}
Trams144;14;3;7509;8:45;{2894.896500002593,514.0241999980062,0.0}
Trams145;14;4;7509;8:45;{2839.1857000030577,1180.8036000002176,0.0}
Trams148;14;7;7513;8:45;{4722.0763000026345,2426.624300001189,0.0}
Trams149;14;17;7514;8:45;{5689.812200002372,2815.7713999990374,0.0}
Trams181;18;9;7516;8:46;{7267.007879060962,3598.2324644667874,0.0}
Trams182;18;6;7516;8:46;{4672.309900000691,2395.577299999073,0.0}
Trams183;18;1;7517;8:46;{2064.0685709043055,1320.5282183098925,0.0}
Trams181;18;3;7521;8:47;{7477.508000001311,3581.729000000283,0.0}
Trams143;14;1;7521;8:47;{7477.508000001311,3581.729000000283,0.0}
Trams144;14;10;7521;8:47;{2597.49450000003,904.9190000016242,0.0}
Trams184;18;5;7522;8:47;{1782.5218000002205,1208.6106000002474,0.0}
Trams148;14;8;7522;8:47;{5123.508700001985,2583.745899999514,0.0}
Trams182;18;5;7529;8:48;{4048.297289360261,2135.7927898531034,0.0}
Trams144;14;11;7529;8:48;{2839.1857000030577,1180.8036000002176,0.0}
Trams184;18;7;7530;8:48;{2149.2538000009954,1363.784799998626,0.0}
Trams148;14;10;7534;8:49;{5689.812200002372,2815.7713999990374,0.0}
Trams184;18;8;7540;8:50;{2627.1466000005603,1561.507400000468,0.0}
Trams149;14;16;7541;8:50;{6883.719200000167,3354.242599999532,0.0}
Trams144;14;10;7543;8:50;{3084.0353342962862,1747.4296273253601,0.0}
Trams146;14;3;7543;8:50;{4722.0763000026345,2426.624300001189,0.0}
Trams145;14;5;7544;8:50;{4084.1569000035524,2161.088000001386,0.0}
Trams183;18;0;7545;8:51;{845.340600002557,806.1041999999434,0.0}
Trams148;14;11;7545;8:51;{6221.943900000304,2968.579499999061,0.0}
Trams184;18;7;7549;8:51;{3035.1652000024915,1729.7097000014037,0.0}
Trams147;14;4;7549;8:51;{5689.812200002372,2815.7713999990374,0.0}
Trams142;14;4;7550;8:51;{4672.309900000691,2395.577299999073,0.0}
Trams182;18;3;7552;8:52;{2992.747200001031,1703.0900999996811,0.0}
Trams146;14;4;7552;8:52;{5123.508700001985,2583.745899999514,0.0}
Trams185;18;9;7553;8:52;{5739.764803540053,2830.2159521656795,0.0}
Trams149;14;1;7555;8:52;{7477.508000001311,3581.729000000283,0.0}
Trams149;14;0;7556;8:52;{7477.508000001311,3581.729000000283,0.0}
Trams145;14;6;7558;8:53;{4722.0763000026345,2426.624300001189,0.0}
Trams147;14;5;7560;8:53;{6221.943900000304,2968.579499999061,0.0}
Trams182;18;4;7561;8:53;{2589.0274000018835,1538.5219000000507,0.0}
Trams185;18;10;7563;8:54;{6221.943900000304,2968.579499999061,0.0}
Trams181;18;4;7565;8:54;{5634.466500002891,2784.006800001487,0.0}
Trams146;14;3;7565;8:54;{5739.764803540053,2830.2159521656795,0.0}
Trams183;18;3;7575;8:56;{2149.2538000009954,1363.784799998626,0.0}
Trams148;14;5;7575;8:56;{7477.508000001311,3581.729000000283,0.0}
Trams148;14;3;7576;8:56;{7477.508000001311,3581.729000000283,0.0}
Trams181;18;7;7577;8:56;{5058.904000002891,2546.714799998328,0.0}
Trams143;14;2;7577;8:56;{5058.904000002891,2546.714799998328,0.0}
Trams144;14;12;7578;8:56;{4722.0763000026345,2426.624300001189,0.0}
Trams183;18;4;7585;8:57;{2627.1466000005603,1561.507400000468,0.0}
Trams142;14;3;7586;8:57;{2992.747200001031,1703.0900999996811,0.0}
Trams144;14;13;7587;8:58;{5123.508700001985,2583.745899999514,0.0}
Trams147;14;0;7590;8:58;{7477.508000001311,3581.729000000283,0.0}
Trams185;18;1;7593;8:59;{7477.508000001311,3581.729000000283,0.0}
Trams185;18;0;7594;8:59;{7477.508000001311,3581.729000000283,0.0}
Trams181;18;6;7598;8:59;{4048.297289360261,2135.7927898531034,0.0}
Trams141;14;7;7599;9:0;{2894.896500002593,514.0241999980062,0.0}
Trams144;14;14;7599;9:0;{5689.812200002372,2815.7713999990374,0.0}
Trams182;18;1;7600;9:0;{845.340600002557,806.1041999999434,0.0}
Trams146;14;1;7605;9:1;{7477.508000001311,3581.729000000283,0.0}
Trams145;14;5;7606;9:1;{6883.719200000167,3354.242599999532,0.0}
Trams184;18;6;7607;9:1;{5739.764803540053,2830.2159521656795,0.0}
Trams148;14;4;7607;9:1;{6188.119100000709,2954.7112999986857,0.0}
Trams144;14;13;7610;9:1;{6221.943900000304,2968.579499999061,0.0}
Trams141;14;13;7611;9:2;{2597.49450000003,904.9190000016242,0.0}
Trams183;18;5;7616;9:2;{4084.1569000035524,2161.088000001386,0.0}
Trams141;14;17;7619;9:3;{2839.1857000030577,1180.8036000002176,0.0}
Trams145;14;0;7620;9:3;{7477.508000001311,3581.729000000283,0.0}
Trams181;18;4;7621;9:3;{2992.747200001031,1703.0900999996811,0.0}
Trams184;18;5;7625;9:4;{6593.146138654794,3149.575753243163,0.0}
Trams185;18;1;7625;9:4;{6188.119100000709,2954.7112999986857,0.0}
Trams181;18;5;7630;9:5;{2589.0274000018835,1538.5219000000507,0.0}
Trams183;18;4;7630;9:5;{4722.0763000026345,2426.624300001189,0.0}
Trams141;14;16;7633;9:5;{3084.0353342962862,1747.4296273253601,0.0}
Trams185;18;2;7637;9:6;{5634.466500002891,2784.006800001487,0.0}
Trams144;14;3;7640;9:6;{7477.508000001311,3581.729000000283,0.0}
Trams144;14;1;7641;9:7;{7477.508000001311,3581.729000000283,0.0}
Trams184;18;3;7647;9:8;{7477.508000001311,3581.729000000283,0.0}
Trams184;18;2;7648;9:8;{7477.508000001311,3581.729000000283,0.0}
Trams181;18;4;7649;9:8;{1692.722305299079,1166.6255241828771,0.0}
Trams143;14;1;7652;9:8;{2894.896500002593,514.0241999980062,0.0}
Trams181;18;3;7669;9:11;{845.340600002557,806.1041999999434,0.0}
Trams148;14;3;7675;9:12;{2992.747200001031,1703.0900999996811,0.0}
Trams183;18;1;7692;9:15;{7477.508000001311,3581.729000000283,0.0}
Trams183;18;0;7693;9:15;{7477.508000001311,3581.729000000283,0.0}
Trams141;14;15;7701;9:17;{6271.932036142039,2982.903802087056,0.0}
Trams185;18;1;7702;9:17;{2589.0274000018835,1538.5219000000507,0.0}
Trams185;18;0;7721;9:20;{1692.722305299079,1166.6255241828771,0.0}
Trams141;14;14;7724;9:20;{7223.311400000006,3570.043500000611,0.0}
Trams141;14;1;7730;9:21;{7477.508000001311,3581.729000000283,0.0}
Trams142;14;2;7748;9:24;{7477.508000001311,3581.729000000283,0.0}
Trams143;14;0;7783;9:30;{7477.508000001311,3581.729000000283,0.0}
Trams148;14;2;7837;9:39;{7477.508000001311,3581.729000000283,0.0}
Trams144;14;2;10129;16:1;{2894.896500002593,514.0241999980062,0.0}
Trams143;14;5;10142;16:3;{7477.508000001311,3581.729000000283,0.0}
Trams143;14;8;10143;16:4;{7446.12100000307,3545.9720000009984,0.0}
Trams143;14;9;10150;16:5;{7172.43200000003,3532.2607999984175,0.0}
Trams183;18;1;10152;16:5;{2992.747200001031,1703.0900999996811,0.0}
Trams184;18;3;10155;16:6;{845.340600002557,806.1041999999434,0.0}
Trams143;14;10;10158;16:6;{6831.853600002825,3315.144899999723,0.0}
Trams144;14;3;10162;16:7;{3035.1652000024915,1729.7097000014037,0.0}
Trams143;14;12;10173;16:9;{6188.119100000709,2954.7112999986857,0.0}
Trams149;14;12;10176;16:9;{7477.508000001311,3581.729000000283,0.0}
Trams181;18;6;10177;16:9;{7477.508000001311,3581.729000000283,0.0}
Trams183;18;0;10179;16:10;{1740.6504000015557,1186.7970000002533,0.0}
Trams143;14;11;10184;16:10;{5641.738919684285,2786.998382666919,0.0}
Trams149;14;14;10192;16:12;{6831.853600002825,3315.144899999723,0.0}
Trams184;18;2;10196;16:12;{2675.4015184145933,1580.8842637522473,0.0}
Trams148;14;6;10196;16:12;{7477.508000001311,3581.729000000283,0.0}
Trams143;14;10;10198;16:13;{5010.473492013262,2527.781076226536,0.0}
Trams144;14;1;10198;16:13;{4722.0763000026345,2426.624300001189,0.0}
Trams149;14;15;10199;16:13;{6563.806600000709,3123.2601999994367,0.0}
Trams183;18;3;10200;16:13;{845.340600002557,806.1041999999434,0.0}
Trams184;18;3;10204;16:14;{3035.1652000024915,1729.7097000014037,0.0}
Trams143;14;9;10205;16:14;{4672.309900000691,2395.577299999073,0.0}
Trams143;14;8;10206;16:14;{4624.179771982149,2375.8925514936154,0.0}
Trams149;14;10;10208;16:14;{6138.21238208538,2940.1058384544613,0.0}
Trams147;14;6;10211;16:15;{7477.508000001311,3581.729000000283,0.0}
Trams149;14;9;10218;16:16;{5641.738919684285,2786.998382666919,0.0}
Trams149;14;10;10219;16:16;{5634.466500002891,2784.006800001487,0.0}
Trams146;14;6;10226;16:17;{7477.508000001311,3581.729000000283,0.0}
Trams146;14;8;10227;16:18;{7446.12100000307,3545.9720000009984,0.0}
Trams149;14;9;10231;16:18;{5058.904000002891,2546.714799998328,0.0}
Trams149;14;8;10240;16:20;{4624.179771982149,2375.8925514936154,0.0}
Trams145;14;3;10241;16:20;{7477.508000001311,3581.729000000283,0.0}
Trams143;14;7;10242;16:20;{2952.0448504139104,1673.1693294131398,0.0}
Trams184;18;2;10248;16:21;{5108.905971347362,2577.745680309252,0.0}
Trams185;18;9;10249;16:21;{7477.508000001311,3581.729000000283,0.0}
Trams148;14;5;10252;16:22;{5010.473492013262,2527.781076226536,0.0}
Trams149;14;9;10253;16:22;{4031.8555000014603,2128.9623999986798,0.0}
Trams143;14;6;10254;16:22;{2808.1955000013113,1135.889900000766,0.0}
Trams182;18;2;10255;16:22;{845.340600002557,806.1041999999434,0.0}
Trams148;14;3;10259;16:23;{4672.309900000691,2395.577299999073,0.0}
Trams143;14;5;10261;16:23;{2569.3393000029027,869.8653000015765,0.0}
Trams144;14;5;10261;16:23;{7477.508000001311,3581.729000000283,0.0}
Trams143;14;2;10262;16:23;{2567.6414284064917,825.1840510346515,0.0}
Trams185;18;10;10265;16:24;{6831.853600002825,3315.144899999723,0.0}
Trams147;14;5;10266;16:24;{5058.904000002891,2546.714799998328,0.0}
Trams147;14;4;10267;16:24;{5010.473492013262,2527.781076226536,0.0}
Trams143;14;0;10272;16:25;{2894.896500002593,514.0241999980062,0.0}
Trams145;14;2;10273;16:25;{6138.21238208538,2940.1058384544613,0.0}
Trams147;14;3;10274;16:25;{4672.309900000691,2395.577299999073,0.0}
Trams149;14;10;10275;16:26;{2992.747200001031,1703.0900999996811,0.0}
Trams144;14;6;10277;16:26;{6831.853600002825,3315.144899999723,0.0}
Trams146;14;7;10282;16:27;{5010.473492013262,2527.781076226536,0.0}
Trams145;14;1;10283;16:27;{5641.738919684285,2786.998382666919,0.0}
Trams143;14;1;10284;16:27;{2597.49450000003,904.9190000016242,0.0}
Trams149;14;8;10288;16:28;{2808.1955000013113,1135.889900000766,0.0}
Trams146;14;5;10289;16:28;{4672.309900000691,2395.577299999073,0.0}
Trams149;14;6;10289;16:28;{2774.94460455129,1095.9101807449765,0.0}
Trams185;18;9;10291;16:28;{5641.738919684285,2786.998382666919,0.0}
Trams185;18;11;10292;16:28;{5634.466500002891,2784.006800001487,0.0}
Trams183;18;2;10294;16:29;{5123.508700001985,2583.745899999514,0.0}
Trams181;18;5;10295;16:29;{2110.2352000027895,1344.0613000001758,0.0}
Trams149;14;5;10295;16:29;{2569.3393000029027,869.8653000015765,0.0}
Trams145;14;2;10296;16:29;{5058.904000002891,2546.714799998328,0.0}
Trams149;14;2;10296;16:29;{2567.6414284064917,825.1840510346515,0.0}
Trams181;18;4;10303;16:30;{1740.6504000015557,1186.7970000002533,0.0}
Trams184;18;16;10303;16:30;{7477.508000001311,3581.729000000283,0.0}
Trams146;14;3;10303;16:30;{4031.8555000014603,2128.9623999986798,0.0}
Trams183;18;1;10307;16:31;{5739.764803540053,2830.2159521656795,0.0}
Trams148;14;4;10308;16:31;{2808.1955000013113,1135.889900000766,0.0}
Trams185;18;10;10312;16:32;{4672.309900000691,2395.577299999073,0.0}
Trams144;14;5;10316;16:32;{5058.904000002891,2546.714799998328,0.0}
Trams183;18;0;10317;16:33;{6221.943900000304,2968.579499999061,0.0}
Trams147;14;2;10323;16:34;{2808.1955000013113,1135.889900000766,0.0}
Trams181;18;7;10324;16:34;{845.340600002557,806.1041999999434,0.0}
Trams144;14;4;10324;16:34;{4672.309900000691,2395.577299999073,0.0}
Trams148;14;3;10326;16:34;{2894.896500002593,514.0241999980062,0.0}
Trams147;14;1;10331;16:35;{2567.6414284064917,825.1840510346515,0.0}
Trams181;18;8;10334;16:35;{1241.924200002104,980.4126999992877,0.0}
Trams184;18;15;10335;16:36;{6138.21238208538,2940.1058384544613,0.0}
Trams144;14;5;10338;16:36;{4031.8555000014603,2128.9623999986798,0.0}
Trams146;14;2;10338;16:36;{2808.1955000013113,1135.889900000766,0.0}
Trams148;14;4;10338;16:36;{2597.49450000003,904.9190000016242,0.0}
Trams182;18;1;10339;16:36;{4707.823850244834,2420.7529164061234,0.0}
Trams143;14;0;10340;16:36;{4707.823850244834,2420.7529164061234,0.0}
Trams147;14;2;10340;16:36;{2894.896500002593,514.0241999980062,0.0}
Trams147;14;1;10341;16:37;{2894.896500002593,514.0241999980062,0.0}
Trams184;18;13;10345;16:37;{5641.738919684285,2786.998382666919,0.0}
Trams184;18;11;10346;16:37;{5634.466500002891,2784.006800001487,0.0}
Trams183;18;10;10348;16:38;{7477.508000001311,3581.729000000283,0.0}
Trams141;14;11;10351;16:38;{7477.508000001311,3581.729000000283,0.0}
Trams146;14;3;10355;16:39;{2894.896500002593,514.0241999980062,0.0}
Trams146;14;2;10356;16:39;{2894.896500002593,514.0241999980062,0.0}
Trams185;18;7;10357;16:39;{2589.0274000018835,1538.5219000000507,0.0}
Trams184;18;9;10358;16:39;{5058.904000002891,2546.714799998328,0.0}
Trams184;18;8;10359;16:40;{5010.473492013262,2527.781076226536,0.0}
Trams141;14;12;10359;16:40;{7172.43200000003,3532.2607999984175,0.0}
Trams144;14;6;10360;16:40;{2992.747200001031,1703.0900999996811,0.0}
Trams145;14;0;10360;16:40;{2569.3393000029027,869.8653000015765,0.0}
Trams149;14;3;10361;16:40;{4084.1569000035524,2161.088000001386,0.0}
Trams181;18;7;10364;16:40;{2627.1466000005603,1561.507400000468,0.0}
Trams183;18;11;10364;16:40;{6831.853600002825,3315.144899999723,0.0}
Trams181;18;6;10365;16:41;{2675.4015184145933,1580.8842637522473,0.0}
Trams184;18;7;10366;16:41;{4672.309900000691,2395.577299999073,0.0}
Trams184;18;6;10367;16:41;{4624.179771982149,2375.8925514936154,0.0}
Trams185;18;5;10367;16:41;{2110.2352000027895,1344.0613000001758,0.0}
Trams185;18;1;10368;16:41;{2064.0685709043055,1320.5282183098925,0.0}
Trams142;14;9;10369;16:41;{7477.508000001311,3581.729000000283,0.0}
Trams145;14;1;10370;16:41;{2894.896500002593,514.0241999980062,0.0}
Trams181;18;5;10373;16:42;{3035.1652000024915,1729.7097000014037,0.0}
Trams144;14;4;10373;16:42;{2808.1955000013113,1135.889900000766,0.0}
Trams144;14;3;10374;16:42;{2774.94460455129,1095.9101807449765,0.0}
Trams185;18;0;10375;16:42;{1740.6504000015557,1186.7970000002533,0.0}
Trams183;18;9;10380;16:43;{6138.21238208538,2940.1058384544613,0.0}
Trams144;14;1;10381;16:43;{2567.6414284064917,825.1840510346515,0.0}
Trams148;14;5;10381;16:43;{4084.1569000035524,2161.088000001386,0.0}
Trams141;14;13;10382;16:43;{6188.119100000709,2954.7112999986857,0.0}
Trams149;14;2;10383;16:44;{5108.905971347362,2577.745680309252,0.0}
Trams183;18;8;10391;16:45;{5634.466500002891,2784.006800001487,0.0}
Trams144;14;2;10391;16:45;{2894.896500002593,514.0241999980062,0.0}
Trams141;14;14;10394;16:45;{5634.466500002891,2784.006800001487,0.0}
Trams148;14;4;10395;16:46;{4722.0763000026345,2426.624300001189,0.0}
Trams185;18;1;10396;16:46;{845.340600002557,806.1041999999434,0.0}
Trams142;14;8;10401;16:47;{6138.21238208538,2940.1058384544613,0.0}
Trams182;18;8;10403;16:47;{7477.508000001311,3581.729000000283,0.0}
Trams183;18;9;10403;16:47;{5058.904000002891,2546.714799998328,0.0}
Trams183;18;7;10404;16:47;{5010.473492013262,2527.781076226536,0.0}
Trams143;14;8;10404;16:47;{7477.508000001311,3581.729000000283,0.0}
Trams141;14;15;10406;16:47;{5058.904000002891,2546.714799998328,0.0}
Trams183;18;5;10411;16:48;{4672.309900000691,2395.577299999073,0.0}
Trams184;18;5;10411;16:48;{2589.0274000018835,1538.5219000000507,0.0}
Trams181;18;4;10417;16:49;{5108.905971347362,2577.745680309252,0.0}
Trams148;14;3;10417;16:49;{5739.764803540053,2830.2159521656795,0.0}
Trams143;14;9;10420;16:50;{6831.853600002825,3315.144899999723,0.0}
Trams184;18;3;10422;16:50;{2064.0685709043055,1320.5282183098925,0.0}
Trams142;14;7;10425;16:51;{5010.473492013262,2527.781076226536,0.0}
Trams184;18;2;10430;16:51;{1692.722305299079,1166.6255241828771,0.0}
Trams182;18;9;10434;16:52;{6188.119100000709,2954.7112999986857,0.0}
Trams185;18;0;10436;16:52;{2627.1466000005603,1561.507400000468,0.0}
Trams149;14;11;10438;16:53;{7477.508000001311,3581.729000000283,0.0}
Trams182;18;6;10445;16:54;{5641.738919684285,2786.998382666919,0.0}
Trams182;18;5;10446;16:54;{5634.466500002891,2784.006800001487,0.0}
Trams142;14;6;10446;16:54;{4031.8555000014603,2128.9623999986798,0.0}
Trams184;18;4;10450;16:55;{845.340600002557,806.1041999999434,0.0}
Trams141;14;16;10450;16:55;{2992.747200001031,1703.0900999996811,0.0}
Trams183;18;4;10456;16:56;{2589.0274000018835,1538.5219000000507,0.0}
Trams182;18;4;10458;16:56;{5058.904000002891,2546.714799998328,0.0}
Trams148;14;7;10458;16:56;{7477.508000001311,3581.729000000283,0.0}
Trams182;18;3;10459;16:56;{5010.473492013262,2527.781076226536,0.0}
Trams141;14;14;10463;16:57;{2808.1955000013113,1135.889900000766,0.0}
Trams141;14;9;10464;16:57;{2774.94460455129,1095.9101807449765,0.0}
Trams183;18;3;10467;16:58;{2064.0685709043055,1320.5282183098925,0.0}
Trams144;14;1;10469;16:58;{5123.508700001985,2583.745899999514,0.0}
Trams149;14;12;10469;16:58;{6188.119100000709,2954.7112999986857,0.0}
Trams141;14;6;10470;16:58;{2569.3393000029027,869.8653000015765,0.0}
Trams141;14;4;10471;16:58;{2567.6414284064917,825.1840510346515,0.0}
Trams181;18;13;10472;16:58;{7477.508000001311,3581.729000000283,0.0}
Trams184;18;5;10472;16:58;{1782.5218000002205,1208.6106000002474,0.0}
Trams181;18;14;10473;16:59;{7446.12100000307,3545.9720000009984,0.0}
Trams147;14;3;10473;16:59;{7477.508000001311,3581.729000000283,0.0}
Trams183;18;1;10474;16:59;{1740.6504000015557,1186.7970000002533,0.0}
Trams149;14;10;10480;17:0;{5641.738919684285,2786.998382666919,0.0}
Trams141;14;2;10481;17:0;{2894.896500002593,514.0241999980062,0.0}
Trams142;14;3;10488;17:1;{2569.3393000029027,869.8653000015765,0.0}
Trams146;14;12;10488;17:1;{7477.508000001311,3581.729000000283,0.0}
Trams142;14;2;10489;17:1;{2567.6414284064917,825.1840510346515,0.0}
Trams149;14;8;10494;17:2;{5010.473492013262,2527.781076226536,0.0}
Trams184;18;6;10499;17:3;{3035.1652000024915,1729.7097000014037,0.0}
Trams141;14;3;10501;17:3;{2839.1857000030577,1180.8036000002176,0.0}
Trams148;14;6;10501;17:3;{5634.466500002891,2784.006800001487,0.0}
Trams149;14;7;10501;17:3;{4672.309900000691,2395.577299999073,0.0}
Trams182;18;2;10502;17:3;{2992.747200001031,1703.0900999996811,0.0}
Trams149;14;6;10502;17:3;{4624.179771982149,2375.8925514936154,0.0}
Trams143;14;10;10503;17:4;{2992.747200001031,1703.0900999996811,0.0}
Trams145;14;17;10503;17:4;{7477.508000001311,3581.729000000283,0.0}
Trams147;14;4;10504;17:4;{6188.119100000709,2954.7112999986857,0.0}
Trams146;14;13;10511;17:5;{6563.806600000709,3123.2601999994367,0.0}
Trams148;14;7;10513;17:5;{5058.904000002891,2546.714799998328,0.0}
Trams148;14;6;10514;17:5;{5010.473492013262,2527.781076226536,0.0}
Trams181;18;15;10515;17:6;{5634.466500002891,2784.006800001487,0.0}
Trams143;14;7;10516;17:6;{2808.1955000013113,1135.889900000766,0.0}
Trams183;18;2;10517;17:6;{1782.5218000002205,1208.6106000002474,0.0}
Trams143;14;6;10523;17:7;{2569.3393000029027,869.8653000015765,0.0}
Trams144;14;17;10523;17:7;{7477.508000001311,3581.729000000283,0.0}
Trams143;14;1;10524;17:7;{2567.6414284064917,825.1840510346515,0.0}
Trams181;18;14;10527;17:8;{5058.904000002891,2546.714799998328,0.0}
Trams146;14;11;10530;17:8;{5641.738919684285,2786.998382666919,0.0}
Trams146;14;10;10531;17:8;{5634.466500002891,2784.006800001487,0.0}
Trams143;14;0;10534;17:9;{2894.896500002593,514.0241999980062,0.0}
Trams181;18;12;10535;17:9;{4672.309900000691,2395.577299999073,0.0}
Trams183;18;1;10535;17:9;{2627.1466000005603,1561.507400000468,0.0}
Trams184;18;4;10535;17:9;{4722.0763000026345,2426.624300001189,0.0}
Trams145;14;15;10535;17:9;{6138.21238208538,2940.1058384544613,0.0}
Trams181;18;11;10536;17:9;{4624.179771982149,2375.8925514936154,0.0}
Trams141;14;2;10536;17:9;{4084.1569000035524,2161.088000001386,0.0}
Trams184;18;3;10543;17:10;{5108.905971347362,2577.745680309252,0.0}
Trams146;14;8;10543;17:10;{5058.904000002891,2546.714799998328,0.0}
Trams185;18;18;10544;17:10;{7477.508000001311,3581.729000000283,0.0}
Trams146;14;6;10544;17:10;{5010.473492013262,2527.781076226536,0.0}
Trams185;18;24;10545;17:11;{7446.12100000307,3545.9720000009984,0.0}
Trams145;14;14;10545;17:11;{5641.738919684285,2786.998382666919,0.0}
Trams181;18;9;10549;17:11;{4031.8555000014603,2128.9623999986798,0.0}
Trams149;14;5;10550;17:11;{2808.1955000013113,1135.889900000766,0.0}
Trams146;14;5;10551;17:12;{4672.309900000691,2395.577299999073,0.0}
Trams149;14;4;10551;17:12;{2774.94460455129,1095.9101807449765,0.0}
Trams144;14;18;10554;17:12;{6188.119100000709,2954.7112999986857,0.0}
Trams144;14;16;10555;17:12;{6138.21238208538,2940.1058384544613,0.0}
Trams148;14;7;10557;17:13;{2992.747200001031,1703.0900999996811,0.0}
Trams149;14;3;10557;17:13;{2569.3393000029027,869.8653000015765,0.0}
Trams149;14;2;10558;17:13;{2567.6414284064917,825.1840510346515,0.0}
Trams145;14;11;10559;17:13;{5010.473492013262,2527.781076226536,0.0}
Trams144;14;15;10565;17:14;{5641.738919684285,2786.998382666919,0.0}
Trams145;14;9;10566;17:14;{4672.309900000691,2395.577299999073,0.0}
Trams184;18;2;10567;17:14;{6221.943900000304,2968.579499999061,0.0}
Trams145;14;6;10567;17:14;{4624.179771982149,2375.8925514936154,0.0}
Trams148;14;5;10571;17:15;{2774.94460455129,1095.9101807449765,0.0}
Trams148;14;6;10577;17:16;{2569.3393000029027,869.8653000015765,0.0}
Trams181;18;8;10580;17:16;{2589.0274000018835,1538.5219000000507,0.0}
Trams147;14;3;10585;17:17;{2808.1955000013113,1135.889900000766,0.0}
Trams185;18;22;10586;17:17;{5641.738919684285,2786.998382666919,0.0}
Trams144;14;14;10586;17:17;{4672.309900000691,2395.577299999073,0.0}
Trams144;14;13;10587;17:18;{4624.179771982149,2375.8925514936154,0.0}
Trams148;14;5;10588;17:18;{2894.896500002593,514.0241999980062,0.0}
Trams181;18;5;10590;17:18;{2110.2352000027895,1344.0613000001758,0.0}
Trams181;18;4;10591;17:18;{2064.0685709043055,1320.5282183098925,0.0}
Trams184;18;24;10598;17:19;{7477.508000001311,3581.729000000283,0.0}
Trams185;18;19;10600;17:20;{5010.473492013262,2527.781076226536,0.0}
Trams146;14;4;10601;17:20;{2774.94460455129,1095.9101807449765,0.0}
Trams147;14;1;10603;17:20;{2894.896500002593,514.0241999980062,0.0}
Trams185;18;16;10607;17:21;{4672.309900000691,2395.577299999073,0.0}
Trams146;14;3;10607;17:21;{2569.3393000029027,869.8653000015765,0.0}
Trams185;18;15;10608;17:21;{4624.179771982149,2375.8925514936154,0.0}
Trams146;14;2;10608;17:21;{2567.6414284064917,825.1840510346515,0.0}
Trams141;14;24;10613;17:22;{7477.508000001311,3581.729000000283,0.0}
Trams145;14;5;10615;17:22;{2808.1955000013113,1135.889900000766,0.0}
Trams181;18;6;10619;17:23;{845.340600002557,806.1041999999434,0.0}
Trams185;18;12;10621;17:23;{4031.8555000014603,2128.9623999986798,0.0}
Trams145;14;4;10623;17:24;{2567.6414284064917,825.1840510346515,0.0}
Trams149;14;3;10623;17:24;{4084.1569000035524,2161.088000001386,0.0}
Trams181;18;7;10629;17:25;{1241.924200002104,980.4126999992877,0.0}
Trams184;18;21;10630;17:25;{6138.21238208538,2940.1058384544613,0.0}
Trams142;14;24;10631;17:25;{7477.508000001311,3581.729000000283,0.0}
Trams1411;14;24;10631;17:25;{7477.508000001311,3581.729000000283,0.0}
Trams145;14;2;10633;17:25;{2894.896500002593,514.0241999980062,0.0}
Trams144;14;9;10635;17:26;{2808.1955000013113,1135.889900000766,0.0}
Trams144;14;6;10636;17:26;{2774.94460455129,1095.9101807449765,0.0}
Trams184;18;15;10640;17:26;{5641.738919684285,2786.998382666919,0.0}
Trams184;18;14;10641;17:27;{5634.466500002891,2784.006800001487,0.0}
Trams183;18;24;10643;17:27;{7477.508000001311,3581.729000000283,0.0}
Trams144;14;3;10643;17:27;{2567.6414284064917,825.1840510346515,0.0}
Trams185;18;9;10652;17:28;{2589.0274000018835,1538.5219000000507,0.0}
Trams184;18;11;10653;17:29;{5058.904000002891,2546.714799998328,0.0}
Trams144;14;1;10653;17:29;{2894.896500002593,514.0241999980062,0.0}
Trams148;14;4;10657;17:29;{4722.0763000026345,2426.624300001189,0.0}
Trams181;18;6;10659;17:30;{2627.1466000005603,1561.507400000468,0.0}
Trams149;14;2;10659;17:30;{5739.764803540053,2830.2159521656795,0.0}
Trams181;18;5;10660;17:30;{2675.4015184145933,1580.8842637522473,0.0}
Trams184;18;9;10662;17:30;{4624.179771982149,2375.8925514936154,0.0}
Trams185;18;8;10662;17:30;{2110.2352000027895,1344.0613000001758,0.0}
Trams185;18;5;10663;17:30;{2064.0685709043055,1320.5282183098925,0.0}
Trams143;14;24;10666;17:31;{7477.508000001311,3581.729000000283,0.0}
Trams185;18;2;10670;17:31;{1740.6504000015557,1186.7970000002533,0.0}
Trams142;14;23;10674;17:32;{5634.466500002891,2784.006800001487,0.0}
Trams1410;14;2;10674;17:32;{7172.43200000003,3532.2607999984175,0.0}
Trams183;18;23;10675;17:32;{6138.21238208538,2940.1058384544613,0.0}
Trams184;18;8;10675;17:32;{4031.8555000014603,2128.9623999986798,0.0}
Trams1410;14;4;10682;17:33;{6831.853600002825,3315.144899999723,0.0}
Trams183;18;22;10685;17:34;{5641.738919684285,2786.998382666919,0.0}
Trams144;14;2;10686;17:34;{3035.1652000024915,1729.7097000014037,0.0}
Trams1411;14;18;10687;17:34;{5010.473492013262,2527.781076226536,0.0}
Trams145;14;3;10688;17:34;{4084.1569000035524,2161.088000001386,0.0}
Trams1410;14;5;10689;17:35;{6563.806600000709,3123.2601999994367,0.0}
Trams185;18;3;10691;17:35;{845.340600002557,806.1041999999434,0.0}
Trams1411;14;13;10694;17:35;{4672.309900000691,2395.577299999073,0.0}
Trams1411;14;12;10695;17:36;{4624.179771982149,2375.8925514936154,0.0}
Trams1410;14;6;10697;17:36;{6188.119100000709,2954.7112999986857,0.0}
Trams182;18;12;10698;17:36;{7477.508000001311,3581.729000000283,0.0}
Trams183;18;19;10698;17:36;{5058.904000002891,2546.714799998328,0.0}
Trams183;18;17;10699;17:36;{5010.473492013262,2527.781076226536,0.0}
Trams149;14;12;10700;17:36;{7477.508000001311,3581.729000000283,0.0}
Trams149;14;22;10701;17:37;{7446.12100000307,3545.9720000009984,0.0}
Trams181;18;4;10704;17:37;{4722.0763000026345,2426.624300001189,0.0}
Trams182;18;14;10706;17:37;{7172.43200000003,3532.2607999984175,0.0}
Trams183;18;12;10706;17:37;{4672.309900000691,2395.577299999073,0.0}
Trams184;18;6;10706;17:37;{2589.0274000018835,1538.5219000000507,0.0}
Trams183;18;11;10707;17:38;{4624.179771982149,2375.8925514936154,0.0}
Trams143;14;23;10709;17:38;{5634.466500002891,2784.006800001487,0.0}
Trams145;14;2;10710;17:38;{5108.905971347362,2577.745680309252,0.0}
Trams181;18;3;10712;17:38;{5108.905971347362,2577.745680309252,0.0}
Trams184;18;5;10716;17:39;{2110.2352000027895,1344.0613000001758,0.0}
Trams184;18;4;10717;17:39;{2064.0685709043055,1320.5282183098925,0.0}
Trams183;18;12;10720;17:40;{4031.8555000014603,2128.9623999986798,0.0}
Trams148;14;16;10720;17:40;{7477.508000001311,3581.729000000283,0.0}
Trams185;18;4;10721;17:40;{2149.2538000009954,1363.784799998626,0.0}
Trams143;14;21;10721;17:40;{5058.904000002891,2546.714799998328,0.0}
Trams143;14;19;10722;17:40;{5010.473492013262,2527.781076226536,0.0}
Trams144;14;1;10722;17:40;{4722.0763000026345,2426.624300001189,0.0}
Trams1410;14;4;10722;17:40;{5010.473492013262,2527.781076226536,0.0}
Trams184;18;3;10724;17:40;{1740.6504000015557,1186.7970000002533,0.0}
Trams141;14;18;10725;17:41;{2808.1955000013113,1135.889900000766,0.0}
Trams181;18;2;10726;17:41;{5739.764803540053,2830.2159521656795,0.0}
Trams141;14;12;10726;17:41;{2774.94460455129,1095.9101807449765,0.0}
Trams182;18;15;10729;17:41;{6188.119100000709,2954.7112999986857,0.0}
Trams143;14;16;10729;17:41;{4672.309900000691,2395.577299999073,0.0}
Trams1410;14;3;10729;17:41;{4672.309900000691,2395.577299999073,0.0}
Trams142;14;24;10730;17:41;{2992.747200001031,1703.0900999996811,0.0}
Trams1411;14;13;10730;17:41;{2992.747200001031,1703.0900999996811,0.0}
Trams185;18;5;10731;17:42;{2627.1466000005603,1561.507400000468,0.0}
Trams141;14;8;10732;17:42;{2569.3393000029027,869.8653000015765,0.0}
Trams141;14;6;10733;17:42;{2567.6414284064917,825.1840510346515,0.0}
Trams147;14;7;10735;17:42;{7477.508000001311,3581.729000000283,0.0}
Trams148;14;17;10736;17:42;{6831.853600002825,3315.144899999723,0.0}
Trams182;18;14;10740;17:43;{5641.738919684285,2786.998382666919,0.0}
Trams182;18;13;10741;17:43;{5634.466500002891,2784.006800001487,0.0}
Trams141;14;4;10743;17:44;{2894.896500002593,514.0241999980062,0.0}
Trams142;14;22;10743;17:44;{2808.1955000013113,1135.889900000766,0.0}
Trams147;14;8;10743;17:44;{7172.43200000003,3532.2607999984175,0.0}
Trams142;14;19;10744;17:44;{2774.94460455129,1095.9101807449765,0.0}
Trams184;18;6;10745;17:44;{845.340600002557,806.1041999999434,0.0}
Trams142;14;12;10750;17:45;{2569.3393000029027,869.8653000015765,0.0}
Trams146;14;21;10750;17:45;{7477.508000001311,3581.729000000283,0.0}
Trams183;18;9;10751;17:45;{2589.0274000018835,1538.5219000000507,0.0}
Trams142;14;8;10751;17:45;{2567.6414284064917,825.1840510346515,0.0}
Trams1411;14;9;10751;17:45;{2567.6414284064917,825.1840510346515,0.0}
Trams182;18;11;10753;17:45;{5058.904000002891,2546.714799998328,0.0}
Trams182;18;10;10754;17:45;{5010.473492013262,2527.781076226536,0.0}
Trams149;14;21;10756;17:46;{5010.473492013262,2527.781076226536,0.0}
Trams182;18;7;10761;17:47;{4672.309900000691,2395.577299999073,0.0}
Trams183;18;6;10761;17:47;{2110.2352000027895,1344.0613000001758,0.0}
Trams142;14;2;10761;17:47;{2894.896500002593,514.0241999980062,0.0}
Trams1411;14;0;10761;17:47;{2894.896500002593,514.0241999980062,0.0}
Trams182;18;6;10762;17:47;{4624.179771982149,2375.8925514936154,0.0}
Trams183;18;3;10762;17:47;{2064.0685709043055,1320.5282183098925,0.0}
Trams149;14;18;10763;17:47;{4672.309900000691,2395.577299999073,0.0}
Trams143;14;17;10765;17:47;{2992.747200001031,1703.0900999996811,0.0}
Trams145;14;8;10765;17:47;{7477.508000001311,3581.729000000283,0.0}
Trams146;14;22;10766;17:47;{6831.853600002825,3315.144899999723,0.0}
Trams181;18;13;10767;17:48;{7477.508000001311,3581.729000000283,0.0}
Trams183;18;2;10769;17:48;{1740.6504000015557,1186.7970000002533,0.0}
Trams148;14;16;10775;17:49;{5058.904000002891,2546.714799998328,0.0}
Trams141;14;5;10776;17:49;{3035.1652000024915,1729.7097000014037,0.0}
Trams148;14;15;10776;17:49;{5010.473492013262,2527.781076226536,0.0}
Trams143;14;16;10778;17:49;{2808.1955000013113,1135.889900000766,0.0}
Trams147;14;7;10778;17:49;{5634.466500002891,2784.006800001487,0.0}
Trams1410;14;2;10778;17:49;{2808.1955000013113,1135.889900000766,0.0}
Trams143;14;15;10779;17:50;{2774.94460455129,1095.9101807449765,0.0}
Trams1410;14;1;10779;17:50;{2774.94460455129,1095.9101807449765,0.0}
Trams148;14;16;10783;17:50;{4672.309900000691,2395.577299999073,0.0}
Trams185;18;4;10784;17:50;{5108.905971347362,2577.745680309252,0.0}
Trams143;14;14;10785;17:51;{2569.3393000029027,869.8653000015765,0.0}
Trams144;14;19;10785;17:51;{7477.508000001311,3581.729000000283,0.0}
Trams1410;14;0;10785;17:51;{2569.3393000029027,869.8653000015765,0.0}
Trams143;14;8;10786;17:51;{2567.6414284064917,825.1840510346515,0.0}
Trams145;14;9;10788;17:51;{6563.806600000709,3123.2601999994367,0.0}
Trams183;18;4;10790;17:51;{845.340600002557,806.1041999999434,0.0}
Trams147;14;6;10791;17:52;{5010.473492013262,2527.781076226536,0.0}
Trams146;14;21;10793;17:52;{5634.466500002891,2784.006800001487,0.0}
Trams143;14;1;10796;17:52;{2894.896500002593,514.0241999980062,0.0}
Trams185;18;5;10797;17:53;{5689.812200002372,2815.7713999990374,0.0}
Trams185;18;3;10798;17:53;{5739.764803540053,2830.2159521656795,0.0}
Trams147;14;5;10798;17:53;{4672.309900000691,2395.577299999073,0.0}
Trams146;14;20;10806;17:54;{5010.473492013262,2527.781076226536,0.0}
Trams145;14;8;10808;17:54;{5634.466500002891,2784.006800001487,0.0}
Trams181;18;14;10810;17:55;{5634.466500002891,2784.006800001487,0.0}
Trams149;14;16;10812;17:55;{2808.1955000013113,1135.889900000766,0.0}
Trams146;14;17;10813;17:55;{4672.309900000691,2395.577299999073,0.0}
Trams182;18;5;10816;17:56;{2110.2352000027895,1344.0613000001758,0.0}
Trams182;18;3;10817;17:56;{2064.0685709043055,1320.5282183098925,0.0}
Trams149;14;10;10819;17:56;{2569.3393000029027,869.8653000015765,0.0}
Trams141;14;4;10820;17:56;{5108.905971347362,2577.745680309252,0.0}
Trams149;14;6;10820;17:56;{2567.6414284064917,825.1840510346515,0.0}
Trams181;18;13;10823;17:57;{5010.473492013262,2527.781076226536,0.0}
Trams144;14;18;10828;17:58;{5634.466500002891,2784.006800001487,0.0}
Trams145;14;5;10828;17:58;{4672.309900000691,2395.577299999073,0.0}
Trams184;18;5;10829;17:58;{4707.823850244834,2420.7529164061234,0.0}
Trams149;14;7;10829;17:58;{2894.896500002593,514.0241999980062,0.0}
Trams181;18;11;10830;17:58;{4672.309900000691,2395.577299999073,0.0}
Trams149;14;4;10830;17:58;{2894.896500002593,514.0241999980062,0.0}
Trams148;14;14;10832;17:58;{2808.1955000013113,1135.889900000766,0.0}
Trams185;18;24;10839;18:0;{7477.508000001311,3581.729000000283,0.0}
Trams148;14;11;10839;18:0;{2569.3393000029027,869.8653000015765,0.0}
Trams144;14;19;10840;18:0;{5058.904000002891,2546.714799998328,0.0}
Trams148;14;7;10840;18:0;{2567.6414284064917,825.1840510346515,0.0}
Trams144;14;17;10841;18:0;{5010.473492013262,2527.781076226536,0.0}
Trams145;14;6;10842;18:0;{4031.8555000014603,2128.9623999986798,0.0}
Trams181;18;10;10844;18:0;{4031.8555000014603,2128.9623999986798,0.0}
Trams147;14;4;10847;18:1;{2808.1955000013113,1135.889900000766,0.0}
Trams148;14;4;10850;18:1;{2894.896500002593,514.0241999980062,0.0}
Trams143;14;2;10851;18:2;{4084.1569000035524,2161.088000001386,0.0}
Trams147;14;3;10855;18:2;{2567.6414284064917,825.1840510346515,0.0}
Trams184;18;4;10862;18:3;{6221.943900000304,2968.579499999061,0.0}
Trams146;14;14;10862;18:3;{2808.1955000013113,1135.889900000766,0.0}
Trams146;14;13;10863;18:4;{2774.94460455129,1095.9101807449765,0.0}
Trams143;14;1;10864;18:4;{4707.823850244834,2420.7529164061234,0.0}
Trams147;14;1;10865;18:4;{2894.896500002593,514.0241999980062,0.0}
Trams182;18;4;10867;18:4;{1782.5218000002205,1208.6106000002474,0.0}
Trams146;14;8;10870;18:5;{2567.6414284064917,825.1840510346515,0.0}
Trams181;18;8;10875;18:6;{2589.0274000018835,1538.5219000000507,0.0}
Trams182;18;5;10875;18:6;{2149.2538000009954,1363.784799998626,0.0}
Trams141;14;24;10875;18:6;{7477.508000001311,3581.729000000283,0.0}
Trams145;14;5;10877;18:6;{2808.1955000013113,1135.889900000766,0.0}
Trams146;14;3;10880;18:6;{2894.896500002593,514.0241999980062,0.0}
Trams185;18;21;10881;18:7;{5641.738919684285,2786.998382666919,0.0}
Trams185;18;19;10882;18:7;{5634.466500002891,2784.006800001487,0.0}
Trams144;14;18;10884;18:7;{2992.747200001031,1703.0900999996811,0.0}
Trams181;18;7;10885;18:7;{2110.2352000027895,1344.0613000001758,0.0}
Trams182;18;6;10885;18:7;{2627.1466000005603,1561.507400000468,0.0}
Trams181;18;6;10886;18:7;{2064.0685709043055,1320.5282183098925,0.0}
Trams181;18;4;10893;18:9;{1740.6504000015557,1186.7970000002533,0.0}
Trams184;18;22;10893;18:9;{7477.508000001311,3581.729000000283,0.0}
Trams142;14;15;10893;18:9;{7477.508000001311,3581.729000000283,0.0}
Trams145;14;6;10894;18:9;{2894.896500002593,514.0241999980062,0.0}
Trams145;14;3;10895;18:9;{2894.896500002593,514.0241999980062,0.0}
Trams183;18;3;10896;18:9;{5689.812200002372,2815.7713999990374,0.0}
Trams183;18;2;10897;18:9;{5739.764803540053,2830.2159521656795,0.0}
Trams144;14;15;10897;18:9;{2808.1955000013113,1135.889900000766,0.0}
Trams144;14;12;10898;18:9;{2774.94460455129,1095.9101807449765,0.0}
Trams185;18;17;10902;18:10;{4672.309900000691,2395.577299999073,0.0}
Trams185;18;15;10903;18:10;{4624.179771982149,2375.8925514936154,0.0}
Trams144;14;11;10904;18:10;{2569.3393000029027,869.8653000015765,0.0}
Trams144;14;8;10905;18:11;{2567.6414284064917,825.1840510346515,0.0}
Trams184;18;24;10909;18:11;{6831.853600002825,3315.144899999723,0.0}
Trams181;18;6;10914;18:12;{845.340600002557,806.1041999999434,0.0}
Trams144;14;9;10914;18:12;{2894.896500002593,514.0241999980062,0.0}
Trams144;14;3;10915;18:12;{2894.896500002593,514.0241999980062,0.0}
Trams145;14;4;10915;18:12;{2839.1857000030577,1180.8036000002176,0.0}
Trams185;18;16;10916;18:12;{4031.8555000014603,2128.9623999986798,0.0}
Trams141;14;23;10917;18:13;{5641.738919684285,2786.998382666919,0.0}
Trams142;14;17;10924;18:14;{6188.119100000709,2954.7112999986857,0.0}
Trams143;14;12;10928;18:14;{7477.508000001311,3581.729000000283,0.0}
Trams143;14;15;10929;18:15;{7446.12100000307,3545.9720000009984,0.0}
Trams182;18;5;10930;18:15;{4722.0763000026345,2426.624300001189,0.0}
Trams184;18;23;10935;18:16;{5641.738919684285,2786.998382666919,0.0}
Trams184;18;24;10936;18:16;{5634.466500002891,2784.006800001487,0.0}
Trams142;14;18;10936;18:16;{5634.466500002891,2784.006800001487,0.0}
Trams143;14;17;10936;18:16;{7172.43200000003,3532.2607999984175,0.0}
Trams182;18;4;10938;18:16;{5108.905971347362,2577.745680309252,0.0}
Trams183;18;5;10938;18:16;{7477.508000001311,3581.729000000283,0.0}
Trams141;14;24;10938;18:16;{4672.309900000691,2395.577299999073,0.0}
Trams182;18;3;10939;18:16;{5123.508700001985,2583.745899999514,0.0}
Trams143;14;18;10944;18:17;{6831.853600002825,3315.144899999723,0.0}
Trams185;18;11;10947;18:18;{2589.0274000018835,1538.5219000000507,0.0}
Trams184;18;23;10948;18:18;{5058.904000002891,2546.714799998328,0.0}
Trams144;14;4;10948;18:18;{3035.1652000024915,1729.7097000014037,0.0}
Trams184;18;15;10949;18:18;{5010.473492013262,2527.781076226536,0.0}
Trams182;18;2;10952;18:18;{5739.764803540053,2830.2159521656795,0.0}
Trams183;18;7;10954;18:19;{6831.853600002825,3315.144899999723,0.0}
Trams181;18;4;10955;18:19;{2675.4015184145933,1580.8842637522473,0.0}
Trams184;18;12;10956;18:19;{4672.309900000691,2395.577299999073,0.0}
Trams142;14;17;10956;18:19;{4672.309900000691,2395.577299999073,0.0}
Trams184;18;11;10957;18:19;{4624.179771982149,2375.8925514936154,0.0}
Trams185;18;10;10957;18:19;{2110.2352000027895,1344.0613000001758,0.0}
Trams185;18;5;10958;18:19;{2064.0685709043055,1320.5282183098925,0.0}
Trams183;18;8;10961;18:20;{6563.806600000709,3123.2601999994367,0.0}
Trams149;14;12;10962;18:20;{7477.508000001311,3581.729000000283,0.0}
Trams181;18;5;10963;18:20;{3035.1652000024915,1729.7097000014037,0.0}
Trams185;18;4;10965;18:21;{1740.6504000015557,1186.7970000002533,0.0}
Trams142;14;18;10970;18:21;{4031.8555000014603,2128.9623999986798,0.0}
Trams145;14;3;10972;18:22;{5108.905971347362,2577.745680309252,0.0}
Trams148;14;11;10982;18:23;{7477.508000001311,3581.729000000283,0.0}
Trams148;14;14;10983;18:24;{7446.12100000307,3545.9720000009984,0.0}
Trams143;14;16;10984;18:24;{5010.473492013262,2527.781076226536,0.0}
Trams185;18;7;10986;18:24;{845.340600002557,806.1041999999434,0.0}
Trams141;14;20;10987;18:24;{2808.1955000013113,1135.889900000766,0.0}
Trams141;14;17;10988;18:24;{2774.94460455129,1095.9101807449765,0.0}
Trams144;14;3;10992;18:25;{5108.905971347362,2577.745680309252,0.0}
Trams182;18;5;10993;18:25;{7477.508000001311,3581.729000000283,0.0}
Trams183;18;7;10994;18:25;{5010.473492013262,2527.781076226536,0.0}
Trams141;14;13;10994;18:25;{2569.3393000029027,869.8653000015765,0.0}
Trams141;14;8;10995;18:26;{2567.6414284064917,825.1840510346515,0.0}
Trams147;14;4;10997;18:26;{7477.508000001311,3581.729000000283,0.0}
Trams148;14;15;10998;18:26;{6831.853600002825,3315.144899999723,0.0}
Trams184;18;8;11001;18:27;{2589.0274000018835,1538.5219000000507,0.0}
Trams183;18;6;11002;18:27;{4624.179771982149,2375.8925514936154,0.0}
Trams141;14;5;11005;18:27;{2894.896500002593,514.0241999980062,0.0}
Trams143;14;14;11005;18:27;{4031.8555000014603,2128.9623999986798,0.0}
Trams149;14;11;11005;18:27;{5634.466500002891,2784.006800001487,0.0}
Trams142;14;17;11006;18:27;{2774.94460455129,1095.9101807449765,0.0}
Trams181;18;3;11007;18:28;{5108.905971347362,2577.745680309252,0.0}
Trams184;18;7;11012;18:28;{2064.0685709043055,1320.5282183098925,0.0}
Trams142;14;16;11012;18:28;{2569.3393000029027,869.8653000015765,0.0}
Trams146;14;5;11012;18:28;{7477.508000001311,3581.729000000283,0.0}
Trams142;14;10;11013;18:29;{2567.6414284064917,825.1840510346515,0.0}
Trams146;14;10;11013;18:29;{7446.12100000307,3545.9720000009984,0.0}
Trams182;18;6;11016;18:29;{6563.806600000709,3123.2601999994367,0.0}
Trams185;18;8;11016;18:29;{2149.2538000009954,1363.784799998626,0.0}
Trams149;14;9;11018;18:29;{5010.473492013262,2527.781076226536,0.0}
Trams184;18;5;11019;18:30;{1740.6504000015557,1186.7970000002533,0.0}
Trams142;14;2;11023;18:30;{2894.896500002593,514.0241999980062,0.0}
Trams182;18;7;11024;18:30;{6188.119100000709,2954.7112999986857,0.0}
Trams148;14;13;11024;18:30;{5641.738919684285,2786.998382666919,0.0}
Trams141;14;6;11025;18:31;{2839.1857000030577,1180.8036000002176,0.0}
Trams149;14;8;11025;18:31;{4672.309900000691,2395.577299999073,0.0}
Trams145;14;7;11027;18:31;{7477.508000001311,3581.729000000283,0.0}
Trams142;14;3;11035;18:32;{2597.49450000003,904.9190000016242,0.0}
Trams182;18;8;11036;18:32;{5634.466500002891,2784.006800001487,0.0}
Trams149;14;7;11039;18:33;{4031.8555000014603,2128.9623999986798,0.0}
Trams143;14;10;11040;18:33;{2808.1955000013113,1135.889900000766,0.0}
Trams143;14;8;11041;18:33;{2774.94460455129,1095.9101807449765,0.0}
Trams146;14;11;11043;18:34;{6188.119100000709,2954.7112999986857,0.0}
Trams148;14;9;11045;18:34;{4672.309900000691,2395.577299999073,0.0}
Trams183;18;3;11046;18:34;{2589.0274000018835,1538.5219000000507,0.0}
Trams144;14;7;11047;18:34;{7477.508000001311,3581.729000000283,0.0}
Trams143;14;6;11048;18:34;{2567.6414284064917,825.1840510346515,0.0}
Trams182;18;7;11049;18:35;{5010.473492013262,2527.781076226536,0.0}
Trams142;14;4;11056;18:36;{3035.1652000024915,1729.7097000014037,0.0}
Trams183;18;2;11057;18:36;{2064.0685709043055,1320.5282183098925,0.0}
Trams185;18;10;11057;18:36;{4084.1569000035524,2161.088000001386,0.0}
Trams143;14;2;11058;18:36;{2894.896500002593,514.0241999980062,0.0}
Trams145;14;6;11059;18:36;{6138.21238208538,2940.1058384544613,0.0}
Trams148;14;8;11059;18:36;{4031.8555000014603,2128.9623999986798,0.0}
Trams181;18;13;11062;18:37;{7477.508000001311,3581.729000000283,0.0}
Trams146;14;10;11067;18:38;{5058.904000002891,2546.714799998328,0.0}
Trams146;14;9;11068;18:38;{5010.473492013262,2527.781076226536,0.0}
Trams181;18;14;11070;18:38;{7172.43200000003,3532.2607999984175,0.0}
Trams184;18;6;11070;18:38;{2149.2538000009954,1363.784799998626,0.0}
Trams185;18;9;11071;18:38;{4722.0763000026345,2426.624300001189,0.0}
Trams146;14;8;11076;18:39;{4624.179771982149,2375.8925514936154,0.0}
Trams185;18;8;11079;18:40;{5108.905971347362,2577.745680309252,0.0}
Trams185;18;9;11080;18:40;{5123.508700001985,2583.745899999514,0.0}
Trams141;14;5;11083;18:40;{5123.508700001985,2583.745899999514,0.0}
Trams183;18;3;11085;18:41;{845.340600002557,806.1041999999434,0.0}
Trams184;18;7;11089;18:41;{3035.1652000024915,1729.7097000014037,0.0}
Trams144;14;6;11089;18:41;{5641.738919684285,2786.998382666919,0.0}
Trams145;14;5;11090;18:41;{4672.309900000691,2395.577299999073,0.0}
Trams182;18;8;11092;18:42;{2992.747200001031,1703.0900999996811,0.0}
Trams185;18;8;11092;18:42;{5689.812200002372,2815.7713999990374,0.0}
Trams149;14;5;11092;18:42;{2894.896500002593,514.0241999980062,0.0}
Trams185;18;7;11093;18:42;{5739.764803540053,2830.2159521656795,0.0}
Trams148;14;7;11094;18:42;{2808.1955000013113,1135.889900000766,0.0}
Trams148;14;6;11095;18:42;{2774.94460455129,1095.9101807449765,0.0}
Trams182;18;5;11101;18:43;{2589.0274000018835,1538.5219000000507,0.0}
Trams148;14;5;11101;18:43;{2569.3393000029027,869.8653000015765,0.0}
Trams148;14;4;11102;18:43;{2567.6414284064917,825.1840510346515,0.0}
Trams185;18;4;11103;18:44;{6221.943900000304,2968.579499999061,0.0}
Trams144;14;5;11103;18:44;{5010.473492013262,2527.781076226536,0.0}
Trams147;14;3;11109;18:45;{2808.1955000013113,1135.889900000766,0.0}
Trams147;14;2;11110;18:45;{2774.94460455129,1095.9101807449765,0.0}
Trams182;18;2;11111;18:45;{2110.2352000027895,1344.0613000001758,0.0}
Trams182;18;1;11112;18:45;{2064.0685709043055,1320.5282183098925,0.0}
Trams142;14;3;11113;18:45;{5689.812200002372,2815.7713999990374,0.0}
Trams142;14;2;11114;18:45;{5739.764803540053,2830.2159521656795,0.0}
Trams181;18;12;11118;18:46;{5010.473492013262,2527.781076226536,0.0}
Trams184;18;6;11125;18:47;{4722.0763000026345,2426.624300001189,0.0}
Trams183;18;2;11126;18:47;{2675.4015184145933,1580.8842637522473,0.0}
Trams145;14;6;11126;18:47;{2992.747200001031,1703.0900999996811,0.0}
Trams147;14;1;11127;18:48;{2894.896500002593,514.0241999980062,0.0}
Trams146;14;7;11131;18:48;{2569.3393000029027,869.8653000015765,0.0}
Trams146;14;5;11132;18:48;{2567.6414284064917,825.1840510346515,0.0}
Trams185;18;20;11134;18:49;{7477.508000001311,3581.729000000283,0.0}
Trams141;14;24;11137;18:49;{7477.508000001311,3581.729000000283,0.0}
Trams145;14;5;11139;18:50;{2808.1955000013113,1135.889900000766,0.0}
Trams182;18;4;11140;18:50;{845.340600002557,806.1041999999434,0.0}
Trams146;14;6;11141;18:50;{2894.896500002593,514.0241999980062,0.0}
Trams146;14;4;11142;18:50;{2894.896500002593,514.0241999980062,0.0}
Trams148;14;5;11145;18:51;{3035.1652000024915,1729.7097000014037,0.0}
Trams144;14;6;11146;18:51;{2992.747200001031,1703.0900999996811,0.0}
Trams145;14;4;11146;18:51;{2569.3393000029027,869.8653000015765,0.0}
Trams145;14;3;11147;18:51;{2567.6414284064917,825.1840510346515,0.0}
Trams185;18;21;11150;18:51;{6831.853600002825,3315.144899999723,0.0}
Trams142;14;16;11155;18:52;{7477.508000001311,3581.729000000283,0.0}
Trams184;18;5;11157;18:53;{6221.943900000304,2968.579499999061,0.0}
Trams185;18;22;11157;18:53;{6563.806600000709,3123.2601999994367,0.0}
Trams145;14;4;11157;18:53;{2894.896500002593,514.0241999980062,0.0}
Trams147;14;2;11160;18:53;{3035.1652000024915,1729.7097000014037,0.0}
Trams144;14;4;11166;18:54;{2569.3393000029027,869.8653000015765,0.0}
Trams144;14;3;11167;18:54;{2567.6414284064917,825.1840510346515,0.0}
Trams181;18;11;11170;18:55;{2589.0274000018835,1538.5219000000507,0.0}
Trams142;14;17;11171;18:55;{6831.853600002825,3315.144899999723,0.0}
Trams146;14;5;11175;18:56;{3035.1652000024915,1729.7097000014037,0.0}
Trams185;18;20;11176;18:56;{5641.738919684285,2786.998382666919,0.0}
Trams185;18;19;11177;18:56;{5634.466500002891,2784.006800001487,0.0}
Trams181;18;7;11180;18:56;{2110.2352000027895,1344.0613000001758,0.0}
Trams181;18;4;11181;18:57;{2064.0685709043055,1320.5282183098925,0.0}
Trams182;18;3;11181;18:57;{2675.4015184145933,1580.8842637522473,0.0}
Trams148;14;4;11181;18:57;{4722.0763000026345,2426.624300001189,0.0}
Trams147;14;3;11182;18:57;{4084.1569000035524,2161.088000001386,0.0}
Trams142;14;18;11186;18:57;{6188.119100000709,2954.7112999986857,0.0}
Trams142;14;17;11187;18:58;{6138.21238208538,2940.1058384544613,0.0}
Trams184;18;17;11188;18:58;{7477.508000001311,3581.729000000283,0.0}
Trams185;18;14;11189;18:58;{5058.904000002891,2546.714799998328,0.0}
Trams185;18;12;11190;18:58;{5010.473492013262,2527.781076226536,0.0}
Trams143;14;5;11190;18:58;{7477.508000001311,3581.729000000283,0.0}
Trams185;18;11;11197;18:59;{4672.309900000691,2395.577299999073,0.0}
Trams142;14;16;11197;18:59;{5641.738919684285,2786.998382666919,0.0}
Trams185;18;10;11198;18:59;{4624.179771982149,2375.8925514936154,0.0}
Trams142;14;17;11198;18:59;{5634.466500002891,2784.006800001487,0.0}
Trams143;14;6;11198;18:59;{7172.43200000003,3532.2607999984175,0.0}
Trams147;14;2;11204;19:0;{5108.905971347362,2577.745680309252,0.0}
Trams181;18;6;11209;19:1;{845.340600002557,806.1041999999434,0.0}
Trams142;14;16;11210;19:1;{5058.904000002891,2546.714799998328,0.0}
Trams144;14;4;11210;19:1;{3035.1652000024915,1729.7097000014037,0.0}
Trams142;14;15;11211;19:2;{5010.473492013262,2527.781076226536,0.0}
Trams147;14;1;11217;19:3;{5689.812200002372,2815.7713999990374,0.0}
Trams142;14;14;11218;19:3;{4672.309900000691,2395.577299999073,0.0}
Trams146;14;4;11219;19:3;{5108.905971347362,2577.745680309252,0.0}
Trams184;18;15;11220;19:3;{6138.21238208538,2940.1058384544613,0.0}
Trams143;14;7;11221;19:3;{6188.119100000709,2954.7112999986857,0.0}
Trams182;18;1;11225;19:4;{4722.0763000026345,2426.624300001189,0.0}
Trams181;18;8;11231;19:5;{1782.5218000002205,1208.6106000002474,0.0}
Trams184;18;14;11231;19:5;{5634.466500002891,2784.006800001487,0.0}
Trams142;14;13;11232;19:5;{4031.8555000014603,2128.9623999986798,0.0}
Trams145;14;3;11234;19:5;{5108.905971347362,2577.745680309252,0.0}
Trams185;18;9;11242;19:7;{2589.0274000018835,1538.5219000000507,0.0}
Trams184;18;13;11243;19:7;{5058.904000002891,2546.714799998328,0.0}
Trams181;18;7;11249;19:8;{2627.1466000005603,1561.507400000468,0.0}
Trams141;14;21;11249;19:8;{2808.1955000013113,1135.889900000766,0.0}
Trams141;14;20;11250;19:8;{2774.94460455129,1095.9101807449765,0.0}
Trams184;18;10;11251;19:8;{4672.309900000691,2395.577299999073,0.0}
Trams185;18;8;11252;19:8;{2110.2352000027895,1344.0613000001758,0.0}
Trams185;18;6;11253;19:9;{2064.0685709043055,1320.5282183098925,0.0}
Trams141;14;11;11256;19:9;{2569.3393000029027,869.8653000015765,0.0}
Trams141;14;9;11257;19:9;{2567.6414284064917,825.1840510346515,0.0}
Trams185;18;4;11260;19:10;{1740.6504000015557,1186.7970000002533,0.0}
Trams184;18;9;11265;19:11;{4031.8555000014603,2128.9623999986798,0.0}
Trams141;14;6;11267;19:11;{2894.896500002593,514.0241999980062,0.0}
Trams142;14;12;11267;19:11;{2808.1955000013113,1135.889900000766,0.0}
Trams142;14;10;11268;19:11;{2774.94460455129,1095.9101807449765,0.0}
Trams142;14;9;11275;19:12;{2567.6414284064917,825.1840510346515,0.0}
Trams144;14;3;11278;19:13;{6221.943900000304,2968.579499999061,0.0}
Trams142;14;10;11284;19:14;{2894.896500002593,514.0241999980062,0.0}
Trams142;14;3;11285;19:14;{2894.896500002593,514.0241999980062,0.0}
Trams184;18;7;11296;19:16;{2589.0274000018835,1538.5219000000507,0.0}
Trams181;18;6;11302;19:17;{5108.905971347362,2577.745680309252,0.0}
Trams143;14;4;11303;19:17;{2774.94460455129,1095.9101807449765,0.0}
Trams184;18;6;11306;19:17;{2110.2352000027895,1344.0613000001758,0.0}
Trams184;18;5;11307;19:18;{2064.0685709043055,1320.5282183098925,0.0}
Trams143;14;3;11310;19:18;{2567.6414284064917,825.1840510346515,0.0}
Trams181;18;5;11316;19:19;{5739.764803540053,2830.2159521656795,0.0}
Trams143;14;4;11319;19:20;{2894.896500002593,514.0241999980062,0.0}
Trams143;14;3;11320;19:20;{2894.896500002593,514.0241999980062,0.0}
Trams181;18;4;11326;19:21;{6221.943900000304,2968.579499999061,0.0}
Trams149;14;6;11336;19:22;{2808.1955000013113,1135.889900000766,0.0}
Trams183;18;4;11351;19:25;{2110.2352000027895,1344.0613000001758,0.0}
Trams183;18;3;11380;19:30;{845.340600002557,806.1041999999434,0.0}
