tramName;tramLine;nPassengers;cycleNo;time;location
Trams142;14;7;51615;6:2;{2808.1955000013113,1135.889900000766,0.0}
Trams141;14;10;51627;6:4;{2597.49450000003,904.9190000016242,0.0}
Trams149;14;2;51627;6:4;{5058.904000002891,2546.714799998328,0.0}
Trams142;14;8;51633;6:5;{2894.896500002593,514.0241999980062,0.0}
Trams141;14;17;51635;6:6;{2839.1857000030577,1180.8036000002176,0.0}
Trams142;14;10;51645;6:7;{2597.49450000003,904.9190000016242,0.0}
Trams181;18;9;51646;6:8;{1782.5218000002205,1208.6106000002474,0.0}
Trams149;14;3;51649;6:8;{4031.8555000014603,2128.9623999986798,0.0}
Trams181;18;14;51654;6:9;{2149.2538000009954,1363.784799998626,0.0}
Trams144;14;1;51656;6:9;{7477.508000001311,3581.729000000283,0.0}
Trams147;14;3;51662;6:10;{5058.904000002891,2546.714799998328,0.0}
Trams181;18;15;51664;6:11;{2627.1466000005603,1561.507400000468,0.0}
Trams143;14;14;51668;6:11;{2894.896500002593,514.0241999980062,0.0}
Trams149;14;2;51671;6:12;{2992.747200001031,1703.0900999996811,0.0}
Trams181;18;14;51673;6:12;{3035.1652000024915,1729.7097000014037,0.0}
Trams143;14;19;51680;6:13;{2597.49450000003,904.9190000016242,0.0}
Trams147;14;2;51683;6:14;{4048.297289360261,2135.7927898531034,0.0}
Trams141;14;24;51684;6:14;{4722.0763000026345,2426.624300001189,0.0}
Trams143;14;24;51688;6:15;{2839.1857000030577,1180.8036000002176,0.0}
Trams1410;14;2;51688;6:15;{2839.1857000030577,1180.8036000002176,0.0}
Trams183;18;4;51691;6:15;{2589.0274000018835,1538.5219000000507,0.0}
Trams142;14;11;51702;6:17;{4722.0763000026345,2426.624300001189,0.0}
Trams143;14;23;51702;6:17;{3084.0353342962862,1747.4296273253601,0.0}
Trams149;14;3;51702;6:17;{2894.896500002593,514.0241999980062,0.0}
Trams181;18;13;51708;6:18;{4707.823850244834,2420.7529164061234,0.0}
Trams183;18;6;51709;6:18;{1740.6504000015557,1186.7970000002533,0.0}
Trams182;18;10;51711;6:18;{5634.466500002891,2784.006800001487,0.0}
Trams142;14;16;51711;6:18;{5123.508700001985,2583.745899999514,0.0}
Trams149;14;8;51714;6:19;{2597.49450000003,904.9190000016242,0.0}
Trams181;18;14;51718;6:20;{5123.508700001985,2583.745899999514,0.0}
Trams148;14;6;51722;6:20;{2894.896500002593,514.0241999980062,0.0}
Trams149;14;9;51722;6:20;{2839.1857000030577,1180.8036000002176,0.0}
Trams182;18;12;51723;6:20;{5058.904000002891,2546.714799998328,0.0}
Trams142;14;22;51723;6:20;{5689.812200002372,2815.7713999990374,0.0}
Trams143;14;22;51723;6:20;{4084.1569000035524,2161.088000001386,0.0}
Trams183;18;2;51730;6:22;{845.340600002557,806.1041999999434,0.0}
Trams148;14;7;51734;6:22;{2597.49450000003,904.9190000016242,0.0}
Trams143;14;21;51736;6:23;{4707.823850244834,2420.7529164061234,0.0}
Trams149;14;8;51736;6:23;{3084.0353342962862,1747.4296273253601,0.0}
Trams143;14;22;51737;6:23;{4722.0763000026345,2426.624300001189,0.0}
Trams147;14;5;51737;6:23;{2894.896500002593,514.0241999980062,0.0}
Trams148;14;8;51742;6:24;{2839.1857000030577,1180.8036000002176,0.0}
Trams141;14;7;51746;6:24;{7477.508000001311,3581.729000000283,0.0}
Trams143;14;24;51746;6:24;{5123.508700001985,2583.745899999514,0.0}
Trams1410;14;4;51746;6:24;{5123.508700001985,2583.745899999514,0.0}
Trams141;14;6;51747;6:24;{7477.508000001311,3581.729000000283,0.0}
Trams147;14;7;51749;6:25;{2597.49450000003,904.9190000016242,0.0}
Trams183;18;8;51752;6:25;{1782.5218000002205,1208.6106000002474,0.0}
Trams146;14;8;51752;6:25;{2894.896500002593,514.0241999980062,0.0}
Trams147;14;8;51757;6:26;{2839.1857000030577,1180.8036000002176,0.0}
Trams1410;14;5;51758;6:26;{5689.812200002372,2815.7713999990374,0.0}
Trams183;18;14;51760;6:27;{2149.2538000009954,1363.784799998626,0.0}
Trams142;14;6;51764;6:27;{7477.508000001311,3581.729000000283,0.0}
Trams1410;14;6;51769;6:28;{6221.943900000304,2968.579499999061,0.0}
Trams183;18;15;51770;6:28;{2627.1466000005603,1561.507400000468,0.0}
Trams181;18;7;51771;6:28;{7477.508000001311,3581.729000000283,0.0}
Trams149;14;10;51771;6:28;{4722.0763000026345,2426.624300001189,0.0}
Trams181;18;5;51772;6:29;{7477.508000001311,3581.729000000283,0.0}
Trams182;18;14;51776;6:29;{2589.0274000018835,1538.5219000000507,0.0}
Trams183;18;14;51779;6:30;{3035.1652000024915,1729.7097000014037,0.0}
Trams145;14;8;51779;6:30;{2597.49450000003,904.9190000016242,0.0}
Trams143;14;22;51784;6:31;{6864.837443928478,3341.6995773341046,0.0}
Trams145;14;9;51787;6:31;{2839.1857000030577,1180.8036000002176,0.0}
Trams149;14;12;51792;6:32;{5689.812200002372,2815.7713999990374,0.0}
Trams143;14;21;51793;6:32;{7223.311400000006,3570.043500000611,0.0}
Trams182;18;13;51794;6:32;{1740.6504000015557,1186.7970000002533,0.0}
Trams182;18;12;51795;6:32;{1692.722305299079,1166.6255241828771,0.0}
Trams143;14;13;51799;6:33;{7477.508000001311,3581.729000000283,0.0}
Trams144;14;2;51799;6:33;{2597.49450000003,904.9190000016242,0.0}
Trams1410;14;1;51799;6:33;{7477.508000001311,3581.729000000283,0.0}
Trams143;14;12;51800;6:33;{7477.508000001311,3581.729000000283,0.0}
Trams183;18;15;51801;6:33;{4084.1569000035524,2161.088000001386,0.0}
Trams143;14;11;51802;6:34;{7399.735580409566,3546.353579350148,0.0}
Trams149;14;14;51803;6:34;{6221.943900000304,2968.579499999061,0.0}
Trams144;14;4;51807;6:34;{2839.1857000030577,1180.8036000002176,0.0}
Trams141;14;7;51810;6:35;{4672.309900000691,2395.577299999073,0.0}
Trams148;14;9;51812;6:35;{5689.812200002372,2815.7713999990374,0.0}
Trams182;18;11;51813;6:35;{874.5067790792331,818.4381949221134,0.0}
Trams181;18;8;51815;6:36;{5634.466500002891,2784.006800001487,0.0}
Trams182;18;7;51815;6:36;{845.340600002557,806.1041999999434,0.0}
Trams183;18;16;51815;6:36;{4722.0763000026345,2426.624300001189,0.0}
Trams147;14;9;51815;6:36;{5123.508700001985,2583.745899999514,0.0}
Trams142;14;7;51820;6:37;{5058.904000002891,2546.714799998328,0.0}
Trams148;14;11;51823;6:37;{6221.943900000304,2968.579499999061,0.0}
Trams183;18;17;51824;6:37;{5123.508700001985,2583.745899999514,0.0}
Trams141;14;6;51824;6:37;{4031.8555000014603,2128.9623999986798,0.0}
Trams181;18;10;51827;6:38;{5058.904000002891,2546.714799998328,0.0}
Trams146;14;9;51830;6:38;{5123.508700001985,2583.745899999514,0.0}
Trams149;14;2;51833;6:39;{7477.508000001311,3581.729000000283,0.0}
Trams149;14;1;51834;6:39;{7477.508000001311,3581.729000000283,0.0}
Trams145;14;10;51836;6:39;{4722.0763000026345,2426.624300001189,0.0}
Trams182;18;8;51837;6:39;{1782.5218000002205,1208.6106000002474,0.0}
Trams142;14;6;51842;6:40;{4031.8555000014603,2128.9623999986798,0.0}
Trams144;14;5;51842;6:40;{4084.1569000035524,2161.088000001386,0.0}
Trams146;14;11;51842;6:40;{5689.812200002372,2815.7713999990374,0.0}
Trams143;14;12;51843;6:40;{5634.466500002891,2784.006800001487,0.0}
Trams182;18;10;51845;6:41;{2149.2538000009954,1363.784799998626,0.0}
Trams148;14;4;51853;6:42;{7477.508000001311,3581.729000000283,0.0}
Trams182;18;13;51855;6:42;{2627.1466000005603,1561.507400000468,0.0}
Trams143;14;13;51855;6:42;{5058.904000002891,2546.714799998328,0.0}
Trams144;14;6;51856;6:43;{4722.0763000026345,2426.624300001189,0.0}
Trams145;14;11;51857;6:43;{5689.812200002372,2815.7713999990374,0.0}
Trams144;14;7;51865;6:44;{5123.508700001985,2583.745899999514,0.0}
Trams147;14;3;51868;6:45;{7477.508000001311,3581.729000000283,0.0}
Trams147;14;2;51869;6:45;{7477.508000001311,3581.729000000283,0.0}
Trams183;18;16;51872;6:45;{7267.007879060962,3598.2324644667874,0.0}
Trams183;18;3;51877;6:46;{7477.508000001311,3581.729000000283,0.0}
Trams141;14;14;51877;6:46;{2894.896500002593,514.0241999980062,0.0}
Trams143;14;14;51877;6:46;{4031.8555000014603,2128.9623999986798,0.0}
Trams183;18;2;51878;6:46;{7477.508000001311,3581.729000000283,0.0}
Trams144;14;6;51878;6:46;{5739.764803540053,2830.2159521656795,0.0}
Trams181;18;9;51880;6:47;{2589.0274000018835,1538.5219000000507,0.0}
Trams146;14;5;51883;6:47;{7477.508000001311,3581.729000000283,0.0}
Trams146;14;4;51884;6:47;{7477.508000001311,3581.729000000283,0.0}
Trams144;14;8;51888;6:48;{6221.943900000304,2968.579499999061,0.0}
Trams141;14;24;51889;6:48;{2597.49450000003,904.9190000016242,0.0}
Trams142;14;7;51895;6:49;{2894.896500002593,514.0241999980062,0.0}
Trams145;14;5;51898;6:50;{7477.508000001311,3581.729000000283,0.0}
Trams143;14;12;51899;6:50;{2992.747200001031,1703.0900999996811,0.0}
Trams182;18;17;51900;6:50;{4722.0763000026345,2426.624300001189,0.0}
Trams143;14;11;51900;6:50;{2952.0448504139104,1673.1693294131398,0.0}
Trams142;14;10;51907;6:51;{2597.49450000003,904.9190000016242,0.0}
Trams182;18;21;51909;6:51;{5123.508700001985,2583.745899999514,0.0}
Trams142;14;18;51915;6:52;{2839.1857000030577,1180.8036000002176,0.0}
Trams181;18;8;51917;6:53;{874.5067790792331,818.4381949221134,0.0}
Trams181;18;9;51918;6:53;{845.340600002557,806.1041999999434,0.0}
Trams144;14;2;51918;6:53;{7477.508000001311,3581.729000000283,0.0}
Trams181;18;5;51919;6:53;{845.340600002557,806.1041999999434,0.0}
Trams182;18;22;51921;6:53;{5689.812200002372,2815.7713999990374,0.0}
Trams183;18;3;51921;6:53;{5634.466500002891,2784.006800001487,0.0}
Trams147;14;3;51924;6:54;{5058.904000002891,2546.714799998328,0.0}
Trams143;14;12;51930;6:55;{2894.896500002593,514.0241999980062,0.0}
Trams181;18;10;51941;6:57;{1782.5218000002205,1208.6106000002474,0.0}
Trams183;18;5;51941;6:57;{4672.309900000691,2395.577299999073,0.0}
Trams143;14;17;51942;6:57;{2597.49450000003,904.9190000016242,0.0}
Trams182;18;21;51947;6:58;{6864.837443928478,3341.6995773341046,0.0}
Trams182;18;19;51948;6:58;{6883.719200000167,3354.242599999532,0.0}
Trams181;18;13;51949;6:58;{2149.2538000009954,1363.784799998626,0.0}
Trams142;14;17;51950;6:58;{4084.1569000035524,2161.088000001386,0.0}
Trams143;14;19;51950;6:58;{2839.1857000030577,1180.8036000002176,0.0}
Trams182;18;18;51957;6:59;{7267.007879060962,3598.2324644667874,0.0}
Trams181;18;15;51959;7:0;{2627.1466000005603,1561.507400000468,0.0}
Trams146;14;3;51960;7:0;{4048.297289360261,2135.7927898531034,0.0}
Trams182;18;5;51962;7:0;{7477.508000001311,3581.729000000283,0.0}
Trams182;18;4;51963;7:0;{7477.508000001311,3581.729000000283,0.0}
Trams142;14;24;51964;7:1;{4722.0763000026345,2426.624300001189,0.0}
Trams149;14;5;51964;7:1;{2894.896500002593,514.0241999980062,0.0}
Trams1411;14;2;51964;7:1;{4722.0763000026345,2426.624300001189,0.0}
Trams141;14;23;51968;7:1;{5739.764803540053,2830.2159521656795,0.0}
Trams147;14;2;51968;7:1;{2992.747200001031,1703.0900999996811,0.0}
Trams1411;14;6;51973;7:2;{5123.508700001985,2583.745899999514,0.0}
Trams145;14;4;51975;7:2;{4048.297289360261,2135.7927898531034,0.0}
Trams149;14;9;51976;7:3;{2597.49450000003,904.9190000016242,0.0}
Trams141;14;24;51978;7:3;{6221.943900000304,2968.579499999061,0.0}
Trams148;14;8;51984;7:4;{2894.896500002593,514.0241999980062,0.0}
Trams149;14;13;51984;7:4;{2839.1857000030577,1180.8036000002176,0.0}
Trams1411;14;9;51985;7:4;{5689.812200002372,2815.7713999990374,0.0}
Trams141;14;23;51993;7:5;{6864.837443928478,3341.6995773341046,0.0}
Trams148;14;9;51996;7:6;{2597.49450000003,904.9190000016242,0.0}
Trams1411;14;10;51996;7:6;{6221.943900000304,2968.579499999061,0.0}
Trams183;18;4;51997;7:6;{2064.0685709043055,1320.5282183098925,0.0}
Trams149;14;14;51997;7:6;{3035.1652000024915,1729.7097000014037,0.0}
Trams143;14;21;51999;7:6;{4722.0763000026345,2426.624300001189,0.0}
Trams147;14;3;51999;7:6;{2894.896500002593,514.0241999980062,0.0}
Trams181;18;16;52004;7:7;{4722.0763000026345,2426.624300001189,0.0}
Trams148;14;11;52004;7:7;{2839.1857000030577,1180.8036000002176,0.0}
Trams182;18;5;52006;7:8;{5634.466500002891,2784.006800001487,0.0}
Trams141;14;10;52008;7:8;{7477.508000001311,3581.729000000283,0.0}
Trams143;14;24;52008;7:8;{5123.508700001985,2583.745899999514,0.0}
Trams141;14;8;52009;7:8;{7477.508000001311,3581.729000000283,0.0}
Trams147;14;4;52011;7:8;{2597.49450000003,904.9190000016242,0.0}
Trams1411;14;8;52011;7:8;{6864.837443928478,3341.6995773341046,0.0}
Trams181;18;15;52012;7:9;{5108.905971347362,2577.745680309252,0.0}
Trams146;14;5;52014;7:9;{2894.896500002593,514.0241999980062,0.0}
Trams147;14;10;52019;7:10;{2839.1857000030577,1180.8036000002176,0.0}
Trams149;14;13;52019;7:10;{4084.1569000035524,2161.088000001386,0.0}
Trams142;14;23;52020;7:10;{7223.311400000006,3570.043500000611,0.0}
Trams1410;14;2;52020;7:10;{5689.812200002372,2815.7713999990374,0.0}
Trams183;18;3;52023;7:10;{874.5067790792331,818.4381949221134,0.0}
Trams183;18;4;52024;7:11;{845.340600002557,806.1041999999434,0.0}
Trams182;18;6;52026;7:11;{4672.309900000691,2395.577299999073,0.0}
Trams142;14;9;52026;7:11;{7477.508000001311,3581.729000000283,0.0}
Trams146;14;8;52026;7:11;{2597.49450000003,904.9190000016242,0.0}
Trams1411;14;1;52026;7:11;{7477.508000001311,3581.729000000283,0.0}
Trams142;14;5;52027;7:11;{7477.508000001311,3581.729000000283,0.0}
Trams145;14;6;52029;7:11;{2894.896500002593,514.0241999980062,0.0}
Trams1410;14;3;52031;7:12;{6221.943900000304,2968.579499999061,0.0}
Trams149;14;19;52033;7:12;{4722.0763000026345,2426.624300001189,0.0}
Trams146;14;9;52034;7:12;{2839.1857000030577,1180.8036000002176,0.0}
Trams148;14;13;52039;7:13;{4084.1569000035524,2161.088000001386,0.0}
Trams182;18;7;52040;7:13;{4031.8555000014603,2128.9623999986798,0.0}
Trams145;14;9;52041;7:13;{2597.49450000003,904.9190000016242,0.0}
Trams149;14;22;52042;7:14;{5123.508700001985,2583.745899999514,0.0}
Trams183;18;6;52047;7:14;{1782.5218000002205,1208.6106000002474,0.0}
Trams146;14;10;52047;7:14;{3035.1652000024915,1729.7097000014037,0.0}
Trams144;14;3;52049;7:15;{2894.896500002593,514.0241999980062,0.0}
Trams145;14;10;52049;7:15;{2839.1857000030577,1180.8036000002176,0.0}
Trams141;14;9;52052;7:15;{5634.466500002891,2784.006800001487,0.0}
Trams148;14;18;52053;7:15;{4722.0763000026345,2426.624300001189,0.0}
Trams149;14;23;52054;7:16;{5689.812200002372,2815.7713999990374,0.0}
Trams183;18;22;52055;7:16;{2149.2538000009954,1363.784799998626,0.0}
Trams149;14;22;52055;7:16;{5739.764803540053,2830.2159521656795,0.0}
Trams143;14;10;52061;7:17;{7477.508000001311,3581.729000000283,0.0}
Trams144;14;7;52061;7:17;{2597.49450000003,904.9190000016242,0.0}
Trams1410;14;1;52061;7:17;{7477.508000001311,3581.729000000283,0.0}
Trams182;18;6;52062;7:17;{2992.747200001031,1703.0900999996811,0.0}
Trams148;14;20;52062;7:17;{5123.508700001985,2583.745899999514,0.0}
Trams182;18;5;52063;7:17;{2942.963136644313,1688.2069726773154,0.0}
Trams183;18;24;52065;7:17;{2627.1466000005603,1561.507400000468,0.0}
Trams181;18;4;52066;7:18;{7477.508000001311,3581.729000000283,0.0}
Trams147;14;13;52068;7:18;{4722.0763000026345,2426.624300001189,0.0}
Trams144;14;10;52069;7:18;{2839.1857000030577,1180.8036000002176,0.0}
Trams141;14;11;52072;7:19;{4672.309900000691,2395.577299999073,0.0}
Trams148;14;24;52074;7:19;{5689.812200002372,2815.7713999990374,0.0}
Trams147;14;12;52077;7:19;{5123.508700001985,2583.745899999514,0.0}
Trams182;18;6;52081;7:20;{2110.2352000027895,1344.0613000001758,0.0}
Trams146;14;15;52083;7:20;{4722.0763000026345,2426.624300001189,0.0}
Trams145;14;9;52084;7:21;{4084.1569000035524,2161.088000001386,0.0}
Trams147;14;13;52089;7:21;{5689.812200002372,2815.7713999990374,0.0}
Trams182;18;5;52090;7:22;{1692.722305299079,1166.6255241828771,0.0}
Trams149;14;21;52090;7:22;{7267.007879060962,3598.2324644667874,0.0}
Trams146;14;17;52092;7:22;{5123.508700001985,2583.745899999514,0.0}
Trams143;14;11;52093;7:22;{6188.119100000709,2954.7112999986857,0.0}
Trams149;14;2;52095;7:22;{7477.508000001311,3581.729000000283,0.0}
Trams183;18;23;52096;7:23;{4084.1569000035524,2161.088000001386,0.0}
Trams149;14;1;52096;7:23;{7477.508000001311,3581.729000000283,0.0}
Trams145;14;11;52098;7:23;{4722.0763000026345,2426.624300001189,0.0}
Trams147;14;15;52100;7:23;{6221.943900000304,2968.579499999061,0.0}
Trams147;14;14;52101;7:23;{6271.932036142039,2982.903802087056,0.0}
Trams148;14;23;52101;7:23;{6883.719200000167,3354.242599999532,0.0}
Trams146;14;18;52104;7:24;{5689.812200002372,2815.7713999990374,0.0}
Trams181;18;7;52110;7:25;{5634.466500002891,2784.006800001487,0.0}
Trams148;14;3;52115;7:26;{7477.508000001311,3581.729000000283,0.0}
Trams143;14;12;52117;7:26;{5058.904000002891,2546.714799998328,0.0}
Trams144;14;11;52118;7:26;{4722.0763000026345,2426.624300001189,0.0}
Trams183;18;24;52119;7:26;{5123.508700001985,2583.745899999514,0.0}
Trams181;18;8;52122;7:27;{5058.904000002891,2546.714799998328,0.0}
Trams141;14;10;52122;7:27;{2774.94460455129,1095.9101807449765,0.0}
Trams147;14;13;52125;7:27;{7267.007879060962,3598.2324644667874,0.0}
Trams144;14;15;52127;7:28;{5123.508700001985,2583.745899999514,0.0}
Trams141;14;9;52129;7:28;{2567.6414284064917,825.1840510346515,0.0}
Trams181;18;9;52130;7:28;{4672.309900000691,2395.577299999073,0.0}
Trams147;14;1;52130;7:28;{7477.508000001311,3581.729000000283,0.0}
Trams182;18;13;52132;7:29;{1782.5218000002205,1208.6106000002474,0.0}
Trams141;14;21;52139;7:30;{2894.896500002593,514.0241999980062,0.0}
Trams144;14;16;52139;7:30;{5689.812200002372,2815.7713999990374,0.0}
Trams182;18;20;52140;7:30;{2149.2538000009954,1363.784799998626,0.0}
Trams183;18;23;52143;7:30;{6271.932036142039,2982.903802087056,0.0}
Trams146;14;4;52145;7:31;{7477.508000001311,3581.729000000283,0.0}
Trams182;18;24;52150;7:32;{2627.1466000005603,1561.507400000468,0.0}
Trams144;14;17;52150;7:32;{6221.943900000304,2968.579499999061,0.0}
Trams141;14;24;52151;7:32;{2597.49450000003,904.9190000016242,0.0}
Trams183;18;22;52157;7:33;{6864.837443928478,3341.6995773341046,0.0}
Trams142;14;8;52157;7:33;{2894.896500002593,514.0241999980062,0.0}
Trams149;14;2;52159;7:33;{4672.309900000691,2395.577299999073,0.0}
Trams145;14;4;52160;7:33;{7477.508000001311,3581.729000000283,0.0}
Trams144;14;16;52165;7:34;{6864.837443928478,3341.6995773341046,0.0}
Trams183;18;21;52166;7:34;{7223.311400000006,3570.043500000611,0.0}
Trams142;14;24;52169;7:35;{2597.49450000003,904.9190000016242,0.0}
Trams183;18;5;52172;7:35;{7477.508000001311,3581.729000000283,0.0}
Trams183;18;4;52173;7:35;{7477.508000001311,3581.729000000283,0.0}
Trams149;14;1;52173;7:35;{4031.8555000014603,2128.9623999986798,0.0}
Trams143;14;11;52174;7:36;{2808.1955000013113,1135.889900000766,0.0}
Trams144;14;15;52175;7:36;{7267.007879060962,3598.2324644667874,0.0}
Trams1411;14;13;52177;7:36;{2839.1857000030577,1180.8036000002176,0.0}
Trams144;14;3;52180;7:37;{7477.508000001311,3581.729000000283,0.0}
Trams144;14;2;52181;7:37;{7477.508000001311,3581.729000000283,0.0}
Trams1411;14;14;52190;7:38;{3035.1652000024915,1729.7097000014037,0.0}
Trams142;14;23;52191;7:38;{3084.0353342962862,1747.4296273253601,0.0}
Trams1411;14;13;52191;7:38;{3084.0353342962862,1747.4296273253601,0.0}
Trams143;14;15;52192;7:39;{2894.896500002593,514.0241999980062,0.0}
Trams181;18;11;52193;7:39;{1740.6504000015557,1186.7970000002533,0.0}
Trams181;18;9;52194;7:39;{1692.722305299079,1166.6255241828771,0.0}
Trams143;14;24;52204;7:41;{2597.49450000003,904.9190000016242,0.0}
Trams1410;14;2;52204;7:41;{2597.49450000003,904.9190000016242,0.0}
Trams181;18;8;52205;7:41;{1208.916700001806,962.1525999996811,0.0}
Trams142;14;24;52212;7:42;{4084.1569000035524,2161.088000001386,0.0}
Trams1410;14;5;52212;7:42;{2839.1857000030577,1180.8036000002176,0.0}
Trams1411;14;14;52212;7:42;{4084.1569000035524,2161.088000001386,0.0}
Trams181;18;7;52214;7:42;{845.340600002557,806.1041999999434,0.0}
Trams183;18;5;52216;7:43;{5634.466500002891,2784.006800001487,0.0}
Trams182;18;23;52217;7:43;{5739.764803540053,2830.2159521656795,0.0}
Trams181;18;8;52224;7:44;{1241.924200002104,980.4126999992877,0.0}
Trams143;14;23;52226;7:44;{3084.0353342962862,1747.4296273253601,0.0}
Trams149;14;3;52226;7:44;{2894.896500002593,514.0241999980062,0.0}
Trams1411;14;24;52226;7:44;{4722.0763000026345,2426.624300001189,0.0}
Trams182;18;24;52227;7:44;{6221.943900000304,2968.579499999061,0.0}
Trams183;18;7;52228;7:45;{5058.904000002891,2546.714799998328,0.0}
Trams182;18;23;52235;7:46;{6593.146138654794,3149.575753243163,0.0}
Trams181;18;18;52236;7:46;{1782.5218000002205,1208.6106000002474,0.0}
Trams183;18;9;52236;7:46;{4672.309900000691,2395.577299999073,0.0}
Trams149;14;5;52238;7:46;{2597.49450000003,904.9190000016242,0.0}
Trams182;18;22;52242;7:47;{6864.837443928478,3341.6995773341046,0.0}
Trams182;18;21;52243;7:47;{6883.719200000167,3354.242599999532,0.0}
Trams181;18;24;52244;7:47;{2149.2538000009954,1363.784799998626,0.0}
Trams148;14;9;52246;7:48;{2894.896500002593,514.0241999980062,0.0}
Trams149;14;9;52246;7:48;{2839.1857000030577,1180.8036000002176,0.0}
Trams143;14;24;52247;7:48;{4084.1569000035524,2161.088000001386,0.0}
Trams183;18;10;52250;7:48;{4031.8555000014603,2128.9623999986798,0.0}
Trams182;18;4;52257;7:49;{7477.508000001311,3581.729000000283,0.0}
Trams148;14;13;52258;7:50;{2597.49450000003,904.9190000016242,0.0}
Trams147;14;3;52261;7:50;{2894.896500002593,514.0241999980062,0.0}
Trams1410;14;12;52261;7:50;{4722.0763000026345,2426.624300001189,0.0}
Trams181;18;23;52263;7:50;{3035.1652000024915,1729.7097000014037,0.0}
Trams148;14;17;52266;7:51;{2839.1857000030577,1180.8036000002176,0.0}
Trams141;14;6;52270;7:52;{7477.508000001311,3581.729000000283,0.0}
Trams1410;14;24;52270;7:52;{5123.508700001985,2583.745899999514,0.0}
Trams183;18;11;52272;7:52;{2992.747200001031,1703.0900999996811,0.0}
Trams147;14;5;52273;7:52;{2597.49450000003,904.9190000016242,0.0}
Trams146;14;7;52276;7:53;{2894.896500002593,514.0241999980062,0.0}
Trams147;14;8;52281;7:53;{2839.1857000030577,1180.8036000002176,0.0}
Trams142;14;23;52283;7:54;{7267.007879060962,3598.2324644667874,0.0}
Trams181;18;21;52285;7:54;{4084.1569000035524,2161.088000001386,0.0}
Trams181;18;20;52286;7:54;{4132.967545312427,2178.980077572535,0.0}
Trams142;14;3;52288;7:55;{7477.508000001311,3581.729000000283,0.0}
Trams146;14;9;52288;7:55;{2597.49450000003,904.9190000016242,0.0}
Trams1411;14;3;52288;7:55;{7477.508000001311,3581.729000000283,0.0}
Trams1411;14;1;52289;7:55;{7477.508000001311,3581.729000000283,0.0}
Trams183;18;12;52291;7:55;{2110.2352000027895,1344.0613000001758,0.0}
Trams145;14;11;52291;7:55;{2894.896500002593,514.0241999980062,0.0}
Trams149;14;15;52295;7:56;{4722.0763000026345,2426.624300001189,0.0}
Trams146;14;15;52296;7:56;{2839.1857000030577,1180.8036000002176,0.0}
Trams183;18;10;52299;7:56;{1740.6504000015557,1186.7970000002533,0.0}
Trams183;18;9;52300;7:57;{1692.722305299079,1166.6255241828771,0.0}
Trams182;18;5;52301;7:57;{5634.466500002891,2784.006800001487,0.0}
Trams148;14;18;52301;7:57;{4084.1569000035524,2161.088000001386,0.0}
Trams145;14;14;52303;7:57;{2597.49450000003,904.9190000016242,0.0}
Trams149;14;23;52304;7:57;{5123.508700001985,2583.745899999514,0.0}
Trams181;18;22;52308;7:58;{5123.508700001985,2583.745899999514,0.0}
Trams143;14;23;52308;7:58;{6864.837443928478,3341.6995773341046,0.0}
Trams144;14;5;52311;7:58;{2894.896500002593,514.0241999980062,0.0}
Trams145;14;18;52311;7:58;{2839.1857000030577,1180.8036000002176,0.0}
Trams144;14;6;52312;7:59;{2892.683600001037,511.3241000007838,0.0}
Trams182;18;10;52313;7:59;{5058.904000002891,2546.714799998328,0.0}
Trams148;14;21;52315;7:59;{4722.0763000026345,2426.624300001189,0.0}
Trams149;14;24;52316;7:59;{5689.812200002372,2815.7713999990374,0.0}
Trams183;18;8;52318;8:0;{874.5067790792331,818.4381949221134,0.0}
Trams181;18;24;52320;8:0;{5689.812200002372,2815.7713999990374,0.0}
Trams183;18;5;52320;8:0;{845.340600002557,806.1041999999434,0.0}
Trams181;18;23;52321;8:0;{5739.764803540053,2830.2159521656795,0.0}
Trams143;14;7;52323;8:0;{7477.508000001311,3581.729000000283,0.0}
Trams144;14;7;52323;8:0;{2597.49450000003,904.9190000016242,0.0}
Trams1410;14;1;52323;8:0;{7477.508000001311,3581.729000000283,0.0}
Trams143;14;6;52324;8:1;{7477.508000001311,3581.729000000283,0.0}
Trams148;14;23;52324;8:1;{5123.508700001985,2583.745899999514,0.0}
Trams147;14;9;52330;8:2;{4722.0763000026345,2426.624300001189,0.0}
Trams181;18;24;52331;8:2;{6221.943900000304,2968.579499999061,0.0}
Trams144;14;12;52331;8:2;{2839.1857000030577,1180.8036000002176,0.0}
Trams146;14;16;52331;8:2;{4084.1569000035524,2161.088000001386,0.0}
Trams181;18;23;52332;8:2;{6271.932036142039,2982.903802087056,0.0}
Trams182;18;9;52334;8:2;{4048.297289360261,2135.7927898531034,0.0}
Trams182;18;10;52335;8:2;{4031.8555000014603,2128.9623999986798,0.0}
Trams148;14;24;52336;8:3;{5689.812200002372,2815.7713999990374,0.0}
Trams147;14;8;52338;8:3;{5108.905971347362,2577.745680309252,0.0}
Trams147;14;10;52339;8:3;{5123.508700001985,2583.745899999514,0.0}
Trams183;18;14;52342;8:4;{1782.5218000002205,1208.6106000002474,0.0}
Trams146;14;19;52345;8:4;{4722.0763000026345,2426.624300001189,0.0}
Trams145;14;19;52346;8:4;{4084.1569000035524,2161.088000001386,0.0}
Trams183;18;24;52350;8:5;{2149.2538000009954,1363.784799998626,0.0}
Trams147;14;23;52351;8:5;{5689.812200002372,2815.7713999990374,0.0}
Trams149;14;2;52357;8:6;{7477.508000001311,3581.729000000283,0.0}
Trams182;18;8;52358;8:6;{2942.963136644313,1688.2069726773154,0.0}
Trams149;14;1;52358;8:6;{7477.508000001311,3581.729000000283,0.0}
Trams145;14;21;52360;8:7;{4722.0763000026345,2426.624300001189,0.0}
Trams181;18;4;52361;8:7;{7477.508000001311,3581.729000000283,0.0}
Trams147;14;24;52362;8:7;{6221.943900000304,2968.579499999061,0.0}
Trams148;14;23;52363;8:7;{6883.719200000167,3354.242599999532,0.0}
Trams143;14;7;52367;8:8;{5634.466500002891,2784.006800001487,0.0}
Trams183;18;23;52369;8:8;{3035.1652000024915,1729.7097000014037,0.0}
Trams146;14;20;52377;8:9;{6221.943900000304,2968.579499999061,0.0}
Trams148;14;3;52377;8:9;{7477.508000001311,3581.729000000283,0.0}
Trams148;14;2;52378;8:10;{7477.508000001311,3581.729000000283,0.0}
Trams144;14;13;52380;8:10;{4722.0763000026345,2426.624300001189,0.0}
Trams144;14;14;52389;8:11;{5123.508700001985,2583.745899999514,0.0}
Trams183;18;24;52391;8:12;{4084.1569000035524,2161.088000001386,0.0}
Trams147;14;2;52392;8:12;{7477.508000001311,3581.729000000283,0.0}
Trams181;18;6;52393;8:12;{6188.119100000709,2954.7112999986857,0.0}
Trams143;14;6;52400;8:13;{4048.297289360261,2135.7927898531034,0.0}
Trams141;14;13;52401;8:13;{2894.896500002593,514.0241999980062,0.0}
Trams144;14;15;52401;8:13;{5689.812200002372,2815.7713999990374,0.0}
Trams149;14;2;52401;8:13;{5634.466500002891,2784.006800001487,0.0}
Trams146;14;19;52402;8:14;{7267.007879060962,3598.2324644667874,0.0}
Trams182;18;7;52403;8:14;{874.5067790792331,818.4381949221134,0.0}
Trams181;18;7;52405;8:14;{5634.466500002891,2784.006800001487,0.0}
Trams182;18;4;52405;8:14;{845.340600002557,806.1041999999434,0.0}
Trams146;14;3;52407;8:14;{7477.508000001311,3581.729000000283,0.0}
Trams144;14;17;52412;8:15;{6221.943900000304,2968.579499999061,0.0}
Trams141;14;23;52413;8:15;{2597.49450000003,904.9190000016242,0.0}
Trams145;14;22;52416;8:16;{7223.311400000006,3570.043500000611,0.0}
Trams181;18;9;52417;8:16;{5058.904000002891,2546.714799998328,0.0}
Trams142;14;4;52419;8:16;{2894.896500002593,514.0241999980062,0.0}
Trams144;14;16;52420;8:17;{6593.146138654794,3149.575753243163,0.0}
Trams141;14;24;52421;8:17;{2839.1857000030577,1180.8036000002176,0.0}
Trams145;14;7;52422;8:17;{7477.508000001311,3581.729000000283,0.0}
Trams145;14;5;52423;8:17;{7477.508000001311,3581.729000000283,0.0}
Trams181;18;11;52425;8:17;{4672.309900000691,2395.577299999073,0.0}
Trams182;18;6;52427;8:18;{1782.5218000002205,1208.6106000002474,0.0}
Trams182;18;14;52435;8:19;{2149.2538000009954,1363.784799998626,0.0}
Trams141;14;23;52435;8:19;{3084.0353342962862,1747.4296273253601,0.0}
Trams142;14;7;52439;8:20;{2839.1857000030577,1180.8036000002176,0.0}
Trams144;14;3;52442;8:20;{7477.508000001311,3581.729000000283,0.0}
Trams144;14;2;52443;8:20;{7477.508000001311,3581.729000000283,0.0}
Trams182;18;24;52445;8:21;{2627.1466000005603,1561.507400000468,0.0}
Trams143;14;9;52454;8:22;{2894.896500002593,514.0241999980062,0.0}
Trams145;14;4;52455;8:22;{6138.21238208538,2940.1058384544613,0.0}
Trams141;14;24;52456;8:23;{4084.1569000035524,2161.088000001386,0.0}
Trams149;14;1;52457;8:23;{2992.747200001031,1703.0900999996811,0.0}
Trams143;14;11;52466;8:24;{2597.49450000003,904.9190000016242,0.0}
Trams183;18;7;52467;8:24;{7477.508000001311,3581.729000000283,0.0}
Trams183;18;5;52468;8:25;{7477.508000001311,3581.729000000283,0.0}
Trams181;18;10;52470;8:25;{2589.0274000018835,1538.5219000000507,0.0}
Trams142;14;8;52474;8:26;{4084.1569000035524,2161.088000001386,0.0}
Trams143;14;15;52474;8:26;{2839.1857000030577,1180.8036000002176,0.0}
Trams181;18;9;52480;8:27;{2110.2352000027895,1344.0613000001758,0.0}
Trams142;14;12;52488;8:28;{4722.0763000026345,2426.624300001189,0.0}
Trams143;14;14;52488;8:28;{3084.0353342962862,1747.4296273253601,0.0}
Trams149;14;5;52488;8:28;{2894.896500002593,514.0241999980062,0.0}
Trams181;18;8;52489;8:28;{1692.722305299079,1166.6255241828771,0.0}
Trams142;14;18;52497;8:29;{5123.508700001985,2583.745899999514,0.0}
Trams183;18;6;52499;8:30;{6188.119100000709,2954.7112999986857,0.0}
Trams149;14;10;52500;8:30;{2597.49450000003,904.9190000016242,0.0}
Trams149;14;11;52508;8:31;{2839.1857000030577,1180.8036000002176,0.0}
Trams181;18;5;52509;8:31;{845.340600002557,806.1041999999434,0.0}
Trams142;14;21;52509;8:31;{5689.812200002372,2815.7713999990374,0.0}
Trams182;18;23;52512;8:32;{5739.764803540053,2830.2159521656795,0.0}
Trams141;14;23;52518;8:33;{6883.719200000167,3354.242599999532,0.0}
Trams181;18;6;52519;8:33;{1241.924200002104,980.4126999992877,0.0}
Trams142;14;24;52520;8:33;{6221.943900000304,2968.579499999061,0.0}
Trams148;14;3;52520;8:33;{2597.49450000003,904.9190000016242,0.0}
Trams149;14;10;52522;8:34;{3084.0353342962862,1747.4296273253601,0.0}
Trams183;18;8;52523;8:34;{5058.904000002891,2546.714799998328,0.0}
Trams143;14;15;52523;8:34;{4722.0763000026345,2426.624300001189,0.0}
Trams141;14;22;52527;8:34;{7267.007879060962,3598.2324644667874,0.0}
Trams148;14;7;52528;8:35;{2839.1857000030577,1180.8036000002176,0.0}
Trams181;18;16;52531;8:35;{1782.5218000002205,1208.6106000002474,0.0}
Trams141;14;7;52532;8:35;{7477.508000001311,3581.729000000283,0.0}
Trams143;14;19;52532;8:35;{5123.508700001985,2583.745899999514,0.0}
Trams141;14;6;52533;8:35;{7477.508000001311,3581.729000000283,0.0}
Trams147;14;4;52535;8:36;{2597.49450000003,904.9190000016242,0.0}
Trams142;14;21;52536;8:36;{6883.719200000167,3354.242599999532,0.0}
Trams181;18;24;52539;8:36;{2149.2538000009954,1363.784799998626,0.0}
Trams147;14;5;52543;8:37;{2839.1857000030577,1180.8036000002176,0.0}
Trams149;14;11;52543;8:37;{4084.1569000035524,2161.088000001386,0.0}
Trams142;14;22;52544;8:37;{7223.311400000006,3570.043500000611,0.0}
Trams143;14;22;52544;8:37;{5689.812200002372,2815.7713999990374,0.0}
Trams183;18;9;52545;8:37;{4031.8555000014603,2128.9623999986798,0.0}
Trams182;18;22;52546;8:38;{7223.311400000006,3570.043500000611,0.0}
Trams182;18;21;52547;8:38;{7267.007879060962,3598.2324644667874,0.0}
Trams142;14;5;52550;8:38;{7477.508000001311,3581.729000000283,0.0}
Trams146;14;4;52550;8:38;{2597.49450000003,904.9190000016242,0.0}
Trams142;14;2;52551;8:38;{7477.508000001311,3581.729000000283,0.0}
Trams182;18;5;52552;8:39;{7477.508000001311,3581.729000000283,0.0}
Trams182;18;3;52553;8:39;{7477.508000001311,3581.729000000283,0.0}
Trams143;14;24;52555;8:39;{6221.943900000304,2968.579499999061,0.0}
Trams147;14;4;52557;8:39;{3084.0353342962862,1747.4296273253601,0.0}
Trams149;14;10;52557;8:39;{4722.0763000026345,2426.624300001189,0.0}
Trams146;14;6;52558;8:40;{2839.1857000030577,1180.8036000002176,0.0}
Trams143;14;23;52563;8:40;{6593.146138654794,3149.575753243163,0.0}
Trams145;14;6;52565;8:41;{2597.49450000003,904.9190000016242,0.0}
Trams149;14;12;52566;8:41;{5123.508700001985,2583.745899999514,0.0}
Trams145;14;8;52573;8:42;{2839.1857000030577,1180.8036000002176,0.0}
Trams141;14;7;52576;8:43;{5634.466500002891,2784.006800001487,0.0}
Trams148;14;10;52577;8:43;{4722.0763000026345,2426.624300001189,0.0}
Trams149;14;13;52578;8:43;{5689.812200002372,2815.7713999990374,0.0}
Trams181;18;23;52581;8:43;{4132.967545312427,2178.980077572535,0.0}
Trams143;14;5;52585;8:44;{7477.508000001311,3581.729000000283,0.0}
Trams144;14;3;52585;8:44;{2597.49450000003,904.9190000016242,0.0}
Trams143;14;3;52586;8:44;{7477.508000001311,3581.729000000283,0.0}
Trams149;14;12;52589;8:45;{6221.943900000304,2968.579499999061,0.0}
Trams144;14;4;52593;8:45;{2839.1857000030577,1180.8036000002176,0.0}
Trams181;18;24;52594;8:46;{4722.0763000026345,2426.624300001189,0.0}
Trams183;18;10;52594;8:46;{1740.6504000015557,1186.7970000002533,0.0}
Trams182;18;5;52596;8:46;{5634.466500002891,2784.006800001487,0.0}
Trams149;14;11;52597;8:46;{6593.146138654794,3149.575753243163,0.0}
Trams148;14;9;52598;8:46;{5689.812200002372,2815.7713999990374,0.0}
Trams149;14;12;52598;8:46;{6609.992500003427,3161.7836000006646,0.0}
Trams148;14;8;52599;8:46;{5739.764803540053,2830.2159521656795,0.0}
Trams181;18;23;52603;8:47;{5123.508700001985,2583.745899999514,0.0}
Trams142;14;3;52606;8:48;{5058.904000002891,2546.714799998328,0.0}
Trams144;14;5;52606;8:48;{3035.1652000024915,1729.7097000014037,0.0}
Trams182;18;6;52608;8:48;{5058.904000002891,2546.714799998328,0.0}
Trams183;18;9;52613;8:49;{874.5067790792331,818.4381949221134,0.0}
Trams147;14;5;52613;8:49;{5689.812200002372,2815.7713999990374,0.0}
Trams149;14;11;52614;8:49;{7267.007879060962,3598.2324644667874,0.0}
Trams183;18;6;52615;8:49;{845.340600002557,806.1041999999434,0.0}
Trams182;18;8;52616;8:49;{4672.309900000691,2395.577299999073,0.0}
Trams146;14;7;52616;8:49;{5123.508700001985,2583.745899999514,0.0}
Trams143;14;5;52617;8:49;{6188.119100000709,2954.7112999986857,0.0}
Trams149;14;2;52619;8:50;{7477.508000001311,3581.729000000283,0.0}
Trams147;14;6;52624;8:51;{6221.943900000304,2968.579499999061,0.0}
Trams144;14;7;52628;8:51;{4084.1569000035524,2161.088000001386,0.0}
Trams146;14;8;52628;8:51;{5689.812200002372,2815.7713999990374,0.0}
Trams183;18;9;52637;8:53;{1782.5218000002205,1208.6106000002474,0.0}
Trams146;14;10;52639;8:53;{6221.943900000304,2968.579499999061,0.0}
Trams148;14;2;52639;8:53;{7477.508000001311,3581.729000000283,0.0}
Trams148;14;1;52640;8:53;{7477.508000001311,3581.729000000283,0.0}
Trams144;14;10;52642;8:54;{4722.0763000026345,2426.624300001189,0.0}
Trams145;14;10;52643;8:54;{5689.812200002372,2815.7713999990374,0.0}
Trams183;18;20;52645;8:54;{2149.2538000009954,1363.784799998626,0.0}
Trams141;14;6;52646;8:54;{2774.94460455129,1095.9101807449765,0.0}
Trams148;14;0;52648;8:55;{7172.43200000003,3532.2607999984175,0.0}
Trams142;14;2;52650;8:55;{2992.747200001031,1703.0900999996811,0.0}
Trams144;14;12;52651;8:55;{5123.508700001985,2583.745899999514,0.0}
Trams182;18;9;52652;8:55;{2992.747200001031,1703.0900999996811,0.0}
Trams147;14;2;52654;8:56;{7477.508000001311,3581.729000000283,0.0}
Trams183;18;24;52655;8:56;{2627.1466000005603,1561.507400000468,0.0}
Trams181;18;4;52656;8:56;{7477.508000001311,3581.729000000283,0.0}
Trams182;18;8;52661;8:57;{2589.0274000018835,1538.5219000000507,0.0}
Trams143;14;4;52662;8:57;{4048.297289360261,2135.7927898531034,0.0}
Trams141;14;10;52663;8:57;{2894.896500002593,514.0241999980062,0.0}
Trams142;14;3;52663;8:57;{2808.1955000013113,1135.889900000766,0.0}
Trams149;14;3;52663;8:57;{5634.466500002891,2784.006800001487,0.0}
Trams183;18;23;52664;8:57;{3035.1652000024915,1729.7097000014037,0.0}
Trams144;14;11;52664;8:57;{5739.764803540053,2830.2159521656795,0.0}
Trams146;14;3;52669;8:58;{7477.508000001311,3581.729000000283,0.0}
Trams146;14;2;52670;8:58;{7477.508000001311,3581.729000000283,0.0}
Trams182;18;6;52671;8:58;{2110.2352000027895,1344.0613000001758,0.0}
Trams144;14;12;52674;8:59;{6221.943900000304,2968.579499999061,0.0}
Trams141;14;16;52675;8:59;{2597.49450000003,904.9190000016242,0.0}
Trams182;18;7;52679;9:0;{1740.6504000015557,1186.7970000002533,0.0}
Trams145;14;9;52679;9:0;{7267.007879060962,3598.2324644667874,0.0}
Trams142;14;4;52681;9:0;{2894.896500002593,514.0241999980062,0.0}
Trams141;14;22;52683;9:0;{2839.1857000030577,1180.8036000002176,0.0}
Trams145;14;5;52684;9:1;{7477.508000001311,3581.729000000283,0.0}
Trams145;14;3;52685;9:1;{7477.508000001311,3581.729000000283,0.0}
Trams183;18;22;52686;9:1;{4084.1569000035524,2161.088000001386,0.0}
Trams143;14;3;52686;9:1;{2952.0448504139104,1673.1693294131398,0.0}
Trams182;18;6;52691;9:2;{1208.916700001806,962.1525999996811,0.0}
Trams182;18;4;52700;9:3;{845.340600002557,806.1041999999434,0.0}
Trams183;18;24;52700;9:3;{4722.0763000026345,2426.624300001189,0.0}
Trams144;14;2;52704;9:4;{7477.508000001311,3581.729000000283,0.0}
Trams183;18;23;52708;9:5;{5108.905971347362,2577.745680309252,0.0}
Trams183;18;24;52709;9:5;{5123.508700001985,2583.745899999514,0.0}
Trams181;18;5;52712;9:5;{5058.904000002891,2546.714799998328,0.0}
Trams141;14;21;52718;9:6;{4084.1569000035524,2161.088000001386,0.0}
Trams141;14;20;52719;9:6;{4132.967545312427,2178.980077572535,0.0}
Trams182;18;5;52730;9:8;{2149.2538000009954,1363.784799998626,0.0}
Trams141;14;19;52731;9:8;{4707.823850244834,2420.7529164061234,0.0}
Trams183;18;23;52733;9:9;{6271.932036142039,2982.903802087056,0.0}
Trams182;18;6;52740;9:10;{2627.1466000005603,1561.507400000468,0.0}
Trams149;14;2;52740;9:10;{2567.6414284064917,825.1840510346515,0.0}
Trams183;18;22;52741;9:10;{6609.992500003427,3161.7836000006646,0.0}
Trams183;18;21;52748;9:11;{6883.719200000167,3354.242599999532,0.0}
Trams141;14;20;52753;9:12;{5689.812200002372,2815.7713999990374,0.0}
Trams183;18;6;52762;9:14;{7477.508000001311,3581.729000000283,0.0}
Trams141;14;19;52764;9:14;{6221.943900000304,2968.579499999061,0.0}
Trams181;18;4;52775;9:16;{2110.2352000027895,1344.0613000001758,0.0}
Trams141;14;6;52794;9:19;{7477.508000001311,3581.729000000283,0.0}
Trams142;14;3;52812;9:22;{7477.508000001311,3581.729000000283,0.0}
Trams182;18;4;52847;9:28;{7477.508000001311,3581.729000000283,0.0}
Trams143;14;5;55206;16:1;{7477.508000001311,3581.729000000283,0.0}
Trams149;14;21;55240;16:7;{7477.508000001311,3581.729000000283,0.0}
Trams149;14;22;55256;16:9;{6831.853600002825,3315.144899999723,0.0}
Trams148;14;8;55260;16:10;{7477.508000001311,3581.729000000283,0.0}
Trams143;14;6;55269;16:11;{4672.309900000691,2395.577299999073,0.0}
Trams183;18;11;55270;16:12;{845.340600002557,806.1041999999434,0.0}
Trams142;14;4;55270;16:12;{2992.747200001031,1703.0900999996811,0.0}
Trams182;18;5;55271;16:12;{4672.309900000691,2395.577299999073,0.0}
Trams147;14;7;55275;16:12;{7477.508000001311,3581.729000000283,0.0}
Trams147;14;9;55276;16:13;{7446.12100000307,3545.9720000009984,0.0}
Trams141;14;8;55283;16:14;{2894.896500002593,514.0241999980062,0.0}
Trams143;14;7;55283;16:14;{4031.8555000014603,2128.9623999986798,0.0}
Trams147;14;10;55283;16:14;{7172.43200000003,3532.2607999984175,0.0}
Trams146;14;8;55290;16:15;{7477.508000001311,3581.729000000283,0.0}
Trams142;14;3;55291;16:15;{2567.6414284064917,825.1840510346515,0.0}
Trams183;18;12;55292;16:15;{1782.5218000002205,1208.6106000002474,0.0}
Trams149;14;21;55295;16:16;{5058.904000002891,2546.714799998328,0.0}
Trams149;14;20;55296;16:16;{5010.473492013262,2527.781076226536,0.0}
Trams183;18;13;55300;16:17;{2149.2538000009954,1363.784799998626,0.0}
Trams148;14;7;55302;16:17;{5641.738919684285,2786.998382666919,0.0}
Trams141;14;7;55303;16:17;{2839.1857000030577,1180.8036000002176,0.0}
Trams148;14;6;55303;16:17;{5634.466500002891,2784.006800001487,0.0}
Trams149;14;18;55303;16:17;{4672.309900000691,2395.577299999073,0.0}
Trams149;14;17;55304;16:17;{4624.179771982149,2375.8925514936154,0.0}
Trams143;14;8;55305;16:17;{2992.747200001031,1703.0900999996811,0.0}
Trams145;14;9;55305;16:17;{7477.508000001311,3581.729000000283,0.0}
Trams145;14;10;55306;16:18;{7446.12100000307,3545.9720000009984,0.0}
Trams182;18;6;55307;16:18;{2992.747200001031,1703.0900999996811,0.0}
Trams183;18;12;55310;16:18;{2627.1466000005603,1561.507400000468,0.0}
Trams183;18;11;55311;16:18;{2675.4015184145933,1580.8842637522473,0.0}
Trams181;18;21;55312;16:19;{7477.508000001311,3581.729000000283,0.0}
Trams148;14;5;55315;16:19;{5058.904000002891,2546.714799998328,0.0}
Trams141;14;8;55316;16:19;{3035.1652000024915,1729.7097000014037,0.0}
Trams143;14;7;55318;16:20;{2808.1955000013113,1135.889900000766,0.0}
Trams148;14;4;55323;16:20;{4672.309900000691,2395.577299999073,0.0}
Trams148;14;3;55324;16:21;{4624.179771982149,2375.8925514936154,0.0}
Trams143;14;6;55325;16:21;{2569.3393000029027,869.8653000015765,0.0}
Trams144;14;8;55325;16:21;{7477.508000001311,3581.729000000283,0.0}
Trams182;18;5;55326;16:21;{2110.2352000027895,1344.0613000001758,0.0}
Trams143;14;4;55326;16:21;{2567.6414284064917,825.1840510346515,0.0}
Trams182;18;4;55327;16:21;{2064.0685709043055,1320.5282183098925,0.0}
Trams181;18;22;55328;16:21;{6831.853600002825,3315.144899999723,0.0}
Trams147;14;9;55330;16:22;{5058.904000002891,2546.714799998328,0.0}
Trams147;14;8;55331;16:22;{5010.473492013262,2527.781076226536,0.0}
Trams143;14;3;55336;16:23;{2894.896500002593,514.0241999980062,0.0}
Trams147;14;6;55338;16:23;{4672.309900000691,2395.577299999073,0.0}
Trams145;14;9;55347;16:24;{5641.738919684285,2786.998382666919,0.0}
Trams145;14;7;55348;16:25;{5634.466500002891,2784.006800001487,0.0}
Trams149;14;11;55352;16:25;{2808.1955000013113,1135.889900000766,0.0}
Trams149;14;10;55353;16:25;{2774.94460455129,1095.9101807449765,0.0}
Trams182;18;8;55355;16:26;{845.340600002557,806.1041999999434,0.0}
Trams149;14;8;55359;16:26;{2569.3393000029027,869.8653000015765,0.0}
Trams141;14;7;55360;16:27;{5108.905971347362,2577.745680309252,0.0}
Trams149;14;5;55360;16:27;{2567.6414284064917,825.1840510346515,0.0}
Trams141;14;6;55361;16:27;{5123.508700001985,2583.745899999514,0.0}
Trams183;18;10;55363;16:27;{5108.905971347362,2577.745680309252,0.0}
Trams183;18;9;55364;16:27;{5123.508700001985,2583.745899999514,0.0}
Trams181;18;21;55367;16:28;{5058.904000002891,2546.714799998328,0.0}
Trams181;18;20;55368;16:28;{5010.473492013262,2527.781076226536,0.0}
Trams144;14;7;55368;16:28;{5634.466500002891,2784.006800001487,0.0}
Trams145;14;6;55369;16:28;{4624.179771982149,2375.8925514936154,0.0}
Trams149;14;3;55370;16:28;{2894.896500002593,514.0241999980062,0.0}
Trams181;18;19;55376;16:29;{4624.179771982149,2375.8925514936154,0.0}
Trams183;18;7;55376;16:29;{5689.812200002372,2815.7713999990374,0.0}
Trams148;14;2;55379;16:30;{2569.3393000029027,869.8653000015765,0.0}
Trams144;14;6;55380;16:30;{5058.904000002891,2546.714799998328,0.0}
Trams148;14;1;55380;16:30;{2567.6414284064917,825.1840510346515,0.0}
Trams147;14;5;55387;16:31;{2808.1955000013113,1135.889900000766,0.0}
Trams147;14;4;55388;16:31;{2774.94460455129,1095.9101807449765,0.0}
Trams143;14;4;55391;16:32;{4084.1569000035524,2161.088000001386,0.0}
Trams147;14;3;55395;16:32;{2567.6414284064917,825.1840510346515,0.0}
Trams182;18;7;55396;16:33;{2675.4015184145933,1580.8842637522473,0.0}
Trams146;14;7;55402;16:34;{2808.1955000013113,1135.889900000766,0.0}
Trams146;14;5;55403;16:34;{2774.94460455129,1095.9101807449765,0.0}
Trams143;14;3;55405;16:34;{4722.0763000026345,2426.624300001189,0.0}
Trams146;14;3;55410;16:35;{2567.6414284064917,825.1840510346515,0.0}
Trams181;18;20;55411;16:35;{2992.747200001031,1703.0900999996811,0.0}
Trams141;14;24;55415;16:36;{7477.508000001311,3581.729000000283,0.0}
Trams183;18;23;55418;16:36;{7477.508000001311,3581.729000000283,0.0}
Trams181;18;18;55420;16:37;{2589.0274000018835,1538.5219000000507,0.0}
Trams146;14;2;55420;16:37;{2894.896500002593,514.0241999980062,0.0}
Trams145;14;5;55424;16:37;{2569.3393000029027,869.8653000015765,0.0}
Trams145;14;4;55425;16:37;{2567.6414284064917,825.1840510346515,0.0}
Trams149;14;4;55425;16:37;{4084.1569000035524,2161.088000001386,0.0}
Trams183;18;24;55426;16:38;{7172.43200000003,3532.2607999984175,0.0}
Trams181;18;16;55430;16:38;{2110.2352000027895,1344.0613000001758,0.0}
Trams181;18;10;55431;16:38;{2064.0685709043055,1320.5282183098925,0.0}
Trams142;14;24;55433;16:39;{7477.508000001311,3581.729000000283,0.0}
Trams1411;14;5;55433;16:39;{7477.508000001311,3581.729000000283,0.0}
Trams145;14;3;55435;16:39;{2894.896500002593,514.0241999980062,0.0}
Trams144;14;5;55437;16:39;{2808.1955000013113,1135.889900000766,0.0}
Trams181;18;4;55438;16:40;{1740.6504000015557,1186.7970000002533,0.0}
Trams147;14;5;55438;16:40;{3035.1652000024915,1729.7097000014037,0.0}
Trams181;18;3;55439;16:40;{1692.722305299079,1166.6255241828771,0.0}
Trams144;14;4;55445;16:41;{2567.6414284064917,825.1840510346515,0.0}
Trams141;14;22;55447;16:41;{6138.21238208538,2940.1058384544613,0.0}
Trams149;14;3;55448;16:41;{5123.508700001985,2583.745899999514,0.0}
Trams1411;14;6;55449;16:41;{6831.853600002825,3315.144899999723,0.0}
Trams183;18;23;55450;16:42;{6138.21238208538,2940.1058384544613,0.0}
Trams144;14;2;55455;16:42;{2894.896500002593,514.0241999980062,0.0}
Trams141;14;21;55457;16:43;{5641.738919684285,2786.998382666919,0.0}
Trams141;14;22;55458;16:43;{5634.466500002891,2784.006800001487,0.0}
Trams181;18;6;55459;16:43;{845.340600002557,806.1041999999434,0.0}
Trams183;18;21;55461;16:43;{5634.466500002891,2784.006800001487,0.0}
Trams182;18;5;55462;16:44;{5739.764803540053,2830.2159521656795,0.0}
Trams1411;14;7;55464;16:44;{6188.119100000709,2954.7112999986857,0.0}
Trams142;14;22;55465;16:44;{6138.21238208538,2940.1058384544613,0.0}
Trams143;14;15;55468;16:45;{7477.508000001311,3581.729000000283,0.0}
Trams145;14;4;55468;16:45;{3035.1652000024915,1729.7097000014037,0.0}
Trams183;18;20;55473;16:45;{5058.904000002891,2546.714799998328,0.0}
Trams183;18;18;55474;16:46;{5010.473492013262,2527.781076226536,0.0}
Trams143;14;16;55476;16:46;{7172.43200000003,3532.2607999984175,0.0}
Trams183;18;16;55481;16:47;{4672.309900000691,2395.577299999073,0.0}
Trams183;18;15;55482;16:47;{4624.179771982149,2375.8925514936154,0.0}
Trams147;14;4;55482;16:47;{5108.905971347362,2577.745680309252,0.0}
Trams142;14;20;55488;16:48;{5058.904000002891,2546.714799998328,0.0}
Trams145;14;3;55490;16:48;{4084.1569000035524,2161.088000001386,0.0}
Trams141;14;21;55492;16:49;{4031.8555000014603,2128.9623999986798,0.0}
Trams142;14;19;55496;16:49;{4672.309900000691,2395.577299999073,0.0}
Trams147;14;3;55496;16:49;{5739.764803540053,2830.2159521656795,0.0}
Trams143;14;17;55499;16:50;{6188.119100000709,2954.7112999986857,0.0}
Trams149;14;13;55502;16:50;{7477.508000001311,3581.729000000283,0.0}
Trams182;18;12;55503;16:50;{7477.508000001311,3581.729000000283,0.0}
Trams182;18;14;55504;16:51;{7446.12100000307,3545.9720000009984,0.0}
Trams143;14;15;55510;16:52;{5641.738919684285,2786.998382666919,0.0}
Trams143;14;14;55511;16:52;{5634.466500002891,2784.006800001487,0.0}
Trams182;18;16;55519;16:53;{6831.853600002825,3315.144899999723,0.0}
Trams148;14;12;55522;16:54;{7477.508000001311,3581.729000000283,0.0}
Trams143;14;13;55524;16:54;{5010.473492013262,2527.781076226536,0.0}
Trams183;18;14;55526;16:54;{2589.0274000018835,1538.5219000000507,0.0}
Trams141;14;16;55527;16:54;{2808.1955000013113,1135.889900000766,0.0}
Trams141;14;15;55528;16:55;{2774.94460455129,1095.9101807449765,0.0}
Trams143;14;11;55531;16:55;{4672.309900000691,2395.577299999073,0.0}
Trams143;14;10;55532;16:55;{4624.179771982149,2375.8925514936154,0.0}
Trams144;14;1;55533;16:55;{5123.508700001985,2583.745899999514,0.0}
Trams141;14;10;55534;16:56;{2569.3393000029027,869.8653000015765,0.0}
Trams149;14;11;55534;16:56;{6138.21238208538,2940.1058384544613,0.0}
Trams141;14;8;55535;16:56;{2567.6414284064917,825.1840510346515,0.0}
Trams183;18;11;55537;16:56;{2064.0685709043055,1320.5282183098925,0.0}
Trams147;14;9;55537;16:56;{7477.508000001311,3581.729000000283,0.0}
Trams148;14;13;55538;16:56;{6831.853600002825,3315.144899999723,0.0}
Trams183;18;8;55544;16:57;{1740.6504000015557,1186.7970000002533,0.0}
Trams141;14;9;55544;16:57;{2894.896500002593,514.0241999980062,0.0}
Trams149;14;10;55544;16:57;{5641.738919684285,2786.998382666919,0.0}
Trams141;14;7;55545;16:57;{2894.896500002593,514.0241999980062,0.0}
Trams142;14;16;55545;16:57;{2808.1955000013113,1135.889900000766,0.0}
Trams143;14;12;55545;16:57;{4031.8555000014603,2128.9623999986798,0.0}
Trams142;14;15;55546;16:58;{2774.94460455129,1095.9101807449765,0.0}
Trams1411;14;6;55546;16:58;{2774.94460455129,1095.9101807449765,0.0}
Trams181;18;5;55552;16:59;{5108.905971347362,2577.745680309252,0.0}
Trams142;14;12;55552;16:59;{2569.3393000029027,869.8653000015765,0.0}
Trams146;14;6;55552;16:59;{7477.508000001311,3581.729000000283,0.0}
Trams142;14;10;55553;16:59;{2567.6414284064917,825.1840510346515,0.0}
Trams147;14;10;55553;16:59;{6831.853600002825,3315.144899999723,0.0}
Trams1411;14;4;55553;16:59;{2567.6414284064917,825.1840510346515,0.0}
Trams182;18;17;55558;17:0;{5058.904000002891,2546.714799998328,0.0}
Trams149;14;7;55558;17:0;{5010.473492013262,2527.781076226536,0.0}
Trams146;14;7;55560;17:0;{7172.43200000003,3532.2607999984175,0.0}
Trams142;14;3;55563;17:0;{2894.896500002593,514.0241999980062,0.0}
Trams1411;14;1;55563;17:0;{2894.896500002593,514.0241999980062,0.0}
Trams181;18;4;55565;17:1;{5689.812200002372,2815.7713999990374,0.0}
Trams149;14;5;55565;17:1;{4672.309900000691,2395.577299999073,0.0}
Trams181;18;3;55566;17:1;{5739.764803540053,2830.2159521656795,0.0}
Trams182;18;16;55567;17:1;{4624.179771982149,2375.8925514936154,0.0}
Trams145;14;12;55567;17:1;{7477.508000001311,3581.729000000283,0.0}
Trams141;14;8;55578;17:3;{3035.1652000024915,1729.7097000014037,0.0}
Trams148;14;12;55578;17:3;{5010.473492013262,2527.781076226536,0.0}
Trams147;14;9;55579;17:3;{5641.738919684285,2786.998382666919,0.0}
Trams149;14;6;55579;17:3;{4031.8555000014603,2128.9623999986798,0.0}
Trams147;14;10;55580;17:3;{5634.466500002891,2784.006800001487,0.0}
Trams143;14;11;55581;17:3;{2774.94460455129,1095.9101807449765,0.0}
Trams145;14;13;55583;17:4;{6831.853600002825,3315.144899999723,0.0}
Trams146;14;6;55584;17:4;{6138.21238208538,2940.1058384544613,0.0}
Trams148;14;9;55585;17:4;{4672.309900000691,2395.577299999073,0.0}
Trams144;14;17;55587;17:4;{7477.508000001311,3581.729000000283,0.0}
Trams143;14;8;55588;17:5;{2567.6414284064917,825.1840510346515,0.0}
Trams144;14;18;55588;17:5;{7446.12100000307,3545.9720000009984,0.0}
Trams147;14;8;55593;17:5;{5010.473492013262,2527.781076226536,0.0}
Trams143;14;4;55598;17:6;{2894.896500002593,514.0241999980062,0.0}
Trams145;14;12;55599;17:6;{6138.21238208538,2940.1058384544613,0.0}
Trams147;14;6;55600;17:7;{4672.309900000691,2395.577299999073,0.0}
Trams181;18;18;55607;17:8;{7477.508000001311,3581.729000000283,0.0}
Trams182;18;13;55611;17:8;{2589.0274000018835,1538.5219000000507,0.0}
Trams183;18;10;55614;17:9;{3035.1652000024915,1729.7097000014037,0.0}
Trams181;18;19;55615;17:9;{7172.43200000003,3532.2607999984175,0.0}
Trams146;14;5;55615;17:9;{4672.309900000691,2395.577299999073,0.0}
Trams144;14;19;55618;17:10;{6188.119100000709,2954.7112999986857,0.0}
Trams144;14;18;55619;17:10;{6138.21238208538,2940.1058384544613,0.0}
Trams182;18;9;55622;17:10;{2064.0685709043055,1320.5282183098925,0.0}
Trams141;14;7;55622;17:10;{5108.905971347362,2577.745680309252,0.0}
Trams145;14;13;55622;17:10;{5058.904000002891,2546.714799998328,0.0}
Trams149;14;5;55622;17:10;{2567.6414284064917,825.1840510346515,0.0}
Trams181;18;20;55623;17:10;{6831.853600002825,3315.144899999723,0.0}
Trams145;14;12;55623;17:10;{5010.473492013262,2527.781076226536,0.0}
Trams182;18;5;55629;17:11;{1740.6504000015557,1186.7970000002533,0.0}
Trams144;14;16;55630;17:12;{5634.466500002891,2784.006800001487,0.0}
Trams145;14;10;55630;17:12;{4672.309900000691,2395.577299999073,0.0}
Trams149;14;6;55631;17:12;{2894.896500002593,514.0241999980062,0.0}
Trams149;14;5;55632;17:12;{2894.896500002593,514.0241999980062,0.0}
Trams148;14;8;55634;17:12;{2808.1955000013113,1135.889900000766,0.0}
Trams148;14;6;55635;17:12;{2774.94460455129,1095.9101807449765,0.0}
Trams183;18;9;55636;17:13;{4084.1569000035524,2161.088000001386,0.0}
Trams147;14;5;55636;17:13;{2992.747200001031,1703.0900999996811,0.0}
Trams181;18;19;55639;17:13;{6138.21238208538,2940.1058384544613,0.0}
Trams148;14;3;55641;17:13;{2569.3393000029027,869.8653000015765,0.0}
Trams144;14;15;55642;17:14;{5058.904000002891,2546.714799998328,0.0}
Trams148;14;2;55642;17:14;{2567.6414284064917,825.1840510346515,0.0}
Trams144;14;12;55643;17:14;{5010.473492013262,2527.781076226536,0.0}
Trams145;14;11;55644;17:14;{4031.8555000014603,2128.9623999986798,0.0}
Trams149;14;6;55644;17:14;{2597.49450000003,904.9190000016242,0.0}
Trams181;18;20;55650;17:15;{5634.466500002891,2784.006800001487,0.0}
Trams182;18;7;55650;17:15;{845.340600002557,806.1041999999434,0.0}
Trams183;18;8;55650;17:15;{4722.0763000026345,2426.624300001189,0.0}
Trams144;14;11;55651;17:15;{4624.179771982149,2375.8925514936154,0.0}
Trams148;14;3;55651;17:15;{2894.896500002593,514.0241999980062,0.0}
Trams148;14;2;55652;17:15;{2894.896500002593,514.0241999980062,0.0}
Trams149;14;7;55652;17:15;{2839.1857000030577,1180.8036000002176,0.0}
Trams147;14;4;55657;17:16;{2567.6414284064917,825.1840510346515,0.0}
Trams146;14;4;55665;17:17;{2774.94460455129,1095.9101807449765,0.0}
Trams149;14;8;55665;17:17;{3035.1652000024915,1729.7097000014037,0.0}
Trams143;14;3;55667;17:18;{4722.0763000026345,2426.624300001189,0.0}
Trams147;14;3;55667;17:18;{2894.896500002593,514.0241999980062,0.0}
Trams181;18;16;55670;17:18;{4672.309900000691,2395.577299999073,0.0}
Trams181;18;15;55671;17:18;{4624.179771982149,2375.8925514936154,0.0}
Trams146;14;2;55671;17:18;{2569.3393000029027,869.8653000015765,0.0}
Trams182;18;8;55672;17:19;{1782.5218000002205,1208.6106000002474,0.0}
Trams183;18;7;55672;17:19;{5739.764803540053,2830.2159521656795,0.0}
Trams146;14;1;55672;17:19;{2567.6414284064917,825.1840510346515,0.0}
Trams141;14;24;55677;17:19;{7477.508000001311,3581.729000000283,0.0}
Trams145;14;10;55679;17:20;{2808.1955000013113,1135.889900000766,0.0}
Trams182;18;7;55680;17:20;{2149.2538000009954,1363.784799998626,0.0}
Trams145;14;9;55680;17:20;{2774.94460455129,1095.9101807449765,0.0}
Trams181;18;17;55684;17:21;{4031.8555000014603,2128.9623999986798,0.0}
Trams145;14;8;55686;17:21;{2569.3393000029027,869.8653000015765,0.0}
Trams145;14;7;55687;17:21;{2567.6414284064917,825.1840510346515,0.0}
Trams142;14;24;55695;17:22;{7477.508000001311,3581.729000000283,0.0}
Trams1411;14;24;55695;17:22;{7477.508000001311,3581.729000000283,0.0}
Trams145;14;4;55697;17:23;{2894.896500002593,514.0241999980062,0.0}
Trams144;14;9;55699;17:23;{2808.1955000013113,1135.889900000766,0.0}
Trams144;14;7;55700;17:23;{2774.94460455129,1095.9101807449765,0.0}
Trams149;14;7;55700;17:23;{4707.823850244834,2420.7529164061234,0.0}
Trams149;14;6;55701;17:23;{4722.0763000026345,2426.624300001189,0.0}
Trams144;14;6;55706;17:24;{2569.3393000029027,869.8653000015765,0.0}
Trams141;14;22;55709;17:25;{6138.21238208538,2940.1058384544613,0.0}
Trams183;18;24;55713;17:25;{7477.508000001311,3581.729000000283,0.0}
Trams181;18;13;55715;17:26;{2589.0274000018835,1538.5219000000507,0.0}
Trams144;14;7;55716;17:26;{2894.896500002593,514.0241999980062,0.0}
Trams144;14;2;55717;17:26;{2894.896500002593,514.0241999980062,0.0}
Trams141;14;18;55719;17:26;{5641.738919684285,2786.998382666919,0.0}
Trams141;14;15;55720;17:27;{5634.466500002891,2784.006800001487,0.0}
Trams149;14;5;55722;17:27;{5689.812200002372,2815.7713999990374,0.0}
Trams181;18;12;55725;17:27;{2110.2352000027895,1344.0613000001758,0.0}
Trams181;18;5;55726;17:28;{2064.0685709043055,1320.5282183098925,0.0}
Trams142;14;23;55727;17:28;{6138.21238208538,2940.1058384544613,0.0}
Trams143;14;24;55730;17:28;{7477.508000001311,3581.729000000283,0.0}
Trams1410;14;16;55730;17:28;{7477.508000001311,3581.729000000283,0.0}
Trams141;14;12;55732;17:29;{5058.904000002891,2546.714799998328,0.0}
Trams181;18;4;55733;17:29;{1740.6504000015557,1186.7970000002533,0.0}
Trams149;14;4;55733;17:29;{6221.943900000304,2968.579499999061,0.0}
Trams182;18;6;55735;17:29;{4722.0763000026345,2426.624300001189,0.0}
Trams1411;14;23;55737;17:29;{5641.738919684285,2786.998382666919,0.0}
Trams142;14;24;55738;17:30;{5634.466500002891,2784.006800001487,0.0}
Trams1410;14;19;55738;17:30;{7172.43200000003,3532.2607999984175,0.0}
Trams1410;14;21;55746;17:31;{6831.853600002825,3315.144899999723,0.0}
Trams142;14;23;55750;17:32;{5058.904000002891,2546.714799998328,0.0}
Trams1411;14;21;55751;17:32;{5010.473492013262,2527.781076226536,0.0}
Trams145;14;5;55752;17:32;{4084.1569000035524,2161.088000001386,0.0}
Trams181;18;5;55754;17:32;{845.340600002557,806.1041999999434,0.0}
Trams141;14;11;55754;17:32;{4031.8555000014603,2128.9623999986798,0.0}
Trams181;18;6;55756;17:33;{902.5305000022054,834.7037000004202,0.0}
Trams182;18;5;55756;17:33;{5689.812200002372,2815.7713999990374,0.0}
Trams142;14;22;55758;17:33;{4672.309900000691,2395.577299999073,0.0}
Trams1411;14;16;55758;17:33;{4672.309900000691,2395.577299999073,0.0}
Trams142;14;20;55759;17:33;{4624.179771982149,2375.8925514936154,0.0}
Trams1411;14;14;55759;17:33;{4624.179771982149,2375.8925514936154,0.0}
Trams181;18;7;55764;17:34;{1241.924200002104,980.4126999992877,0.0}
Trams149;14;24;55764;17:34;{7477.508000001311,3581.729000000283,0.0}
Trams145;14;4;55766;17:34;{4722.0763000026345,2426.624300001189,0.0}
Trams183;18;23;55769;17:35;{5010.473492013262,2527.781076226536,0.0}
Trams143;14;23;55773;17:35;{5634.466500002891,2784.006800001487,0.0}
Trams145;14;3;55774;17:36;{5108.905971347362,2577.745680309252,0.0}
Trams181;18;6;55775;17:36;{1768.882714616512,1202.84636491075,0.0}
Trams181;18;9;55776;17:36;{1782.5218000002205,1208.6106000002474,0.0}
Trams183;18;19;55776;17:36;{4672.309900000691,2395.577299999073,0.0}
Trams141;14;13;55776;17:36;{2992.747200001031,1703.0900999996811,0.0}
Trams148;14;21;55784;17:37;{7477.508000001311,3581.729000000283,0.0}
Trams143;14;24;55785;17:37;{5058.904000002891,2546.714799998328,0.0}
Trams1410;14;20;55785;17:37;{5058.904000002891,2546.714799998328,0.0}
Trams143;14;23;55786;17:38;{5010.473492013262,2527.781076226536,0.0}
Trams1410;14;17;55786;17:38;{5010.473492013262,2527.781076226536,0.0}
Trams141;14;12;55789;17:38;{2808.1955000013113,1135.889900000766,0.0}
Trams183;18;20;55790;17:38;{4031.8555000014603,2128.9623999986798,0.0}
Trams148;14;22;55792;17:39;{7172.43200000003,3532.2607999984175,0.0}
Trams143;14;22;55793;17:39;{4672.309900000691,2395.577299999073,0.0}
Trams1410;14;12;55793;17:39;{4672.309900000691,2395.577299999073,0.0}
Trams143;14;20;55794;17:39;{4624.179771982149,2375.8925514936154,0.0}
Trams141;14;9;55797;17:39;{2567.6414284064917,825.1840510346515,0.0}
Trams182;18;24;55798;17:40;{7477.508000001311,3581.729000000283,0.0}
Trams147;14;15;55799;17:40;{7477.508000001311,3581.729000000283,0.0}
Trams141;14;10;55806;17:41;{2894.896500002593,514.0241999980062,0.0}
Trams149;14;23;55806;17:41;{5641.738919684285,2786.998382666919,0.0}
Trams141;14;9;55807;17:41;{2894.896500002593,514.0241999980062,0.0}
Trams142;14;12;55807;17:41;{2808.1955000013113,1135.889900000766,0.0}
Trams149;14;20;55807;17:41;{5634.466500002891,2784.006800001487,0.0}
Trams142;14;8;55808;17:41;{2774.94460455129,1095.9101807449765,0.0}
Trams183;18;21;55812;17:42;{2992.747200001031,1703.0900999996811,0.0}
Trams142;14;5;55814;17:42;{2569.3393000029027,869.8653000015765,0.0}
Trams146;14;9;55814;17:42;{7477.508000001311,3581.729000000283,0.0}
Trams1411;14;10;55814;17:42;{2569.3393000029027,869.8653000015765,0.0}
Trams142;14;4;55815;17:42;{2567.6414284064917,825.1840510346515,0.0}
Trams147;14;16;55815;17:42;{6831.853600002825,3315.144899999723,0.0}
Trams1411;14;5;55815;17:42;{2567.6414284064917,825.1840510346515,0.0}
Trams148;14;21;55816;17:43;{6138.21238208538,2940.1058384544613,0.0}
Trams149;14;18;55819;17:43;{5058.904000002891,2546.714799998328,0.0}
Trams183;18;18;55821;17:43;{2589.0274000018835,1538.5219000000507,0.0}
Trams1411;14;1;55825;17:44;{2894.896500002593,514.0241999980062,0.0}
Trams141;14;10;55827;17:44;{2839.1857000030577,1180.8036000002176,0.0}
Trams148;14;20;55827;17:44;{5634.466500002891,2784.006800001487,0.0}
Trams149;14;17;55827;17:44;{4672.309900000691,2395.577299999073,0.0}
Trams149;14;16;55828;17:45;{4624.179771982149,2375.8925514936154,0.0}
Trams143;14;19;55829;17:45;{2992.747200001031,1703.0900999996811,0.0}
Trams145;14;11;55829;17:45;{7477.508000001311,3581.729000000283,0.0}
Trams182;18;23;55830;17:45;{6138.21238208538,2940.1058384544613,0.0}
Trams146;14;10;55830;17:45;{6831.853600002825,3315.144899999723,0.0}
Trams183;18;15;55831;17:45;{2110.2352000027895,1344.0613000001758,0.0}
Trams183;18;11;55832;17:45;{2064.0685709043055,1320.5282183098925,0.0}
Trams181;18;8;55839;17:46;{4722.0763000026345,2426.624300001189,0.0}
Trams183;18;8;55839;17:46;{1740.6504000015557,1186.7970000002533,0.0}
Trams183;18;7;55840;17:47;{1692.722305299079,1166.6255241828771,0.0}
Trams148;14;17;55840;17:47;{5010.473492013262,2527.781076226536,0.0}
Trams182;18;22;55841;17:47;{5634.466500002891,2784.006800001487,0.0}
Trams141;14;9;55841;17:47;{3084.0353342962862,1747.4296273253601,0.0}
Trams147;14;15;55842;17:47;{5634.466500002891,2784.006800001487,0.0}
Trams1410;14;11;55842;17:47;{2808.1955000013113,1135.889900000766,0.0}
Trams143;14;18;55843;17:47;{2774.94460455129,1095.9101807449765,0.0}
Trams146;14;9;55846;17:48;{6138.21238208538,2940.1058384544613,0.0}
Trams181;18;6;55847;17:48;{5108.905971347362,2577.745680309252,0.0}
Trams148;14;14;55847;17:48;{4672.309900000691,2395.577299999073,0.0}
Trams148;14;13;55848;17:48;{4624.179771982149,2375.8925514936154,0.0}
Trams143;14;12;55849;17:48;{2569.3393000029027,869.8653000015765,0.0}
Trams144;14;18;55849;17:48;{7477.508000001311,3581.729000000283,0.0}
Trams143;14;8;55850;17:48;{2567.6414284064917,825.1840510346515,0.0}
Trams1410;14;8;55850;17:48;{2567.6414284064917,825.1840510346515,0.0}
Trams182;18;20;55853;17:49;{5058.904000002891,2546.714799998328,0.0}
Trams147;14;14;55855;17:49;{5010.473492013262,2527.781076226536,0.0}
Trams183;18;14;55860;17:50;{845.340600002557,806.1041999999434,0.0}
Trams143;14;4;55860;17:50;{2894.896500002593,514.0241999980062,0.0}
Trams1410;14;1;55860;17:50;{2894.896500002593,514.0241999980062,0.0}
Trams181;18;4;55861;17:50;{5739.764803540053,2830.2159521656795,0.0}
Trams141;14;10;55862;17:50;{4084.1569000035524,2161.088000001386,0.0}
Trams182;18;19;55875;17:52;{4031.8555000014603,2128.9623999986798,0.0}
Trams149;14;12;55876;17:53;{2808.1955000013113,1135.889900000766,0.0}
Trams146;14;6;55877;17:53;{4672.309900000691,2395.577299999073,0.0}
Trams149;14;10;55877;17:53;{2774.94460455129,1095.9101807449765,0.0}
Trams183;18;15;55882;17:54;{1782.5218000002205,1208.6106000002474,0.0}
Trams149;14;9;55883;17:54;{2569.3393000029027,869.8653000015765,0.0}
Trams145;14;12;55884;17:54;{5058.904000002891,2546.714799998328,0.0}
Trams141;14;9;55885;17:54;{5123.508700001985,2583.745899999514,0.0}
Trams144;14;17;55891;17:55;{5641.738919684285,2786.998382666919,0.0}
Trams145;14;10;55892;17:55;{4672.309900000691,2395.577299999073,0.0}
Trams143;14;5;55893;17:55;{3035.1652000024915,1729.7097000014037,0.0}
Trams149;14;6;55894;17:56;{2894.896500002593,514.0241999980062,0.0}
Trams148;14;12;55896;17:56;{2808.1955000013113,1135.889900000766,0.0}
Trams182;18;20;55897;17:56;{2992.747200001031,1703.0900999996811,0.0}
Trams181;18;24;55902;17:57;{7477.508000001311,3581.729000000283,0.0}
Trams148;14;10;55903;17:57;{2569.3393000029027,869.8653000015765,0.0}
Trams148;14;6;55904;17:57;{2567.6414284064917,825.1840510346515,0.0}
Trams182;18;16;55906;17:58;{2589.0274000018835,1538.5219000000507,0.0}
Trams145;14;9;55906;17:58;{4031.8555000014603,2128.9623999986798,0.0}
Trams147;14;11;55911;17:58;{2808.1955000013113,1135.889900000766,0.0}
Trams144;14;15;55913;17:59;{4624.179771982149,2375.8925514936154,0.0}
Trams148;14;2;55914;17:59;{2894.896500002593,514.0241999980062,0.0}
Trams182;18;14;55916;17:59;{2110.2352000027895,1344.0613000001758,0.0}
Trams182;18;12;55917;17:59;{2064.0685709043055,1320.5282183098925,0.0}
Trams147;14;9;55918;18:0;{2569.3393000029027,869.8653000015765,0.0}
Trams147;14;7;55919;18:0;{2567.6414284064917,825.1840510346515,0.0}
Trams182;18;11;55924;18:1;{1740.6504000015557,1186.7970000002533,0.0}
Trams146;14;5;55927;18:1;{2774.94460455129,1095.9101807449765,0.0}
Trams147;14;5;55929;18:1;{2894.896500002593,514.0241999980062,0.0}
Trams183;18;13;55931;18:2;{4084.1569000035524,2161.088000001386,0.0}
Trams181;18;22;55934;18:2;{6138.21238208538,2940.1058384544613,0.0}
Trams146;14;4;55934;18:2;{2567.6414284064917,825.1840510346515,0.0}
Trams182;18;10;55935;18:2;{1213.7785956119094,964.194963392883,0.0}
Trams143;14;4;55938;18:3;{5123.508700001985,2583.745899999514,0.0}
Trams141;14;24;55939;18:3;{7477.508000001311,3581.729000000283,0.0}
Trams145;14;6;55942;18:4;{2774.94460455129,1095.9101807449765,0.0}
Trams181;18;20;55944;18:4;{5641.738919684285,2786.998382666919,0.0}
Trams146;14;1;55944;18:4;{2894.896500002593,514.0241999980062,0.0}
Trams181;18;19;55945;18:4;{5634.466500002891,2784.006800001487,0.0}
Trams182;18;12;55945;18:4;{845.340600002557,806.1041999999434,0.0}
Trams183;18;12;55945;18:4;{4722.0763000026345,2426.624300001189,0.0}
Trams149;14;7;55949;18:5;{4084.1569000035524,2161.088000001386,0.0}
Trams183;18;9;55953;18:5;{5108.905971347362,2577.745680309252,0.0}
Trams181;18;12;55957;18:6;{5058.904000002891,2546.714799998328,0.0}
Trams142;14;24;55957;18:6;{7477.508000001311,3581.729000000283,0.0}
Trams1411;14;24;55957;18:6;{7477.508000001311,3581.729000000283,0.0}
Trams145;14;7;55958;18:6;{2894.896500002593,514.0241999980062,0.0}
Trams145;14;5;55959;18:6;{2894.896500002593,514.0241999980062,0.0}
Trams144;14;14;55961;18:7;{2808.1955000013113,1135.889900000766,0.0}
Trams144;14;12;55962;18:7;{2774.94460455129,1095.9101807449765,0.0}
Trams182;18;13;55967;18:8;{1782.5218000002205,1208.6106000002474,0.0}
Trams183;18;7;55967;18:8;{5739.764803540053,2830.2159521656795,0.0}
Trams144;14;10;55968;18:8;{2569.3393000029027,869.8653000015765,0.0}
Trams144;14;9;55969;18:8;{2567.6414284064917,825.1840510346515,0.0}
Trams141;14;23;55971;18:8;{6138.21238208538,2940.1058384544613,0.0}
Trams182;18;12;55976;18:9;{2197.307743831217,1383.6548398164498,0.0}
Trams144;14;10;55978;18:10;{2894.896500002593,514.0241999980062,0.0}
Trams181;18;10;55979;18:10;{4031.8555000014603,2128.9623999986798,0.0}
Trams144;14;5;55979;18:10;{2894.896500002593,514.0241999980062,0.0}
Trams141;14;21;55981;18:10;{5641.738919684285,2786.998382666919,0.0}
Trams182;18;13;55985;18:11;{2627.1466000005603,1561.507400000468,0.0}
Trams149;14;6;55985;18:11;{5739.764803540053,2830.2159521656795,0.0}
Trams143;14;24;55992;18:12;{7477.508000001311,3581.729000000283,0.0}
Trams145;14;6;55992;18:12;{3035.1652000024915,1729.7097000014037,0.0}
Trams1410;14;18;55992;18:12;{7477.508000001311,3581.729000000283,0.0}
Trams141;14;20;55994;18:12;{5058.904000002891,2546.714799998328,0.0}
Trams141;14;19;56003;18:14;{4624.179771982149,2375.8925514936154,0.0}
Trams183;18;24;56008;18:15;{7477.508000001311,3581.729000000283,0.0}
Trams1410;14;20;56008;18:15;{6831.853600002825,3315.144899999723,0.0}
Trams181;18;7;56010;18:15;{2589.0274000018835,1538.5219000000507,0.0}
Trams142;14;22;56012;18:15;{5058.904000002891,2546.714799998328,0.0}
Trams1411;14;17;56013;18:15;{5010.473492013262,2527.781076226536,0.0}
Trams1410;14;21;56015;18:16;{6563.806600000709,3123.2601999994367,0.0}
Trams141;14;17;56016;18:16;{4031.8555000014603,2128.9623999986798,0.0}
Trams147;14;4;56019;18:16;{5689.812200002372,2815.7713999990374,0.0}
Trams181;18;6;56020;18:17;{2110.2352000027895,1344.0613000001758,0.0}
Trams147;14;3;56020;18:17;{5739.764803540053,2830.2159521656795,0.0}
Trams1411;14;14;56020;18:17;{4672.309900000691,2395.577299999073,0.0}
Trams1411;14;13;56021;18:17;{4624.179771982149,2375.8925514936154,0.0}
Trams1410;14;22;56023;18:17;{6188.119100000709,2954.7112999986857,0.0}
Trams149;14;15;56026;18:18;{7477.508000001311,3581.729000000283,0.0}
Trams182;18;12;56030;18:18;{4722.0763000026345,2426.624300001189,0.0}
Trams1410;14;20;56035;18:19;{5634.466500002891,2784.006800001487,0.0}
Trams182;18;11;56038;18:20;{5108.905971347362,2577.745680309252,0.0}
Trams141;14;18;56038;18:20;{2992.747200001031,1703.0900999996811,0.0}
Trams182;18;10;56039;18:20;{5123.508700001985,2583.745899999514,0.0}
Trams183;18;22;56040;18:20;{6138.21238208538,2940.1058384544613,0.0}
Trams148;14;10;56046;18:21;{7477.508000001311,3581.729000000283,0.0}
Trams143;14;23;56047;18:21;{5058.904000002891,2546.714799998328,0.0}
Trams143;14;21;56048;18:21;{5010.473492013262,2527.781076226536,0.0}
Trams1410;14;19;56048;18:21;{5010.473492013262,2527.781076226536,0.0}
Trams181;18;9;56049;18:21;{845.340600002557,806.1041999999434,0.0}
Trams145;14;5;56050;18:22;{5739.764803540053,2830.2159521656795,0.0}
Trams183;18;23;56051;18:22;{5634.466500002891,2784.006800001487,0.0}
Trams141;14;15;56051;18:22;{2808.1955000013113,1135.889900000766,0.0}
Trams143;14;18;56055;18:22;{4672.309900000691,2395.577299999073,0.0}
Trams1410;14;12;56055;18:22;{4672.309900000691,2395.577299999073,0.0}
Trams142;14;23;56056;18:23;{2992.747200001031,1703.0900999996811,0.0}
Trams143;14;16;56056;18:23;{4624.179771982149,2375.8925514936154,0.0}
Trams149;14;16;56057;18:23;{6188.119100000709,2954.7112999986857,0.0}
Trams141;14;13;56058;18:23;{2569.3393000029027,869.8653000015765,0.0}
Trams141;14;10;56059;18:23;{2567.6414284064917,825.1840510346515,0.0}
Trams147;14;6;56061;18:23;{7477.508000001311,3581.729000000283,0.0}
Trams182;18;8;56062;18:24;{6221.943900000304,2968.579499999061,0.0}
Trams147;14;9;56062;18:24;{7446.12100000307,3545.9720000009984,0.0}
Trams148;14;11;56062;18:24;{6831.853600002825,3315.144899999723,0.0}
Trams183;18;22;56063;18:24;{5058.904000002891,2546.714799998328,0.0}
Trams183;18;21;56064;18:24;{5010.473492013262,2527.781076226536,0.0}
Trams141;14;9;56069;18:25;{2894.896500002593,514.0241999980062,0.0}
Trams142;14;16;56069;18:25;{2808.1955000013113,1135.889900000766,0.0}
Trams149;14;14;56069;18:25;{5634.466500002891,2784.006800001487,0.0}
Trams142;14;8;56070;18:25;{2774.94460455129,1095.9101807449765,0.0}
Trams1411;14;11;56070;18:25;{2774.94460455129,1095.9101807449765,0.0}
Trams142;14;4;56076;18:26;{2569.3393000029027,869.8653000015765,0.0}
Trams146;14;9;56076;18:26;{7477.508000001311,3581.729000000283,0.0}
Trams1411;14;10;56076;18:26;{2569.3393000029027,869.8653000015765,0.0}
Trams148;14;12;56077;18:26;{6188.119100000709,2954.7112999986857,0.0}
Trams1411;14;9;56077;18:26;{2567.6414284064917,825.1840510346515,0.0}
Trams148;14;11;56078;18:26;{6138.21238208538,2940.1058384544613,0.0}
Trams181;18;10;56079;18:26;{2149.2538000009954,1363.784799998626,0.0}
Trams142;14;3;56087;18:28;{2894.896500002593,514.0241999980062,0.0}
Trams1411;14;1;56087;18:28;{2894.896500002593,514.0241999980062,0.0}
Trams148;14;10;56089;18:28;{5634.466500002891,2784.006800001487,0.0}
Trams143;14;17;56091;18:28;{2992.747200001031,1703.0900999996811,0.0}
Trams145;14;10;56091;18:28;{7477.508000001311,3581.729000000283,0.0}
Trams145;14;12;56092;18:29;{7446.12100000307,3545.9720000009984,0.0}
Trams182;18;24;56093;18:29;{7477.508000001311,3581.729000000283,0.0}
Trams148;14;9;56102;18:30;{5010.473492013262,2527.781076226536,0.0}
Trams143;14;15;56104;18:31;{2808.1955000013113,1135.889900000766,0.0}
Trams143;14;14;56111;18:32;{2569.3393000029027,869.8653000015765,0.0}
Trams144;14;11;56111;18:32;{7477.508000001311,3581.729000000283,0.0}
Trams1410;14;11;56111;18:32;{2569.3393000029027,869.8653000015765,0.0}
Trams143;14;12;56112;18:32;{2567.6414284064917,825.1840510346515,0.0}
Trams1410;14;9;56112;18:32;{2567.6414284064917,825.1840510346515,0.0}
Trams183;18;18;56116;18:33;{2589.0274000018835,1538.5219000000507,0.0}
Trams147;14;8;56116;18:33;{5058.904000002891,2546.714799998328,0.0}
Trams146;14;8;56118;18:33;{5641.738919684285,2786.998382666919,0.0}
Trams146;14;10;56119;18:33;{5634.466500002891,2784.006800001487,0.0}
Trams143;14;5;56122;18:34;{2894.896500002593,514.0241999980062,0.0}
Trams1410;14;2;56122;18:34;{2894.896500002593,514.0241999980062,0.0}
Trams147;14;7;56124;18:34;{4672.309900000691,2395.577299999073,0.0}
Trams183;18;13;56126;18:34;{2110.2352000027895,1344.0613000001758,0.0}
Trams183;18;9;56127;18:34;{2064.0685709043055,1320.5282183098925,0.0}
Trams181;18;9;56134;18:36;{4722.0763000026345,2426.624300001189,0.0}
Trams183;18;7;56134;18:36;{1740.6504000015557,1186.7970000002533,0.0}
Trams145;14;13;56134;18:36;{5634.466500002891,2784.006800001487,0.0}
Trams182;18;23;56135;18:36;{5641.738919684285,2786.998382666919,0.0}
Trams147;14;6;56138;18:36;{4031.8555000014603,2128.9623999986798,0.0}
Trams146;14;8;56139;18:36;{4672.309900000691,2395.577299999073,0.0}
Trams149;14;13;56139;18:36;{2774.94460455129,1095.9101807449765,0.0}
Trams181;18;8;56142;18:37;{5108.905971347362,2577.745680309252,0.0}
Trams144;14;10;56143;18:37;{6138.21238208538,2940.1058384544613,0.0}
Trams148;14;10;56145;18:37;{2992.747200001031,1703.0900999996811,0.0}
Trams149;14;12;56145;18:37;{2569.3393000029027,869.8653000015765,0.0}
Trams149;14;9;56146;18:38;{2567.6414284064917,825.1840510346515,0.0}
Trams145;14;11;56147;18:38;{5010.473492013262,2527.781076226536,0.0}
Trams182;18;24;56148;18:38;{5058.904000002891,2546.714799998328,0.0}
Trams146;14;7;56152;18:39;{4048.297289360261,2135.7927898531034,0.0}
Trams144;14;9;56153;18:39;{5641.738919684285,2786.998382666919,0.0}
Trams183;18;9;56155;18:39;{845.340600002557,806.1041999999434,0.0}
Trams145;14;10;56155;18:39;{4624.179771982149,2375.8925514936154,0.0}
Trams149;14;10;56155;18:39;{2894.896500002593,514.0241999980062,0.0}
Trams181;18;7;56156;18:39;{5739.764803540053,2830.2159521656795,0.0}
Trams149;14;7;56156;18:39;{2894.896500002593,514.0241999980062,0.0}
Trams148;14;8;56158;18:40;{2808.1955000013113,1135.889900000766,0.0}
Trams148;14;7;56165;18:41;{2569.3393000029027,869.8653000015765,0.0}
Trams181;18;6;56166;18:41;{6221.943900000304,2968.579499999061,0.0}
Trams144;14;8;56166;18:41;{5058.904000002891,2546.714799998328,0.0}
Trams148;14;6;56166;18:41;{2567.6414284064917,825.1840510346515,0.0}
Trams144;14;6;56167;18:41;{5010.473492013262,2527.781076226536,0.0}
Trams147;14;5;56173;18:42;{2808.1955000013113,1135.889900000766,0.0}
Trams148;14;7;56175;18:42;{2894.896500002593,514.0241999980062,0.0}
Trams148;14;3;56176;18:43;{2894.896500002593,514.0241999980062,0.0}
Trams183;18;8;56177;18:43;{1782.5218000002205,1208.6106000002474,0.0}
Trams142;14;2;56178;18:43;{5739.764803540053,2830.2159521656795,0.0}
Trams147;14;4;56181;18:43;{2567.6414284064917,825.1840510346515,0.0}
Trams183;18;9;56185;18:44;{2149.2538000009954,1363.784799998626,0.0}
Trams146;14;6;56188;18:45;{2808.1955000013113,1135.889900000766,0.0}
Trams146;14;5;56189;18:45;{2774.94460455129,1095.9101807449765,0.0}
Trams146;14;6;56195;18:46;{2569.3393000029027,869.8653000015765,0.0}
Trams146;14;4;56196;18:46;{2567.6414284064917,825.1840510346515,0.0}
Trams181;18;24;56197;18:46;{7477.508000001311,3581.729000000283,0.0}
Trams182;18;23;56201;18:47;{2589.0274000018835,1538.5219000000507,0.0}
Trams141;14;24;56201;18:47;{7477.508000001311,3581.729000000283,0.0}
Trams145;14;8;56203;18:47;{2808.1955000013113,1135.889900000766,0.0}
Trams183;18;11;56204;18:47;{3035.1652000024915,1729.7097000014037,0.0}
Trams146;14;3;56206;18:48;{2894.896500002593,514.0241999980062,0.0}
Trams144;14;5;56210;18:48;{2992.747200001031,1703.0900999996811,0.0}
Trams145;14;7;56210;18:48;{2569.3393000029027,869.8653000015765,0.0}
Trams182;18;20;56211;18:48;{2110.2352000027895,1344.0613000001758,0.0}
Trams145;14;5;56211;18:48;{2567.6414284064917,825.1840510346515,0.0}
Trams182;18;12;56212;18:49;{2064.0685709043055,1320.5282183098925,0.0}
Trams182;18;9;56219;18:50;{1740.6504000015557,1186.7970000002533,0.0}
Trams142;14;17;56219;18:50;{7477.508000001311,3581.729000000283,0.0}
Trams149;14;8;56225;18:51;{4722.0763000026345,2426.624300001189,0.0}
Trams183;18;10;56226;18:51;{4084.1569000035524,2161.088000001386,0.0}
Trams142;14;18;56227;18:51;{7172.43200000003,3532.2607999984175,0.0}
Trams181;18;22;56229;18:51;{6138.21238208538,2940.1058384544613,0.0}
Trams182;18;8;56230;18:52;{1213.7785956119094,964.194963392883,0.0}
Trams144;14;4;56230;18:52;{2569.3393000029027,869.8653000015765,0.0}
Trams142;14;19;56235;18:52;{6831.853600002825,3315.144899999723,0.0}
Trams181;18;21;56239;18:53;{5641.738919684285,2786.998382666919,0.0}
Trams181;18;18;56240;18:53;{5634.466500002891,2784.006800001487,0.0}
Trams182;18;9;56240;18:53;{845.340600002557,806.1041999999434,0.0}
Trams142;14;20;56242;18:54;{6563.806600000709,3123.2601999994367,0.0}
Trams149;14;7;56247;18:54;{5739.764803540053,2830.2159521656795,0.0}
Trams183;18;9;56248;18:55;{5108.905971347362,2577.745680309252,0.0}
Trams183;18;8;56249;18:55;{5123.508700001985,2583.745899999514,0.0}
Trams182;18;10;56250;18:55;{1241.924200002104,980.4126999992877,0.0}
Trams142;14;18;56251;18:55;{6138.21238208538,2940.1058384544613,0.0}
Trams181;18;19;56252;18:55;{5058.904000002891,2546.714799998328,0.0}
Trams181;18;17;56253;18:55;{5010.473492013262,2527.781076226536,0.0}
Trams144;14;5;56253;18:55;{2597.49450000003,904.9190000016242,0.0}
Trams143;14;21;56254;18:56;{7477.508000001311,3581.729000000283,0.0}
Trams149;14;6;56257;18:56;{6221.943900000304,2968.579499999061,0.0}
Trams181;18;16;56260;18:57;{4672.309900000691,2395.577299999073,0.0}
Trams182;18;9;56262;18:57;{1782.5218000002205,1208.6106000002474,0.0}
Trams143;14;23;56262;18:57;{7172.43200000003,3532.2607999984175,0.0}
Trams141;14;23;56265;18:57;{4624.179771982149,2375.8925514936154,0.0}
Trams182;18;11;56270;18:58;{2149.2538000009954,1363.784799998626,0.0}
Trams183;18;7;56272;18:59;{6221.943900000304,2968.579499999061,0.0}
Trams181;18;18;56274;18:59;{4031.8555000014603,2128.9623999986798,0.0}
Trams142;14;17;56274;18:59;{5058.904000002891,2546.714799998328,0.0}
Trams142;14;16;56275;18:59;{5010.473492013262,2527.781076226536,0.0}
Trams141;14;24;56278;19:0;{4031.8555000014603,2128.9623999986798,0.0}
Trams182;18;12;56280;19:0;{2627.1466000005603,1561.507400000468,0.0}
Trams142;14;15;56282;19:0;{4672.309900000691,2395.577299999073,0.0}
Trams142;14;13;56283;19:0;{4624.179771982149,2375.8925514936154,0.0}
Trams143;14;24;56285;19:1;{6188.119100000709,2954.7112999986857,0.0}
Trams143;14;22;56286;19:1;{6138.21238208538,2940.1058384544613,0.0}
Trams149;14;13;56288;19:1;{7477.508000001311,3581.729000000283,0.0}
Trams182;18;11;56289;19:1;{3035.1652000024915,1729.7097000014037,0.0}
Trams181;18;19;56296;19:3;{2992.747200001031,1703.0900999996811,0.0}
Trams142;14;12;56296;19:3;{4031.8555000014603,2128.9623999986798,0.0}
Trams143;14;19;56296;19:3;{5641.738919684285,2786.998382666919,0.0}
Trams183;18;24;56303;19:4;{7477.508000001311,3581.729000000283,0.0}
Trams181;18;17;56305;19:4;{2589.0274000018835,1538.5219000000507,0.0}
Trams143;14;17;56310;19:5;{5010.473492013262,2527.781076226536,0.0}
Trams141;14;18;56313;19:5;{2808.1955000013113,1135.889900000766,0.0}
Trams141;14;15;56314;19:6;{2774.94460455129,1095.9101807449765,0.0}
Trams181;18;13;56315;19:6;{2110.2352000027895,1344.0613000001758,0.0}
Trams181;18;8;56316;19:6;{2064.0685709043055,1320.5282183098925,0.0}
Trams143;14;14;56317;19:6;{4672.309900000691,2395.577299999073,0.0}
Trams141;14;13;56320;19:7;{2569.3393000029027,869.8653000015765,0.0}
Trams149;14;12;56320;19:7;{6138.21238208538,2940.1058384544613,0.0}
Trams141;14;10;56321;19:7;{2567.6414284064917,825.1840510346515,0.0}
Trams181;18;7;56324;19:7;{1692.722305299079,1166.6255241828771,0.0}
Trams182;18;9;56325;19:7;{4722.0763000026345,2426.624300001189,0.0}
Trams149;14;11;56330;19:8;{5641.738919684285,2786.998382666919,0.0}
Trams141;14;9;56331;19:8;{2894.896500002593,514.0241999980062,0.0}
Trams144;14;4;56331;19:8;{5689.812200002372,2815.7713999990374,0.0}
Trams142;14;11;56332;19:9;{2774.94460455129,1095.9101807449765,0.0}
Trams182;18;8;56333;19:9;{5108.905971347362,2577.745680309252,0.0}
Trams182;18;7;56334;19:9;{5123.508700001985,2583.745899999514,0.0}
Trams142;14;10;56338;19:10;{2569.3393000029027,869.8653000015765,0.0}
Trams142;14;8;56339;19:10;{2567.6414284064917,825.1840510346515,0.0}
Trams141;14;10;56343;19:10;{2597.49450000003,904.9190000016242,0.0}
Trams149;14;10;56343;19:10;{5058.904000002891,2546.714799998328,0.0}
Trams142;14;9;56348;19:11;{2894.896500002593,514.0241999980062,0.0}
Trams142;14;4;56349;19:11;{2894.896500002593,514.0241999980062,0.0}
Trams149;14;9;56351;19:12;{4672.309900000691,2395.577299999073,0.0}
Trams141;14;9;56365;19:14;{3084.0353342962862,1747.4296273253601,0.0}
Trams143;14;13;56366;19:14;{2808.1955000013113,1135.889900000766,0.0}
Trams143;14;11;56367;19:14;{2774.94460455129,1095.9101807449765,0.0}
Trams143;14;9;56374;19:16;{2567.6414284064917,825.1840510346515,0.0}
Trams143;14;8;56384;19:17;{2894.896500002593,514.0241999980062,0.0}
Trams182;18;24;56388;19:18;{7477.508000001311,3581.729000000283,0.0}
Trams149;14;8;56400;19:20;{2808.1955000013113,1135.889900000766,0.0}
Trams149;14;7;56407;19:21;{2569.3393000029027,869.8653000015765,0.0}
Trams149;14;8;56417;19:23;{2894.896500002593,514.0241999980062,0.0}
Trams149;14;7;56418;19:23;{2894.896500002593,514.0241999980062,0.0}
Trams183;18;19;56422;19:24;{2064.0685709043055,1320.5282183098925,0.0}
Trams183;18;8;56429;19:25;{1740.6504000015557,1186.7970000002533,0.0}
Trams181;18;12;56492;19:35;{7477.508000001311,3581.729000000283,0.0}
Trams181;18;14;56500;19:37;{7172.43200000003,3532.2607999984175,0.0}
Trams182;18;18;56507;19:38;{2064.0685709043055,1320.5282183098925,0.0}
Trams181;18;17;56508;19:38;{6831.853600002825,3315.144899999723,0.0}
Trams182;18;12;56514;19:39;{1740.6504000015557,1186.7970000002533,0.0}
Trams181;18;19;56515;19:39;{6563.806600000709,3123.2601999994367,0.0}
Trams182;18;11;56515;19:39;{1692.722305299079,1166.6255241828771,0.0}
Trams181;18;22;56523;19:40;{6188.119100000709,2954.7112999986857,0.0}
Trams181;18;23;56555;19:46;{4672.309900000691,2395.577299999073,0.0}
Trams181;18;22;56569;19:48;{4031.8555000014603,2128.9623999986798,0.0}
Trams181;18;20;56600;19:53;{2589.0274000018835,1538.5219000000507,0.0}
Trams181;18;19;56610;19:55;{2110.2352000027895,1344.0613000001758,0.0}
Trams181;18;15;56611;19:55;{2064.0685709043055,1320.5282183098925,0.0}
Trams181;18;12;56618;19:56;{1740.6504000015557,1186.7970000002533,0.0}
Trams181;18;7;56619;19:56;{1692.722305299079,1166.6255241828771,0.0}
