tramName;tramLine;nPassengers;cycleNo;time;location
Trams146;14;5;12988;6:0;{2597.49450000003,904.9190000016242,0.0}
Trams144;14;3;12993;6:1;{2808.1955000013113,1135.889900000766,0.0}
Trams146;14;6;12996;6:2;{2839.1857000030577,1180.8036000002176,0.0}
Trams181;18;2;13001;6:2;{1782.5218000002205,1208.6106000002474,0.0}
Trams145;14;5;13003;6:3;{2597.49450000003,904.9190000016242,0.0}
Trams181;18;4;13009;6:4;{2149.2538000009954,1363.784799998626,0.0}
Trams144;14;4;13011;6:4;{2894.896500002593,514.0241999980062,0.0}
Trams145;14;9;13011;6:4;{2839.1857000030577,1180.8036000002176,0.0}
Trams148;14;6;13015;6:5;{4722.0763000026345,2426.624300001189,0.0}
Trams181;18;5;13019;6:5;{2627.1466000005603,1561.507400000468,0.0}
Trams143;14;6;13023;6:6;{7477.508000001311,3581.729000000283,0.0}
Trams148;14;7;13024;6:6;{5123.508700001985,2583.745899999514,0.0}
Trams141;14;5;13026;6:7;{5058.904000002891,2546.714799998328,0.0}
Trams144;14;6;13031;6:7;{2839.1857000030577,1180.8036000002176,0.0}
Trams147;14;7;13039;6:9;{5123.508700001985,2583.745899999514,0.0}
Trams142;14;4;13044;6:10;{5058.904000002891,2546.714799998328,0.0}
Trams146;14;8;13045;6:10;{4722.0763000026345,2426.624300001189,0.0}
Trams183;18;6;13046;6:10;{2589.0274000018835,1538.5219000000507,0.0}
Trams141;14;6;13048;6:10;{4031.8555000014603,2128.9623999986798,0.0}
Trams147;14;9;13051;6:11;{5689.812200002372,2815.7713999990374,0.0}
Trams149;14;6;13058;6:12;{7477.508000001311,3581.729000000283,0.0}
Trams145;14;11;13060;6:12;{4722.0763000026345,2426.624300001189,0.0}
Trams181;18;4;13063;6:13;{4707.823850244834,2420.7529164061234,0.0}
Trams142;14;3;13065;6:13;{4048.297289360261,2135.7927898531034,0.0}
Trams182;18;6;13066;6:13;{5634.466500002891,2784.006800001487,0.0}
Trams145;14;13;13069;6:14;{5123.508700001985,2583.745899999514,0.0}
Trams141;14;5;13070;6:14;{2992.747200001031,1703.0900999996811,0.0}
Trams148;14;3;13077;6:15;{7477.508000001311,3581.729000000283,0.0}
Trams182;18;8;13078;6:15;{5058.904000002891,2546.714799998328,0.0}
Trams144;14;7;13080;6:16;{4722.0763000026345,2426.624300001189,0.0}
Trams183;18;4;13085;6:16;{845.340600002557,806.1041999999434,0.0}
Trams147;14;5;13092;6:18;{7477.508000001311,3581.729000000283,0.0}
Trams141;14;7;13101;6:19;{2894.896500002593,514.0241999980062,0.0}
Trams144;14;10;13101;6:19;{5689.812200002372,2815.7713999990374,0.0}
Trams183;18;9;13107;6:20;{1782.5218000002205,1208.6106000002474,0.0}
Trams146;14;4;13107;6:20;{7477.508000001311,3581.729000000283,0.0}
Trams141;14;18;13113;6:21;{2597.49450000003,904.9190000016242,0.0}
Trams183;18;16;13115;6:21;{2149.2538000009954,1363.784799998626,0.0}
Trams142;14;5;13119;6:22;{2894.896500002593,514.0241999980062,0.0}
Trams141;14;24;13121;6:22;{2839.1857000030577,1180.8036000002176,0.0}
Trams145;14;4;13122;6:23;{7477.508000001311,3581.729000000283,0.0}
Trams145;14;2;13123;6:23;{7477.508000001311,3581.729000000283,0.0}
Trams183;18;17;13125;6:23;{2627.1466000005603,1561.507400000468,0.0}
Trams181;18;3;13126;6:23;{7477.508000001311,3581.729000000283,0.0}
Trams181;18;2;13127;6:23;{7477.508000001311,3581.729000000283,0.0}
Trams182;18;10;13131;6:24;{2589.0274000018835,1538.5219000000507,0.0}
Trams142;14;6;13131;6:24;{2597.49450000003,904.9190000016242,0.0}
Trams183;18;16;13134;6:25;{3035.1652000024915,1729.7097000014037,0.0}
Trams141;14;23;13135;6:25;{3084.0353342962862,1747.4296273253601,0.0}
Trams142;14;8;13139;6:25;{2839.1857000030577,1180.8036000002176,0.0}
Trams182;18;9;13141;6:26;{2110.2352000027895,1344.0613000001758,0.0}
Trams144;14;2;13142;6:26;{7477.508000001311,3581.729000000283,0.0}
Trams182;18;8;13149;6:27;{1740.6504000015557,1186.7970000002533,0.0}
Trams182;18;7;13150;6:27;{1692.722305299079,1166.6255241828771,0.0}
Trams143;14;11;13154;6:28;{2894.896500002593,514.0241999980062,0.0}
Trams141;14;22;13156;6:28;{4084.1569000035524,2161.088000001386,0.0}
Trams143;14;14;13166;6:30;{2597.49450000003,904.9190000016242,0.0}
Trams141;14;21;13169;6:30;{4707.823850244834,2420.7529164061234,0.0}
Trams181;18;3;13170;6:31;{5634.466500002891,2784.006800001487,0.0}
Trams182;18;3;13170;6:31;{845.340600002557,806.1041999999434,0.0}
Trams183;18;19;13170;6:31;{4722.0763000026345,2426.624300001189,0.0}
Trams146;14;5;13171;6:31;{4672.309900000691,2395.577299999073,0.0}
Trams143;14;16;13174;6:31;{2839.1857000030577,1180.8036000002176,0.0}
Trams183;18;24;13179;6:32;{5123.508700001985,2583.745899999514,0.0}
Trams181;18;5;13182;6:33;{5058.904000002891,2546.714799998328,0.0}
Trams146;14;4;13185;6:33;{4031.8555000014603,2128.9623999986798,0.0}
Trams149;14;9;13188;6:34;{2894.896500002593,514.0241999980062,0.0}
Trams141;14;23;13191;6:34;{5689.812200002372,2815.7713999990374,0.0}
Trams182;18;4;13192;6:34;{1782.5218000002205,1208.6106000002474,0.0}
Trams144;14;3;13198;6:35;{5058.904000002891,2546.714799998328,0.0}
Trams182;18;6;13200;6:36;{2149.2538000009954,1363.784799998626,0.0}
Trams149;14;12;13200;6:36;{2597.49450000003,904.9190000016242,0.0}
Trams141;14;24;13202;6:36;{6221.943900000304,2968.579499999061,0.0}
Trams148;14;4;13208;6:37;{2894.896500002593,514.0241999980062,0.0}
Trams149;14;14;13208;6:37;{2839.1857000030577,1180.8036000002176,0.0}
Trams142;14;9;13209;6:37;{5689.812200002372,2815.7713999990374,0.0}
Trams143;14;17;13209;6:37;{4084.1569000035524,2161.088000001386,0.0}
Trams182;18;7;13210;6:37;{2627.1466000005603,1561.507400000468,0.0}
Trams183;18;23;13217;6:38;{6864.837443928478,3341.6995773341046,0.0}
Trams141;14;23;13217;6:38;{6864.837443928478,3341.6995773341046,0.0}
Trams182;18;6;13219;6:39;{3035.1652000024915,1729.7097000014037,0.0}
Trams142;14;12;13220;6:39;{6221.943900000304,2968.579499999061,0.0}
Trams144;14;2;13220;6:39;{4031.8555000014603,2128.9623999986798,0.0}
Trams148;14;6;13220;6:39;{2597.49450000003,904.9190000016242,0.0}
Trams143;14;19;13223;6:39;{4722.0763000026345,2426.624300001189,0.0}
Trams147;14;7;13223;6:39;{2894.896500002593,514.0241999980062,0.0}
Trams141;14;22;13226;6:40;{7223.311400000006,3570.043500000611,0.0}
Trams148;14;10;13228;6:40;{2839.1857000030577,1180.8036000002176,0.0}
Trams183;18;4;13232;6:41;{7477.508000001311,3581.729000000283,0.0}
Trams141;14;3;13232;6:41;{7477.508000001311,3581.729000000283,0.0}
Trams143;14;22;13232;6:41;{5123.508700001985,2583.745899999514,0.0}
Trams141;14;2;13233;6:41;{7477.508000001311,3581.729000000283,0.0}
Trams181;18;4;13235;6:41;{2589.0274000018835,1538.5219000000507,0.0}
Trams146;14;5;13238;6:42;{2894.896500002593,514.0241999980062,0.0}
Trams182;18;7;13241;6:42;{4084.1569000035524,2161.088000001386,0.0}
Trams147;14;9;13243;6:43;{2839.1857000030577,1180.8036000002176,0.0}
Trams143;14;24;13244;6:43;{5689.812200002372,2815.7713999990374,0.0}
Trams1410;14;1;13244;6:43;{5689.812200002372,2815.7713999990374,0.0}
Trams181;18;5;13245;6:43;{2110.2352000027895,1344.0613000001758,0.0}
Trams142;14;2;13250;6:44;{7477.508000001311,3581.729000000283,0.0}
Trams146;14;8;13250;6:44;{2597.49450000003,904.9190000016242,0.0}
Trams145;14;3;13253;6:44;{2894.896500002593,514.0241999980062,0.0}
Trams182;18;10;13255;6:45;{4722.0763000026345,2426.624300001189,0.0}
Trams182;18;12;13264;6:46;{5123.508700001985,2583.745899999514,0.0}
Trams149;14;15;13266;6:47;{5123.508700001985,2583.745899999514,0.0}
Trams181;18;3;13272;6:48;{874.5067790792331,818.4381949221134,0.0}
Trams181;18;4;13273;6:48;{845.340600002557,806.1041999999434,0.0}
Trams145;14;4;13273;6:48;{2839.1857000030577,1180.8036000002176,0.0}
Trams181;18;3;13274;6:48;{845.340600002557,806.1041999999434,0.0}
Trams182;18;13;13276;6:48;{5689.812200002372,2815.7713999990374,0.0}
Trams183;18;6;13276;6:48;{5634.466500002891,2784.006800001487,0.0}
Trams182;18;12;13277;6:48;{5739.764803540053,2830.2159521656795,0.0}
Trams147;14;8;13278;6:49;{4084.1569000035524,2161.088000001386,0.0}
Trams149;14;14;13279;6:49;{5739.764803540053,2830.2159521656795,0.0}
Trams143;14;7;13285;6:50;{7477.508000001311,3581.729000000283,0.0}
Trams144;14;5;13285;6:50;{2597.49450000003,904.9190000016242,0.0}
Trams1410;14;0;13285;6:50;{7477.508000001311,3581.729000000283,0.0}
Trams143;14;5;13286;6:50;{7477.508000001311,3581.729000000283,0.0}
Trams148;14;12;13286;6:50;{5123.508700001985,2583.745899999514,0.0}
Trams182;18;14;13287;6:50;{6221.943900000304,2968.579499999061,0.0}
Trams183;18;7;13288;6:50;{5058.904000002891,2546.714799998328,0.0}
Trams147;14;10;13292;6:51;{4722.0763000026345,2426.624300001189,0.0}
Trams181;18;6;13296;6:52;{1782.5218000002205,1208.6106000002474,0.0}
Trams183;18;9;13296;6:52;{4672.309900000691,2395.577299999073,0.0}
Trams181;18;8;13304;6:53;{2149.2538000009954,1363.784799998626,0.0}
Trams149;14;13;13304;6:53;{6864.837443928478,3341.6995773341046,0.0}
Trams142;14;3;13306;6:53;{5058.904000002891,2546.714799998328,0.0}
Trams146;14;10;13307;6:53;{4722.0763000026345,2426.624300001189,0.0}
Trams148;14;11;13309;6:54;{6221.943900000304,2968.579499999061,0.0}
Trams183;18;10;13310;6:54;{4031.8555000014603,2128.9623999986798,0.0}
Trams182;18;12;13312;6:54;{7267.007879060962,3598.2324644667874,0.0}
Trams181;18;12;13314;6:55;{2627.1466000005603,1561.507400000468,0.0}
Trams182;18;4;13317;6:55;{7477.508000001311,3581.729000000283,0.0}
Trams182;18;3;13318;6:55;{7477.508000001311,3581.729000000283,0.0}
Trams149;14;7;13319;6:55;{7477.508000001311,3581.729000000283,0.0}
Trams149;14;6;13320;6:56;{7477.508000001311,3581.729000000283,0.0}
Trams145;14;7;13322;6:56;{4722.0763000026345,2426.624300001189,0.0}
Trams145;14;9;13331;6:57;{5123.508700001985,2583.745899999514,0.0}
Trams183;18;8;13332;6:58;{2992.747200001031,1703.0900999996811,0.0}
Trams183;18;7;13333;6:58;{2942.963136644313,1688.2069726773154,0.0}
Trams148;14;4;13339;6:59;{7477.508000001311,3581.729000000283,0.0}
Trams148;14;3;13340;6:59;{7477.508000001311,3581.729000000283,0.0}
Trams144;14;6;13342;6:59;{4722.0763000026345,2426.624300001189,0.0}
Trams145;14;10;13343;6:59;{5689.812200002372,2815.7713999990374,0.0}
Trams142;14;2;13350;7:1;{2992.747200001031,1703.0900999996811,0.0}
Trams183;18;6;13351;7:1;{2110.2352000027895,1344.0613000001758,0.0}
Trams144;14;7;13351;7:1;{5123.508700001985,2583.745899999514,0.0}
Trams183;18;5;13352;7:1;{2064.0685709043055,1320.5282183098925,0.0}
Trams146;14;9;13354;7:1;{6864.837443928478,3341.6995773341046,0.0}
Trams147;14;4;13354;7:1;{7477.508000001311,3581.729000000283,0.0}
Trams181;18;14;13359;7:2;{4722.0763000026345,2426.624300001189,0.0}
Trams143;14;4;13362;7:3;{4048.297289360261,2135.7927898531034,0.0}
Trams141;14;9;13363;7:3;{2894.896500002593,514.0241999980062,0.0}
Trams181;18;18;13368;7:4;{5123.508700001985,2583.745899999514,0.0}
Trams145;14;9;13369;7:4;{6864.837443928478,3341.6995773341046,0.0}
Trams146;14;4;13369;7:4;{7477.508000001311,3581.729000000283,0.0}
Trams146;14;3;13370;7:4;{7477.508000001311,3581.729000000283,0.0}
Trams144;14;8;13374;7:5;{6221.943900000304,2968.579499999061,0.0}
Trams141;14;19;13375;7:5;{2597.49450000003,904.9190000016242,0.0}
Trams183;18;6;13379;7:5;{845.340600002557,806.1041999999434,0.0}
Trams181;18;19;13380;7:6;{5689.812200002372,2815.7713999990374,0.0}
Trams183;18;5;13380;7:6;{845.340600002557,806.1041999999434,0.0}
Trams182;18;4;13381;7:6;{4672.309900000691,2395.577299999073,0.0}
Trams142;14;6;13381;7:6;{2894.896500002593,514.0241999980062,0.0}
Trams141;14;24;13383;7:6;{2839.1857000030577,1180.8036000002176,0.0}
Trams145;14;3;13384;7:6;{7477.508000001311,3581.729000000283,0.0}
Trams145;14;2;13385;7:6;{7477.508000001311,3581.729000000283,0.0}
Trams145;14;1;13387;7:7;{7399.735580409566,3546.353579350148,0.0}
Trams181;18;20;13391;7:7;{6221.943900000304,2968.579499999061,0.0}
Trams142;14;8;13393;7:8;{2597.49450000003,904.9190000016242,0.0}
Trams182;18;5;13395;7:8;{4031.8555000014603,2128.9623999986798,0.0}
Trams149;14;5;13396;7:8;{4048.297289360261,2135.7927898531034,0.0}
Trams144;14;7;13398;7:9;{7223.311400000006,3570.043500000611,0.0}
Trams147;14;6;13398;7:9;{5634.466500002891,2784.006800001487,0.0}
Trams142;14;16;13401;7:9;{2839.1857000030577,1180.8036000002176,0.0}
Trams144;14;5;13404;7:10;{7477.508000001311,3581.729000000283,0.0}
Trams144;14;4;13405;7:10;{7477.508000001311,3581.729000000283,0.0}
Trams181;18;19;13406;7:10;{6864.837443928478,3341.6995773341046,0.0}
Trams181;18;18;13407;7:10;{6883.719200000167,3354.242599999532,0.0}
Trams183;18;10;13410;7:11;{2149.2538000009954,1363.784799998626,0.0}
Trams142;14;17;13414;7:11;{3035.1652000024915,1729.7097000014037,0.0}
Trams143;14;8;13416;7:12;{2894.896500002593,514.0241999980062,0.0}
Trams182;18;4;13418;7:12;{2942.963136644313,1688.2069726773154,0.0}
Trams141;14;23;13418;7:12;{4084.1569000035524,2161.088000001386,0.0}
Trams147;14;7;13418;7:12;{4672.309900000691,2395.577299999073,0.0}
Trams183;18;14;13420;7:12;{2627.1466000005603,1561.507400000468,0.0}
Trams181;18;2;13421;7:12;{7477.508000001311,3581.729000000283,0.0}
Trams143;14;16;13428;7:14;{2597.49450000003,904.9190000016242,0.0}
Trams183;18;15;13429;7:14;{3035.1652000024915,1729.7097000014037,0.0}
Trams141;14;24;13432;7:14;{4722.0763000026345,2426.624300001189,0.0}
Trams146;14;4;13433;7:14;{4672.309900000691,2395.577299999073,0.0}
Trams182;18;5;13436;7:15;{2110.2352000027895,1344.0613000001758,0.0}
Trams142;14;19;13436;7:15;{4084.1569000035524,2161.088000001386,0.0}
Trams143;14;20;13436;7:15;{2839.1857000030577,1180.8036000002176,0.0}
Trams182;18;4;13445;7:16;{1692.722305299079,1166.6255241828771,0.0}
Trams142;14;24;13450;7:17;{4722.0763000026345,2426.624300001189,0.0}
Trams149;14;8;13450;7:17;{2894.896500002593,514.0241999980062,0.0}
Trams1411;14;10;13450;7:17;{4722.0763000026345,2426.624300001189,0.0}
Trams181;18;3;13453;7:18;{6188.119100000709,2954.7112999986857,0.0}
Trams147;14;6;13454;7:18;{2992.747200001031,1703.0900999996811,0.0}
Trams1411;14;15;13459;7:19;{5123.508700001985,2583.745899999514,0.0}
Trams149;14;11;13462;7:19;{2597.49450000003,904.9190000016242,0.0}
Trams181;18;6;13465;7:20;{5634.466500002891,2784.006800001487,0.0}
Trams183;18;21;13465;7:20;{4722.0763000026345,2426.624300001189,0.0}
Trams147;14;5;13468;7:20;{2774.94460455129,1095.9101807449765,0.0}
Trams148;14;6;13470;7:21;{2894.896500002593,514.0241999980062,0.0}
Trams149;14;16;13470;7:21;{2839.1857000030577,1180.8036000002176,0.0}
Trams143;14;19;13471;7:21;{4084.1569000035524,2161.088000001386,0.0}
Trams1411;14;22;13471;7:21;{5689.812200002372,2815.7713999990374,0.0}
Trams142;14;23;13472;7:21;{5739.764803540053,2830.2159521656795,0.0}
Trams183;18;22;13474;7:21;{5123.508700001985,2583.745899999514,0.0}
Trams142;14;24;13482;7:23;{6221.943900000304,2968.579499999061,0.0}
Trams148;14;14;13482;7:23;{2597.49450000003,904.9190000016242,0.0}
Trams1411;14;24;13482;7:23;{6221.943900000304,2968.579499999061,0.0}
Trams181;18;7;13485;7:23;{4672.309900000691,2395.577299999073,0.0}
Trams143;14;21;13485;7:23;{4722.0763000026345,2426.624300001189,0.0}
Trams182;18;5;13487;7:23;{1782.5218000002205,1208.6106000002474,0.0}
Trams146;14;3;13490;7:24;{2567.6414284064917,825.1840510346515,0.0}
Trams148;14;15;13490;7:24;{2839.1857000030577,1180.8036000002176,0.0}
Trams141;14;4;13494;7:25;{7477.508000001311,3581.729000000283,0.0}
Trams182;18;12;13495;7:25;{2149.2538000009954,1363.784799998626,0.0}
Trams141;14;2;13495;7:25;{7477.508000001311,3581.729000000283,0.0}
Trams147;14;6;13497;7:25;{2597.49450000003,904.9190000016242,0.0}
Trams1411;14;23;13498;7:25;{6883.719200000167,3354.242599999532,0.0}
Trams146;14;7;13500;7:26;{2894.896500002593,514.0241999980062,0.0}
Trams182;18;14;13505;7:26;{2627.1466000005603,1561.507400000468,0.0}
Trams147;14;8;13505;7:26;{2839.1857000030577,1180.8036000002176,0.0}
Trams143;14;23;13506;7:27;{5689.812200002372,2815.7713999990374,0.0}
Trams142;14;23;13507;7:27;{7267.007879060962,3598.2324644667874,0.0}
Trams1411;14;22;13507;7:27;{7267.007879060962,3598.2324644667874,0.0}
Trams142;14;3;13512;7:28;{7477.508000001311,3581.729000000283,0.0}
Trams146;14;9;13512;7:28;{2597.49450000003,904.9190000016242,0.0}
Trams1411;14;0;13512;7:28;{7477.508000001311,3581.729000000283,0.0}
Trams183;18;21;13513;7:28;{6883.719200000167,3354.242599999532,0.0}
Trams182;18;15;13514;7:28;{3035.1652000024915,1729.7097000014037,0.0}
Trams145;14;2;13515;7:28;{2894.896500002593,514.0241999980062,0.0}
Trams143;14;22;13518;7:29;{6271.932036142039,2982.903802087056,0.0}
Trams147;14;7;13519;7:29;{3084.0353342962862,1747.4296273253601,0.0}
Trams149;14;20;13519;7:29;{4722.0763000026345,2426.624300001189,0.0}
Trams146;14;11;13520;7:29;{2839.1857000030577,1180.8036000002176,0.0}
Trams181;18;6;13521;7:29;{2992.747200001031,1703.0900999996811,0.0}
Trams183;18;3;13527;7:30;{7477.508000001311,3581.729000000283,0.0}
Trams145;14;3;13527;7:30;{2597.49450000003,904.9190000016242,0.0}
Trams149;14;24;13528;7:30;{5123.508700001985,2583.745899999514,0.0}
Trams144;14;7;13535;7:31;{2894.896500002593,514.0241999980062,0.0}
Trams145;14;4;13535;7:31;{2839.1857000030577,1180.8036000002176,0.0}
Trams182;18;14;13536;7:32;{4084.1569000035524,2161.088000001386,0.0}
Trams144;14;9;13536;7:32;{2892.683600001037,511.3241000007838,0.0}
Trams148;14;16;13539;7:32;{4722.0763000026345,2426.624300001189,0.0}
Trams143;14;4;13547;7:33;{7477.508000001311,3581.729000000283,0.0}
Trams144;14;10;13547;7:33;{2597.49450000003,904.9190000016242,0.0}
Trams181;18;7;13548;7:34;{1740.6504000015557,1186.7970000002533,0.0}
Trams143;14;3;13548;7:34;{7477.508000001311,3581.729000000283,0.0}
Trams148;14;21;13548;7:34;{5123.508700001985,2583.745899999514,0.0}
Trams181;18;6;13549;7:34;{1692.722305299079,1166.6255241828771,0.0}
Trams145;14;3;13549;7:34;{3084.0353342962862,1747.4296273253601,0.0}
Trams182;18;17;13550;7:34;{4722.0763000026345,2426.624300001189,0.0}
Trams141;14;3;13550;7:34;{5058.904000002891,2546.714799998328,0.0}
Trams144;14;14;13555;7:35;{2839.1857000030577,1180.8036000002176,0.0}
Trams146;14;12;13555;7:35;{4084.1569000035524,2161.088000001386,0.0}
Trams141;14;4;13558;7:35;{4672.309900000691,2395.577299999073,0.0}
Trams181;18;5;13560;7:36;{1208.916700001806,962.1525999996811,0.0}
Trams148;14;24;13560;7:36;{5689.812200002372,2815.7713999990374,0.0}
Trams147;14;8;13563;7:36;{5123.508700001985,2583.745899999514,0.0}
Trams149;14;23;13566;7:37;{6864.837443928478,3341.6995773341046,0.0}
Trams146;14;14;13569;7:37;{4722.0763000026345,2426.624300001189,0.0}
Trams182;18;18;13571;7:37;{5689.812200002372,2815.7713999990374,0.0}
Trams182;18;17;13572;7:38;{5739.764803540053,2830.2159521656795,0.0}
Trams141;14;3;13572;7:38;{4031.8555000014603,2128.9623999986798,0.0}
Trams146;14;15;13578;7:39;{5123.508700001985,2583.745899999514,0.0}
Trams181;18;6;13579;7:39;{1241.924200002104,980.4126999992877,0.0}
Trams149;14;4;13581;7:39;{7477.508000001311,3581.729000000283,0.0}
Trams182;18;18;13582;7:39;{6221.943900000304,2968.579499999061,0.0}
Trams183;18;6;13583;7:39;{5058.904000002891,2546.714799998328,0.0}
Trams148;14;23;13586;7:40;{6864.837443928478,3341.6995773341046,0.0}
Trams144;14;16;13590;7:41;{4084.1569000035524,2161.088000001386,0.0}
Trams146;14;17;13590;7:41;{5689.812200002372,2815.7713999990374,0.0}
Trams181;18;11;13591;7:41;{1782.5218000002205,1208.6106000002474,0.0}
Trams183;18;7;13591;7:41;{4672.309900000691,2395.577299999073,0.0}
Trams145;14;5;13593;7:41;{5123.508700001985,2583.745899999514,0.0}
Trams141;14;4;13594;7:41;{2992.747200001031,1703.0900999996811,0.0}
Trams148;14;22;13596;7:42;{7267.007879060962,3598.2324644667874,0.0}
Trams182;18;17;13597;7:42;{6864.837443928478,3341.6995773341046,0.0}
Trams181;18;18;13599;7:42;{2149.2538000009954,1363.784799998626,0.0}
Trams146;14;18;13601;7:42;{6221.943900000304,2968.579499999061,0.0}
Trams148;14;3;13601;7:42;{7477.508000001311,3581.729000000283,0.0}
Trams148;14;2;13602;7:43;{7477.508000001311,3581.729000000283,0.0}
Trams144;14;21;13604;7:43;{4722.0763000026345,2426.624300001189,0.0}
Trams183;18;8;13605;7:43;{4031.8555000014603,2128.9623999986798,0.0}
Trams141;14;3;13607;7:43;{2808.1955000013113,1135.889900000766,0.0}
Trams181;18;22;13609;7:44;{2627.1466000005603,1561.507400000468,0.0}
Trams182;18;2;13612;7:44;{7477.508000001311,3581.729000000283,0.0}
Trams147;14;1;13616;7:45;{7477.508000001311,3581.729000000283,0.0}
Trams141;14;12;13625;7:46;{2894.896500002593,514.0241999980062,0.0}
Trams141;14;13;13626;7:47;{2892.683600001037,511.3241000007838,0.0}
Trams183;18;9;13627;7:47;{2992.747200001031,1703.0900999996811,0.0}
Trams146;14;1;13631;7:47;{7477.508000001311,3581.729000000283,0.0}
Trams183;18;10;13636;7:48;{2589.0274000018835,1538.5219000000507,0.0}
Trams141;14;24;13637;7:48;{2597.49450000003,904.9190000016242,0.0}
Trams142;14;6;13643;7:49;{2894.896500002593,514.0241999980062,0.0}
Trams142;14;7;13644;7:50;{2892.683600001037,511.3241000007838,0.0}
Trams145;14;1;13646;7:50;{7477.508000001311,3581.729000000283,0.0}
Trams181;18;24;13654;7:51;{4722.0763000026345,2426.624300001189,0.0}
Trams183;18;8;13654;7:51;{1740.6504000015557,1186.7970000002533,0.0}
Trams183;18;6;13655;7:51;{1692.722305299079,1166.6255241828771,0.0}
Trams142;14;12;13655;7:51;{2597.49450000003,904.9190000016242,0.0}
Trams182;18;4;13656;7:52;{5634.466500002891,2784.006800001487,0.0}
Trams148;14;3;13657;7:52;{5058.904000002891,2546.714799998328,0.0}
Trams141;14;23;13659;7:52;{3084.0353342962862,1747.4296273253601,0.0}
Trams142;14;24;13663;7:53;{2839.1857000030577,1180.8036000002176,0.0}
Trams1411;14;2;13663;7:53;{2839.1857000030577,1180.8036000002176,0.0}
Trams144;14;5;13666;7:53;{7477.508000001311,3581.729000000283,0.0}
Trams144;14;4;13667;7:53;{7477.508000001311,3581.729000000283,0.0}
Trams182;18;6;13668;7:54;{5058.904000002891,2546.714799998328,0.0}
Trams183;18;4;13675;7:55;{845.340600002557,806.1041999999434,0.0}
Trams182;18;7;13676;7:55;{4672.309900000691,2395.577299999073,0.0}
Trams143;14;13;13678;7:55;{2894.896500002593,514.0241999980062,0.0}
Trams148;14;2;13678;7:55;{4048.297289360261,2135.7927898531034,0.0}
Trams181;18;23;13687;7:57;{6271.932036142039,2982.903802087056,0.0}
Trams182;18;8;13690;7:57;{4031.8555000014603,2128.9623999986798,0.0}
Trams143;14;19;13690;7:57;{2597.49450000003,904.9190000016242,0.0}
Trams141;14;24;13694;7:58;{4722.0763000026345,2426.624300001189,0.0}
Trams143;14;24;13698;7:59;{2839.1857000030577,1180.8036000002176,0.0}
Trams1410;14;8;13698;7:59;{2839.1857000030577,1180.8036000002176,0.0}
Trams145;14;2;13702;7:59;{5058.904000002891,2546.714799998328,0.0}
Trams183;18;9;13705;8:0;{2149.2538000009954,1363.784799998626,0.0}
Trams149;14;9;13712;8:1;{2894.896500002593,514.0241999980062,0.0}
Trams1411;14;11;13712;8:1;{4722.0763000026345,2426.624300001189,0.0}
Trams182;18;7;13713;8:1;{2942.963136644313,1688.2069726773154,0.0}
Trams183;18;13;13715;8:1;{2627.1466000005603,1561.507400000468,0.0}
Trams181;18;4;13716;8:2;{7477.508000001311,3581.729000000283,0.0}
Trams181;18;3;13717;8:2;{7477.508000001311,3581.729000000283,0.0}
Trams142;14;23;13720;8:2;{5108.905971347362,2577.745680309252,0.0}
Trams182;18;6;13721;8:2;{2589.0274000018835,1538.5219000000507,0.0}
Trams142;14;24;13721;8:2;{5123.508700001985,2583.745899999514,0.0}
Trams1411;14;24;13721;8:2;{5123.508700001985,2583.745899999514,0.0}
Trams183;18;12;13724;8:3;{3035.1652000024915,1729.7097000014037,0.0}
Trams149;14;10;13724;8:3;{2597.49450000003,904.9190000016242,0.0}
Trams182;18;7;13731;8:4;{2110.2352000027895,1344.0613000001758,0.0}
Trams148;14;3;13732;8:4;{2894.896500002593,514.0241999980062,0.0}
Trams149;14;12;13732;8:4;{2839.1857000030577,1180.8036000002176,0.0}
Trams1410;14;10;13733;8:4;{4084.1569000035524,2161.088000001386,0.0}
Trams141;14;23;13741;8:6;{6864.837443928478,3341.6995773341046,0.0}
Trams141;14;22;13742;8:6;{6883.719200000167,3354.242599999532,0.0}
Trams148;14;4;13744;8:6;{2597.49450000003,904.9190000016242,0.0}
Trams145;14;1;13747;8:7;{2952.0448504139104,1673.1693294131398,0.0}
Trams147;14;4;13747;8:7;{2894.896500002593,514.0241999980062,0.0}
Trams1410;14;15;13747;8:7;{4722.0763000026345,2426.624300001189,0.0}
Trams181;18;4;13748;8:7;{6188.119100000709,2954.7112999986857,0.0}
Trams148;14;6;13752;8:8;{2839.1857000030577,1180.8036000002176,0.0}
Trams141;14;3;13756;8:8;{7477.508000001311,3581.729000000283,0.0}
Trams1410;14;19;13756;8:8;{5123.508700001985,2583.745899999514,0.0}
Trams141;14;2;13757;8:8;{7477.508000001311,3581.729000000283,0.0}
Trams182;18;5;13758;8:9;{874.5067790792331,818.4381949221134,0.0}
Trams147;14;7;13759;8:9;{2597.49450000003,904.9190000016242,0.0}
Trams181;18;5;13760;8:9;{5634.466500002891,2784.006800001487,0.0}
Trams182;18;2;13760;8:9;{845.340600002557,806.1041999999434,0.0}
Trams183;18;13;13760;8:9;{4722.0763000026345,2426.624300001189,0.0}
Trams147;14;8;13767;8:10;{2839.1857000030577,1180.8036000002176,0.0}
Trams1410;14;24;13768;8:10;{5689.812200002372,2815.7713999990374,0.0}
Trams181;18;8;13772;8:11;{5058.904000002891,2546.714799998328,0.0}
Trams142;14;2;13774;8:11;{7477.508000001311,3581.729000000283,0.0}
Trams1411;14;0;13774;8:11;{7477.508000001311,3581.729000000283,0.0}
Trams145;14;2;13777;8:12;{2894.896500002593,514.0241999980062,0.0}
Trams181;18;9;13780;8:12;{4672.309900000691,2395.577299999073,0.0}
Trams183;18;16;13781;8:12;{5689.812200002372,2815.7713999990374,0.0}
Trams147;14;7;13781;8:12;{3084.0353342962862,1747.4296273253601,0.0}
Trams145;14;7;13789;8:14;{2597.49450000003,904.9190000016242,0.0}
Trams182;18;6;13790;8:14;{2149.2538000009954,1363.784799998626,0.0}
Trams149;14;14;13790;8:14;{5123.508700001985,2583.745899999514,0.0}
Trams183;18;19;13792;8:14;{6221.943900000304,2968.579499999061,0.0}
Trams181;18;8;13793;8:14;{4048.297289360261,2135.7927898531034,0.0}
Trams144;14;5;13797;8:15;{2894.896500002593,514.0241999980062,0.0}
Trams145;14;8;13797;8:15;{2839.1857000030577,1180.8036000002176,0.0}
Trams182;18;9;13800;8:16;{2627.1466000005603,1561.507400000468,0.0}
Trams141;14;3;13800;8:16;{5634.466500002891,2784.006800001487,0.0}
Trams149;14;15;13802;8:16;{5689.812200002372,2815.7713999990374,0.0}
Trams1410;14;23;13804;8:16;{7267.007879060962,3598.2324644667874,0.0}
Trams143;14;4;13809;8:17;{7477.508000001311,3581.729000000283,0.0}
Trams144;14;6;13809;8:17;{2597.49450000003,904.9190000016242,0.0}
Trams1410;14;1;13809;8:17;{7477.508000001311,3581.729000000283,0.0}
Trams143;14;2;13810;8:17;{7477.508000001311,3581.729000000283,0.0}
Trams148;14;7;13810;8:17;{5123.508700001985,2583.745899999514,0.0}
Trams1410;14;0;13810;8:17;{7477.508000001311,3581.729000000283,0.0}
Trams149;14;16;13813;8:18;{6221.943900000304,2968.579499999061,0.0}
Trams147;14;8;13816;8:18;{4722.0763000026345,2426.624300001189,0.0}
Trams149;14;15;13821;8:19;{6593.146138654794,3149.575753243163,0.0}
Trams183;18;5;13822;8:19;{7477.508000001311,3581.729000000283,0.0}
Trams183;18;4;13823;8:19;{7477.508000001311,3581.729000000283,0.0}
Trams181;18;7;13825;8:20;{2589.0274000018835,1538.5219000000507,0.0}
Trams147;14;9;13825;8:20;{5123.508700001985,2583.745899999514,0.0}
Trams148;14;8;13833;8:21;{6221.943900000304,2968.579499999061,0.0}
Trams149;14;16;13837;8:22;{7223.311400000006,3570.043500000611,0.0}
Trams149;14;5;13843;8:23;{7477.508000001311,3581.729000000283,0.0}
Trams181;18;6;13844;8:23;{1692.722305299079,1166.6255241828771,0.0}
Trams149;14;3;13844;8:23;{7477.508000001311,3581.729000000283,0.0}
Trams182;18;10;13845;8:23;{4722.0763000026345,2426.624300001189,0.0}
Trams148;14;7;13849;8:24;{6883.719200000167,3354.242599999532,0.0}
Trams144;14;7;13852;8:24;{4084.1569000035524,2161.088000001386,0.0}
Trams182;18;11;13854;8:25;{5123.508700001985,2583.745899999514,0.0}
Trams183;18;5;13854;8:25;{6188.119100000709,2954.7112999986857,0.0}
Trams141;14;2;13856;8:25;{2992.747200001031,1703.0900999996811,0.0}
Trams148;14;1;13863;8:26;{7477.508000001311,3581.729000000283,0.0}
Trams181;18;3;13864;8:26;{845.340600002557,806.1041999999434,0.0}
Trams148;14;0;13864;8:26;{7477.508000001311,3581.729000000283,0.0}
Trams181;18;4;13866;8:27;{902.5305000022054,834.7037000004202,0.0}
Trams183;18;6;13866;8:27;{5634.466500002891,2784.006800001487,0.0}
Trams144;14;9;13866;8:27;{4722.0763000026345,2426.624300001189,0.0}
Trams181;18;5;13874;8:28;{1241.924200002104,980.4126999992877,0.0}
Trams144;14;10;13875;8:28;{5123.508700001985,2583.745899999514,0.0}
Trams149;14;2;13876;8:28;{6138.21238208538,2940.1058384544613,0.0}
Trams183;18;8;13878;8:29;{5058.904000002891,2546.714799998328,0.0}
Trams147;14;1;13878;8:29;{7477.508000001311,3581.729000000283,0.0}
Trams147;14;0;13879;8:29;{7477.508000001311,3581.729000000283,0.0}
Trams181;18;6;13886;8:30;{1782.5218000002205,1208.6106000002474,0.0}
Trams183;18;9;13886;8:30;{4672.309900000691,2395.577299999073,0.0}
Trams141;14;9;13887;8:30;{2894.896500002593,514.0241999980062,0.0}
Trams181;18;13;13894;8:31;{2149.2538000009954,1363.784799998626,0.0}
Trams145;14;7;13894;8:31;{6883.719200000167,3354.242599999532,0.0}
Trams144;14;11;13898;8:32;{6221.943900000304,2968.579499999061,0.0}
Trams141;14;17;13899;8:32;{2597.49450000003,904.9190000016242,0.0}
Trams183;18;10;13900;8:32;{4031.8555000014603,2128.9623999986798,0.0}
Trams182;18;10;13901;8:32;{7223.311400000006,3570.043500000611,0.0}
Trams145;14;6;13903;8:33;{7267.007879060962,3598.2324644667874,0.0}
Trams181;18;14;13904;8:33;{2627.1466000005603,1561.507400000468,0.0}
Trams182;18;2;13907;8:33;{7477.508000001311,3581.729000000283,0.0}
Trams141;14;24;13907;8:33;{2839.1857000030577,1180.8036000002176,0.0}
Trams145;14;1;13908;8:34;{7477.508000001311,3581.729000000283,0.0}
Trams142;14;3;13917;8:35;{2597.49450000003,904.9190000016242,0.0}
Trams141;14;22;13921;8:36;{3084.0353342962862,1747.4296273253601,0.0}
Trams144;14;12;13922;8:36;{7223.311400000006,3570.043500000611,0.0}
Trams142;14;5;13925;8:36;{2839.1857000030577,1180.8036000002176,0.0}
Trams144;14;4;13928;8:37;{7477.508000001311,3581.729000000283,0.0}
Trams144;14;3;13929;8:37;{7477.508000001311,3581.729000000283,0.0}
Trams145;14;0;13932;8:38;{6563.806600000709,3123.2601999994367,0.0}
Trams181;18;16;13935;8:38;{4084.1569000035524,2161.088000001386,0.0}
Trams183;18;9;13941;8:39;{2110.2352000027895,1344.0613000001758,0.0}
Trams181;18;18;13949;8:40;{4722.0763000026345,2426.624300001189,0.0}
Trams183;18;10;13949;8:40;{1740.6504000015557,1186.7970000002533,0.0}
Trams182;18;4;13951;8:41;{5634.466500002891,2784.006800001487,0.0}
Trams143;14;6;13952;8:41;{2597.49450000003,904.9190000016242,0.0}
Trams145;14;1;13952;8:41;{5634.466500002891,2784.006800001487,0.0}
Trams181;18;24;13958;8:42;{5123.508700001985,2583.745899999514,0.0}
Trams143;14;11;13960;8:42;{2839.1857000030577,1180.8036000002176,0.0}
Trams182;18;5;13963;8:43;{5058.904000002891,2546.714799998328,0.0}
Trams141;14;23;13965;8:43;{5123.508700001985,2583.745899999514,0.0}
Trams183;18;9;13968;8:44;{874.5067790792331,818.4381949221134,0.0}
Trams183;18;5;13970;8:44;{845.340600002557,806.1041999999434,0.0}
Trams142;14;6;13974;8:45;{4722.0763000026345,2426.624300001189,0.0}
Trams143;14;10;13974;8:45;{3084.0353342962862,1747.4296273253601,0.0}
Trams149;14;4;13974;8:45;{2894.896500002593,514.0241999980062,0.0}
Trams141;14;24;13977;8:45;{5689.812200002372,2815.7713999990374,0.0}
Trams141;14;23;13978;8:45;{5739.764803540053,2830.2159521656795,0.0}
Trams149;14;6;13986;8:47;{2597.49450000003,904.9190000016242,0.0}
Trams141;14;24;13988;8:47;{6221.943900000304,2968.579499999061,0.0}
Trams181;18;23;13989;8:47;{6593.146138654794,3149.575753243163,0.0}
Trams181;18;24;13990;8:47;{6609.992500003427,3161.7836000006646,0.0}
Trams149;14;7;13994;8:48;{2839.1857000030577,1180.8036000002176,0.0}
Trams142;14;10;13995;8:48;{5689.812200002372,2815.7713999990374,0.0}
Trams183;18;15;14000;8:49;{2149.2538000009954,1363.784799998626,0.0}
Trams181;18;22;14006;8:50;{7267.007879060962,3598.2324644667874,0.0}
Trams142;14;11;14006;8:50;{6221.943900000304,2968.579499999061,0.0}
Trams148;14;2;14006;8:50;{2597.49450000003,904.9190000016242,0.0}
Trams182;18;6;14007;8:50;{2992.747200001031,1703.0900999996811,0.0}
Trams149;14;8;14007;8:50;{3035.1652000024915,1729.7097000014037,0.0}
Trams143;14;12;14009;8:50;{4722.0763000026345,2426.624300001189,0.0}
Trams147;14;2;14009;8:50;{2894.896500002593,514.0241999980062,0.0}
Trams183;18;18;14010;8:51;{2627.1466000005603,1561.507400000468,0.0}
Trams147;14;3;14010;8:51;{2892.683600001037,511.3241000007838,0.0}
Trams181;18;4;14011;8:51;{7477.508000001311,3581.729000000283,0.0}
Trams141;14;5;14018;8:52;{7477.508000001311,3581.729000000283,0.0}
Trams143;14;13;14018;8:52;{5123.508700001985,2583.745899999514,0.0}
Trams183;18;17;14019;8:52;{3035.1652000024915,1729.7097000014037,0.0}
Trams141;14;2;14019;8:52;{7477.508000001311,3581.729000000283,0.0}
Trams147;14;4;14021;8:52;{2597.49450000003,904.9190000016242,0.0}
Trams145;14;0;14022;8:53;{2774.94460455129,1095.9101807449765,0.0}
Trams182;18;5;14026;8:53;{2110.2352000027895,1344.0613000001758,0.0}
Trams147;14;7;14029;8:54;{2839.1857000030577,1180.8036000002176,0.0}
Trams149;14;10;14029;8:54;{4084.1569000035524,2161.088000001386,0.0}
Trams143;14;15;14030;8:54;{5689.812200002372,2815.7713999990374,0.0}
Trams142;14;2;14036;8:55;{7477.508000001311,3581.729000000283,0.0}
Trams183;18;16;14041;8:56;{4084.1569000035524,2161.088000001386,0.0}
Trams143;14;16;14041;8:56;{6221.943900000304,2968.579499999061,0.0}
Trams144;14;4;14041;8:56;{2808.1955000013113,1135.889900000766,0.0}
Trams181;18;5;14043;8:56;{6188.119100000709,2954.7112999986857,0.0}
Trams149;14;12;14043;8:56;{4722.0763000026345,2426.624300001189,0.0}
Trams146;14;2;14044;8:56;{2839.1857000030577,1180.8036000002176,0.0}
Trams142;14;1;14045;8:56;{7172.43200000003,3532.2607999984175,0.0}
Trams182;18;4;14046;8:57;{1208.916700001806,962.1525999996811,0.0}
Trams148;14;1;14049;8:57;{4084.1569000035524,2161.088000001386,0.0}
Trams145;14;2;14051;8:57;{2597.49450000003,904.9190000016242,0.0}
Trams149;14;14;14052;8:58;{5123.508700001985,2583.745899999514,0.0}
Trams182;18;3;14055;8:58;{845.340600002557,806.1041999999434,0.0}
Trams183;18;17;14055;8:58;{4722.0763000026345,2426.624300001189,0.0}
Trams144;14;5;14059;8:59;{2894.896500002593,514.0241999980062,0.0}
Trams145;14;4;14059;8:59;{2839.1857000030577,1180.8036000002176,0.0}
Trams141;14;3;14062;8:59;{5634.466500002891,2784.006800001487,0.0}
Trams183;18;18;14064;9:0;{5123.508700001985,2583.745899999514,0.0}
Trams149;14;15;14064;9:0;{5689.812200002372,2815.7713999990374,0.0}
Trams149;14;14;14065;9:0;{5739.764803540053,2830.2159521656795,0.0}
Trams143;14;15;14066;9:0;{7267.007879060962,3598.2324644667874,0.0}
Trams181;18;7;14067;9:0;{5058.904000002891,2546.714799998328,0.0}
Trams143;14;3;14071;9:1;{7477.508000001311,3581.729000000283,0.0}
Trams143;14;1;14072;9:1;{7477.508000001311,3581.729000000283,0.0}
Trams181;18;9;14075;9:1;{4672.309900000691,2395.577299999073,0.0}
Trams149;14;15;14075;9:1;{6221.943900000304,2968.579499999061,0.0}
Trams147;14;6;14077;9:2;{4707.823850244834,2420.7529164061234,0.0}
Trams182;18;4;14085;9:3;{2149.2538000009954,1363.784799998626,0.0}
Trams181;18;8;14088;9:4;{4048.297289360261,2135.7927898531034,0.0}
Trams145;14;3;14095;9:5;{4132.967545312427,2178.980077572535,0.0}
Trams183;18;17;14096;9:5;{6609.992500003427,3161.7836000006646,0.0}
Trams149;14;2;14105;9:6;{7477.508000001311,3581.729000000283,0.0}
Trams181;18;7;14111;9:7;{2992.747200001031,1703.0900999996811,0.0}
Trams183;18;5;14117;9:8;{7477.508000001311,3581.729000000283,0.0}
Trams181;18;6;14120;9:9;{2589.0274000018835,1538.5219000000507,0.0}
Trams146;14;1;14125;9:10;{6221.943900000304,2968.579499999061,0.0}
Trams148;14;0;14125;9:10;{7477.508000001311,3581.729000000283,0.0}
Trams181;18;4;14130;9:11;{2110.2352000027895,1344.0613000001758,0.0}
Trams141;14;2;14139;9:12;{2567.6414284064917,825.1840510346515,0.0}
Trams147;14;0;14140;9:12;{7477.508000001311,3581.729000000283,0.0}
Trams146;14;0;14141;9:12;{6883.719200000167,3354.242599999532,0.0}
Trams145;14;0;14170;9:17;{7477.508000001311,3581.729000000283,0.0}
Trams144;14;4;14190;9:21;{7477.508000001311,3581.729000000283,0.0}
Trams182;18;3;14202;9:23;{7477.508000001311,3581.729000000283,0.0}
Trams141;14;1;14280;9:36;{7477.508000001311,3581.729000000283,0.0}
Trams149;14;4;16594;16:1;{2894.896500002593,514.0241999980062,0.0}
Trams149;14;3;16614;16:5;{2839.1857000030577,1180.8036000002176,0.0}
Trams183;18;7;16625;16:6;{845.340600002557,806.1041999999434,0.0}
Trams182;18;4;16626;16:7;{4672.309900000691,2395.577299999073,0.0}
Trams149;14;4;16627;16:7;{3035.1652000024915,1729.7097000014037,0.0}
Trams141;14;24;16639;16:9;{7477.508000001311,3581.729000000283,0.0}
Trams142;14;10;16657;16:12;{7477.508000001311,3581.729000000283,0.0}
Trams182;18;5;16662;16:13;{2992.747200001031,1703.0900999996811,0.0}
Trams183;18;6;16665;16:13;{2627.1466000005603,1561.507400000468,0.0}
Trams183;18;5;16666;16:13;{2675.4015184145933,1580.8842637522473,0.0}
Trams181;18;16;16667;16:13;{7477.508000001311,3581.729000000283,0.0}
Trams149;14;3;16671;16:14;{5108.905971347362,2577.745680309252,0.0}
Trams149;14;2;16672;16:14;{5123.508700001985,2583.745899999514,0.0}
Trams142;14;11;16673;16:14;{6831.853600002825,3315.144899999723,0.0}
Trams182;18;4;16681;16:16;{2110.2352000027895,1344.0613000001758,0.0}
Trams141;14;23;16681;16:16;{5641.738919684285,2786.998382666919,0.0}
Trams182;18;3;16682;16:16;{2064.0685709043055,1320.5282183098925,0.0}
Trams143;14;14;16692;16:18;{7477.508000001311,3581.729000000283,0.0}
Trams141;14;21;16694;16:18;{5058.904000002891,2546.714799998328,0.0}
Trams141;14;20;16695;16:18;{5010.473492013262,2527.781076226536,0.0}
Trams142;14;10;16700;16:19;{5634.466500002891,2784.006800001487,0.0}
Trams143;14;15;16700;16:19;{7172.43200000003,3532.2607999984175,0.0}
Trams141;14;19;16702;16:19;{4672.309900000691,2395.577299999073,0.0}
Trams141;14;18;16703;16:19;{4624.179771982149,2375.8925514936154,0.0}
Trams182;18;6;16710;16:21;{845.340600002557,806.1041999999434,0.0}
Trams141;14;19;16716;16:22;{4031.8555000014603,2128.9623999986798,0.0}
Trams142;14;7;16720;16:22;{4672.309900000691,2395.577299999073,0.0}
Trams142;14;6;16721;16:22;{4624.179771982149,2375.8925514936154,0.0}
Trams181;18;15;16722;16:23;{5058.904000002891,2546.714799998328,0.0}
Trams181;18;14;16723;16:23;{5010.473492013262,2527.781076226536,0.0}
Trams149;14;17;16726;16:23;{7477.508000001311,3581.729000000283,0.0}
Trams182;18;8;16732;16:24;{1782.5218000002205,1208.6106000002474,0.0}
Trams143;14;14;16734;16:25;{5641.738919684285,2786.998382666919,0.0}
Trams143;14;12;16735;16:25;{5634.466500002891,2784.006800001487,0.0}
Trams141;14;20;16738;16:25;{2992.747200001031,1703.0900999996811,0.0}
Trams182;18;9;16740;16:26;{2149.2538000009954,1363.784799998626,0.0}
Trams149;14;18;16742;16:26;{6831.853600002825,3315.144899999723,0.0}
Trams148;14;7;16746;16:27;{7477.508000001311,3581.729000000283,0.0}
Trams182;18;8;16751;16:27;{2675.4015184145933,1580.8842637522473,0.0}
Trams141;14;13;16751;16:27;{2808.1955000013113,1135.889900000766,0.0}
Trams141;14;12;16752;16:28;{2774.94460455129,1095.9101807449765,0.0}
Trams143;14;11;16756;16:28;{4624.179771982149,2375.8925514936154,0.0}
Trams141;14;9;16758;16:29;{2569.3393000029027,869.8653000015765,0.0}
Trams141;14;5;16759;16:29;{2567.6414284064917,825.1840510346515,0.0}
Trams147;14;3;16761;16:29;{7477.508000001311,3581.729000000283,0.0}
Trams181;18;15;16766;16:30;{2992.747200001031,1703.0900999996811,0.0}
Trams141;14;3;16769;16:30;{2894.896500002593,514.0241999980062,0.0}
Trams142;14;5;16769;16:30;{2808.1955000013113,1135.889900000766,0.0}
Trams149;14;16;16769;16:30;{5634.466500002891,2784.006800001487,0.0}
Trams183;18;12;16773;16:31;{7477.508000001311,3581.729000000283,0.0}
Trams181;18;13;16775;16:31;{2589.0274000018835,1538.5219000000507,0.0}
Trams142;14;4;16776;16:32;{2569.3393000029027,869.8653000015765,0.0}
Trams146;14;5;16776;16:32;{7477.508000001311,3581.729000000283,0.0}
Trams142;14;3;16777;16:32;{2567.6414284064917,825.1840510346515,0.0}
Trams147;14;4;16777;16:32;{6831.853600002825,3315.144899999723,0.0}
Trams182;18;9;16781;16:32;{4084.1569000035524,2161.088000001386,0.0}
Trams183;18;13;16781;16:32;{7172.43200000003,3532.2607999984175,0.0}
Trams149;14;13;16781;16:32;{5058.904000002891,2546.714799998328,0.0}
Trams149;14;11;16782;16:33;{5010.473492013262,2527.781076226536,0.0}
Trams181;18;11;16785;16:33;{2110.2352000027895,1344.0613000001758,0.0}
Trams181;18;8;16786;16:33;{2064.0685709043055,1320.5282183098925,0.0}
Trams142;14;2;16787;16:33;{2894.896500002593,514.0241999980062,0.0}
Trams148;14;8;16789;16:34;{5634.466500002891,2784.006800001487,0.0}
Trams149;14;10;16790;16:34;{4624.179771982149,2375.8925514936154,0.0}
Trams145;14;5;16791;16:34;{7477.508000001311,3581.729000000283,0.0}
Trams181;18;3;16793;16:34;{1740.6504000015557,1186.7970000002533,0.0}
Trams147;14;3;16793;16:34;{6138.21238208538,2940.1058384544613,0.0}
Trams182;18;8;16795;16:35;{4722.0763000026345,2426.624300001189,0.0}
Trams182;18;7;16803;16:36;{5108.905971347362,2577.745680309252,0.0}
Trams182;18;6;16804;16:36;{5123.508700001985,2583.745899999514,0.0}
Trams143;14;10;16804;16:36;{2808.1955000013113,1135.889900000766,0.0}
Trams183;18;12;16805;16:36;{6138.21238208538,2940.1058384544613,0.0}
Trams143;14;7;16805;16:36;{2774.94460455129,1095.9101807449765,0.0}
Trams148;14;6;16809;16:37;{4672.309900000691,2395.577299999073,0.0}
Trams143;14;6;16811;16:37;{2569.3393000029027,869.8653000015765,0.0}
Trams144;14;13;16811;16:37;{7477.508000001311,3581.729000000283,0.0}
Trams143;14;3;16812;16:38;{2567.6414284064917,825.1840510346515,0.0}
Trams144;14;16;16812;16:38;{7446.12100000307,3545.9720000009984,0.0}
Trams181;18;6;16814;16:38;{845.340600002557,806.1041999999434,0.0}
Trams182;18;4;16816;16:38;{5689.812200002372,2815.7713999990374,0.0}
Trams183;18;13;16816;16:38;{5634.466500002891,2784.006800001487,0.0}
Trams142;14;4;16820;16:39;{3035.1652000024915,1729.7097000014037,0.0}
Trams143;14;1;16822;16:39;{2894.896500002593,514.0241999980062,0.0}
Trams145;14;6;16822;16:39;{6188.119100000709,2954.7112999986857,0.0}
Trams141;14;4;16824;16:40;{4084.1569000035524,2161.088000001386,0.0}
Trams183;18;12;16828;16:40;{5058.904000002891,2546.714799998328,0.0}
Trams147;14;4;16838;16:42;{4031.8555000014603,2128.9623999986798,0.0}
Trams149;14;9;16838;16:42;{2808.1955000013113,1135.889900000766,0.0}
Trams149;14;8;16839;16:42;{2774.94460455129,1095.9101807449765,0.0}
Trams144;14;14;16843;16:43;{6138.21238208538,2940.1058384544613,0.0}
Trams181;18;5;16844;16:43;{2149.2538000009954,1363.784799998626,0.0}
Trams149;14;7;16846;16:43;{2567.6414284064917,825.1840510346515,0.0}
Trams141;14;3;16847;16:43;{5123.508700001985,2583.745899999514,0.0}
Trams183;18;11;16850;16:44;{4031.8555000014603,2128.9623999986798,0.0}
Trams144;14;13;16853;16:44;{5641.738919684285,2786.998382666919,0.0}
Trams143;14;2;16855;16:45;{3035.1652000024915,1729.7097000014037,0.0}
Trams149;14;2;16856;16:45;{2894.896500002593,514.0241999980062,0.0}
Trams182;18;13;16858;16:45;{7477.508000001311,3581.729000000283,0.0}
Trams148;14;5;16858;16:45;{2808.1955000013113,1135.889900000766,0.0}
Trams142;14;3;16864;16:46;{5108.905971347362,2577.745680309252,0.0}
Trams182;18;14;16866;16:47;{7172.43200000003,3532.2607999984175,0.0}
Trams144;14;12;16866;16:47;{5058.904000002891,2546.714799998328,0.0}
Trams148;14;4;16866;16:47;{2567.6414284064917,825.1840510346515,0.0}
Trams144;14;11;16867;16:47;{5010.473492013262,2527.781076226536,0.0}
Trams145;14;5;16868;16:47;{4031.8555000014603,2128.9623999986798,0.0}
Trams147;14;3;16873;16:48;{2808.1955000013113,1135.889900000766,0.0}
Trams182;18;16;16874;16:48;{6831.853600002825,3315.144899999723,0.0}
Trams144;14;10;16874;16:48;{4672.309900000691,2395.577299999073,0.0}
Trams144;14;9;16875;16:48;{4624.179771982149,2375.8925514936154,0.0}
Trams148;14;5;16875;16:48;{2894.896500002593,514.0241999980062,0.0}
Trams148;14;1;16876;16:48;{2894.896500002593,514.0241999980062,0.0}
Trams143;14;1;16877;16:48;{4084.1569000035524,2161.088000001386,0.0}
Trams142;14;2;16878;16:49;{5739.764803540053,2830.2159521656795,0.0}
Trams147;14;2;16880;16:49;{2569.3393000029027,869.8653000015765,0.0}
Trams146;14;3;16888;16:50;{2808.1955000013113,1135.889900000766,0.0}
Trams183;18;10;16891;16:51;{2110.2352000027895,1344.0613000001758,0.0}
Trams147;14;1;16891;16:51;{2894.896500002593,514.0241999980062,0.0}
Trams183;18;6;16892;16:51;{2064.0685709043055,1320.5282183098925,0.0}
Trams146;14;0;16895;16:51;{2569.3393000029027,869.8653000015765,0.0}
Trams183;18;4;16899;16:52;{1740.6504000015557,1186.7970000002533,0.0}
Trams182;18;14;16900;16:52;{5641.738919684285,2786.998382666919,0.0}
Trams182;18;13;16901;16:52;{5634.466500002891,2784.006800001487,0.0}
Trams141;14;24;16901;16:52;{7477.508000001311,3581.729000000283,0.0}
Trams145;14;4;16903;16:53;{2808.1955000013113,1135.889900000766,0.0}
Trams145;14;3;16904;16:53;{2774.94460455129,1095.9101807449765,0.0}
Trams181;18;4;16907;16:53;{5108.905971347362,2577.745680309252,0.0}
Trams148;14;2;16909;16:54;{3035.1652000024915,1729.7097000014037,0.0}
Trams145;14;2;16910;16:54;{2569.3393000029027,869.8653000015765,0.0}
Trams182;18;12;16913;16:54;{5058.904000002891,2546.714799998328,0.0}
Trams182;18;11;16914;16:55;{5010.473492013262,2527.781076226536,0.0}
Trams142;14;15;16919;16:55;{7477.508000001311,3581.729000000283,0.0}
Trams142;14;19;16920;16:56;{7446.12100000307,3545.9720000009984,0.0}
Trams181;18;2;16921;16:56;{5739.764803540053,2830.2159521656795,0.0}
Trams182;18;9;16921;16:56;{4672.309900000691,2395.577299999073,0.0}
Trams145;14;1;16921;16:56;{2894.896500002593,514.0241999980062,0.0}
Trams182;18;7;16922;16:56;{4624.179771982149,2375.8925514936154,0.0}
Trams144;14;8;16923;16:56;{2808.1955000013113,1135.889900000766,0.0}
Trams144;14;5;16930;16:57;{2569.3393000029027,869.8653000015765,0.0}
Trams144;14;3;16931;16:57;{2567.6414284064917,825.1840510346515,0.0}
Trams141;14;22;16933;16:58;{6138.21238208538,2940.1058384544613,0.0}
Trams142;14;20;16935;16:58;{6831.853600002825,3315.144899999723,0.0}
Trams144;14;2;16941;16:59;{2894.896500002593,514.0241999980062,0.0}
Trams141;14;21;16943;16:59;{5641.738919684285,2786.998382666919,0.0}
Trams183;18;5;16950;17:1;{2149.2538000009954,1363.784799998626,0.0}
Trams142;14;21;16950;17:1;{6188.119100000709,2954.7112999986857,0.0}
Trams148;14;1;16953;17:1;{5108.905971347362,2577.745680309252,0.0}
Trams143;14;13;16954;17:1;{7477.508000001311,3581.729000000283,0.0}
Trams141;14;18;16957;17:2;{5010.473492013262,2527.781076226536,0.0}
Trams181;18;17;16962;17:3;{7477.508000001311,3581.729000000283,0.0}
Trams142;14;22;16962;17:3;{5634.466500002891,2784.006800001487,0.0}
Trams143;14;14;16962;17:3;{7172.43200000003,3532.2607999984175,0.0}
Trams141;14;16;16964;17:3;{4672.309900000691,2395.577299999073,0.0}
Trams182;18;4;16966;17:3;{2589.0274000018835,1538.5219000000507,0.0}
Trams143;14;16;16970;17:4;{6831.853600002825,3315.144899999723,0.0}
Trams142;14;19;16975;17:5;{5010.473492013262,2527.781076226536,0.0}
Trams182;18;5;16976;17:5;{2110.2352000027895,1344.0613000001758,0.0}
Trams182;18;4;16977;17:5;{2064.0685709043055,1320.5282183098925,0.0}
Trams181;18;18;16978;17:5;{6831.853600002825,3315.144899999723,0.0}
Trams141;14;19;16978;17:5;{4031.8555000014603,2128.9623999986798,0.0}
Trams142;14;13;16982;17:6;{4672.309900000691,2395.577299999073,0.0}
Trams182;18;3;16984;17:6;{1740.6504000015557,1186.7970000002533,0.0}
Trams143;14;15;16986;17:7;{6138.21238208538,2940.1058384544613,0.0}
Trams149;14;19;16988;17:7;{7477.508000001311,3581.729000000283,0.0}
Trams181;18;17;16994;17:8;{6138.21238208538,2940.1058384544613,0.0}
Trams143;14;14;16996;17:8;{5641.738919684285,2786.998382666919,0.0}
Trams149;14;20;16996;17:8;{7172.43200000003,3532.2607999984175,0.0}
Trams182;18;4;17005;17:10;{845.340600002557,806.1041999999434,0.0}
Trams183;18;4;17005;17:10;{4722.0763000026345,2426.624300001189,0.0}
Trams148;14;16;17008;17:10;{7477.508000001311,3581.729000000283,0.0}
Trams143;14;15;17009;17:10;{5058.904000002891,2546.714799998328,0.0}
Trams143;14;14;17010;17:11;{5010.473492013262,2527.781076226536,0.0}
Trams141;14;16;17013;17:11;{2808.1955000013113,1135.889900000766,0.0}
Trams141;14;14;17014;17:11;{2774.94460455129,1095.9101807449765,0.0}
Trams148;14;17;17016;17:12;{7172.43200000003,3532.2607999984175,0.0}
Trams181;18;16;17017;17:12;{5058.904000002891,2546.714799998328,0.0}
Trams143;14;11;17017;17:12;{4672.309900000691,2395.577299999073,0.0}
Trams181;18;13;17018;17:12;{5010.473492013262,2527.781076226536,0.0}
Trams142;14;12;17018;17:12;{2992.747200001031,1703.0900999996811,0.0}
Trams149;14;21;17019;17:12;{6188.119100000709,2954.7112999986857,0.0}
Trams149;14;20;17020;17:12;{6138.21238208538,2940.1058384544613,0.0}
Trams141;14;9;17021;17:12;{2567.6414284064917,825.1840510346515,0.0}
Trams147;14;14;17023;17:13;{7477.508000001311,3581.729000000283,0.0}
Trams181;18;12;17025;17:13;{4672.309900000691,2395.577299999073,0.0}
Trams181;18;11;17026;17:13;{4624.179771982149,2375.8925514936154,0.0}
Trams183;18;5;17026;17:13;{5689.812200002372,2815.7713999990374,0.0}
Trams183;18;4;17027;17:13;{5739.764803540053,2830.2159521656795,0.0}
Trams141;14;4;17031;17:14;{2894.896500002593,514.0241999980062,0.0}
Trams143;14;12;17031;17:14;{4031.8555000014603,2128.9623999986798,0.0}
Trams149;14;19;17031;17:14;{5634.466500002891,2784.006800001487,0.0}
Trams142;14;10;17032;17:14;{2774.94460455129,1095.9101807449765,0.0}
Trams142;14;7;17038;17:15;{2569.3393000029027,869.8653000015765,0.0}
Trams146;14;8;17038;17:15;{7477.508000001311,3581.729000000283,0.0}
Trams142;14;6;17039;17:15;{2567.6414284064917,825.1840510346515,0.0}
Trams148;14;16;17040;17:16;{6138.21238208538,2940.1058384544613,0.0}
Trams141;14;5;17043;17:16;{2597.49450000003,904.9190000016242,0.0}
Trams142;14;8;17048;17:17;{2894.896500002593,514.0241999980062,0.0}
Trams142;14;4;17049;17:17;{2894.896500002593,514.0241999980062,0.0}
Trams141;14;6;17051;17:17;{2839.1857000030577,1180.8036000002176,0.0}
Trams148;14;15;17051;17:17;{5634.466500002891,2784.006800001487,0.0}
Trams149;14;18;17052;17:18;{4624.179771982149,2375.8925514936154,0.0}
Trams145;14;16;17053;17:18;{7477.508000001311,3581.729000000283,0.0}
Trams182;18;7;17054;17:18;{3035.1652000024915,1729.7097000014037,0.0}
Trams148;14;14;17064;17:20;{5010.473492013262,2527.781076226536,0.0}
Trams143;14;11;17066;17:20;{2808.1955000013113,1135.889900000766,0.0}
Trams147;14;13;17066;17:20;{5634.466500002891,2784.006800001487,0.0}
Trams143;14;9;17067;17:20;{2774.94460455129,1095.9101807449765,0.0}
Trams183;18;22;17068;17:20;{7477.508000001311,3581.729000000283,0.0}
Trams181;18;7;17070;17:21;{2589.0274000018835,1538.5219000000507,0.0}
Trams148;14;10;17071;17:21;{4672.309900000691,2395.577299999073,0.0}
Trams148;14;9;17072;17:21;{4624.179771982149,2375.8925514936154,0.0}
Trams143;14;6;17073;17:21;{2569.3393000029027,869.8653000015765,0.0}
Trams144;14;14;17073;17:21;{7477.508000001311,3581.729000000283,0.0}
Trams143;14;4;17074;17:21;{2567.6414284064917,825.1840510346515,0.0}
Trams182;18;6;17076;17:22;{4084.1569000035524,2161.088000001386,0.0}
Trams147;14;12;17078;17:22;{5058.904000002891,2546.714799998328,0.0}
Trams181;18;4;17081;17:22;{2064.0685709043055,1320.5282183098925,0.0}
Trams183;18;23;17084;17:23;{6831.853600002825,3315.144899999723,0.0}
Trams143;14;1;17084;17:23;{2894.896500002593,514.0241999980062,0.0}
Trams145;14;15;17085;17:23;{6138.21238208538,2940.1058384544613,0.0}
Trams147;14;8;17086;17:23;{4672.309900000691,2395.577299999073,0.0}
Trams181;18;2;17088;17:24;{1740.6504000015557,1186.7970000002533,0.0}
Trams146;14;6;17093;17:24;{5058.904000002891,2546.714799998328,0.0}
Trams145;14;12;17095;17:25;{5641.738919684285,2786.998382666919,0.0}
Trams141;14;5;17099;17:25;{4707.823850244834,2420.7529164061234,0.0}
Trams141;14;4;17100;17:26;{4722.0763000026345,2426.624300001189,0.0}
Trams147;14;6;17100;17:26;{4031.8555000014603,2128.9623999986798,0.0}
Trams149;14;15;17100;17:26;{2808.1955000013113,1135.889900000766,0.0}
Trams146;14;5;17101;17:26;{4672.309900000691,2395.577299999073,0.0}
Trams149;14;11;17101;17:26;{2774.94460455129,1095.9101807449765,0.0}
Trams146;14;4;17102;17:26;{4624.179771982149,2375.8925514936154,0.0}
Trams144;14;13;17105;17:26;{6138.21238208538,2940.1058384544613,0.0}
Trams148;14;10;17107;17:27;{2992.747200001031,1703.0900999996811,0.0}
Trams149;14;9;17107;17:27;{2569.3393000029027,869.8653000015765,0.0}
Trams149;14;8;17108;17:27;{2567.6414284064917,825.1840510346515,0.0}
Trams181;18;3;17109;17:27;{845.340600002557,806.1041999999434,0.0}
Trams145;14;11;17109;17:27;{5010.473492013262,2527.781076226536,0.0}
Trams183;18;22;17110;17:27;{5641.738919684285,2786.998382666919,0.0}
Trams182;18;5;17111;17:27;{5689.812200002372,2815.7713999990374,0.0}
Trams183;18;23;17111;17:27;{5634.466500002891,2784.006800001487,0.0}
Trams182;18;4;17112;17:28;{5739.764803540053,2830.2159521656795,0.0}
Trams144;14;12;17115;17:28;{5641.738919684285,2786.998382666919,0.0}
Trams144;14;13;17116;17:28;{5634.466500002891,2784.006800001487,0.0}
Trams145;14;8;17116;17:28;{4672.309900000691,2395.577299999073,0.0}
Trams149;14;9;17117;17:28;{2894.896500002593,514.0241999980062,0.0}
Trams149;14;4;17118;17:29;{2894.896500002593,514.0241999980062,0.0}
Trams181;18;4;17119;17:29;{1241.924200002104,980.4126999992877,0.0}
Trams148;14;6;17120;17:29;{2808.1955000013113,1135.889900000766,0.0}
Trams141;14;3;17121;17:29;{5689.812200002372,2815.7713999990374,0.0}
Trams182;18;3;17122;17:29;{6221.943900000304,2968.579499999061,0.0}
Trams183;18;22;17124;17:30;{5010.473492013262,2527.781076226536,0.0}
Trams148;14;5;17127;17:30;{2569.3393000029027,869.8653000015765,0.0}
Trams148;14;4;17128;17:30;{2567.6414284064917,825.1840510346515,0.0}
Trams181;18;6;17131;17:31;{1782.5218000002205,1208.6106000002474,0.0}
Trams183;18;19;17131;17:31;{4672.309900000691,2395.577299999073,0.0}
Trams183;18;17;17132;17:31;{4624.179771982149,2375.8925514936154,0.0}
Trams147;14;5;17135;17:31;{2808.1955000013113,1135.889900000766,0.0}
Trams144;14;12;17136;17:32;{4672.309900000691,2395.577299999073,0.0}
Trams148;14;5;17137;17:32;{2894.896500002593,514.0241999980062,0.0}
Trams148;14;2;17138;17:32;{2894.896500002593,514.0241999980062,0.0}
Trams149;14;5;17138;17:32;{2839.1857000030577,1180.8036000002176,0.0}
Trams143;14;2;17139;17:32;{4084.1569000035524,2161.088000001386,0.0}
Trams147;14;2;17143;17:33;{2567.6414284064917,825.1840510346515,0.0}
Trams183;18;18;17145;17:33;{4031.8555000014603,2128.9623999986798,0.0}
Trams149;14;4;17152;17:34;{3084.0353342962862,1747.4296273253601,0.0}
Trams182;18;24;17153;17:34;{7477.508000001311,3581.729000000283,0.0}
Trams143;14;1;17153;17:34;{4722.0763000026345,2426.624300001189,0.0}
Trams147;14;1;17153;17:34;{2894.896500002593,514.0241999980062,0.0}
Trams146;14;3;17157;17:35;{2569.3393000029027,869.8653000015765,0.0}
Trams146;14;1;17158;17:35;{2567.6414284064917,825.1840510346515,0.0}
Trams143;14;0;17161;17:36;{5108.905971347362,2577.745680309252,0.0}
Trams141;14;24;17163;17:36;{7477.508000001311,3581.729000000283,0.0}
Trams145;14;5;17165;17:36;{2808.1955000013113,1135.889900000766,0.0}
Trams146;14;0;17168;17:37;{2894.896500002593,514.0241999980062,0.0}
Trams144;14;13;17172;17:38;{2992.747200001031,1703.0900999996811,0.0}
Trams145;14;3;17172;17:38;{2569.3393000029027,869.8653000015765,0.0}
Trams183;18;15;17176;17:38;{2589.0274000018835,1538.5219000000507,0.0}
Trams142;14;24;17181;17:39;{7477.508000001311,3581.729000000283,0.0}
Trams1411;14;24;17181;17:39;{7477.508000001311,3581.729000000283,0.0}
Trams145;14;1;17183;17:39;{2894.896500002593,514.0241999980062,0.0}
Trams144;14;12;17185;17:40;{2808.1955000013113,1135.889900000766,0.0}
Trams183;18;12;17186;17:40;{2110.2352000027895,1344.0613000001758,0.0}
Trams144;14;11;17186;17:40;{2774.94460455129,1095.9101807449765,0.0}
Trams183;18;6;17187;17:40;{2064.0685709043055,1320.5282183098925,0.0}
Trams144;14;9;17192;17:41;{2569.3393000029027,869.8653000015765,0.0}
Trams144;14;6;17193;17:41;{2567.6414284064917,825.1840510346515,0.0}
Trams181;18;5;17194;17:41;{4722.0763000026345,2426.624300001189,0.0}
Trams183;18;5;17194;17:41;{1740.6504000015557,1186.7970000002533,0.0}
Trams182;18;23;17195;17:41;{5641.738919684285,2786.998382666919,0.0}
Trams182;18;18;17196;17:42;{5634.466500002891,2784.006800001487,0.0}
Trams181;18;4;17202;17:43;{5108.905971347362,2577.745680309252,0.0}
Trams144;14;3;17203;17:43;{2894.896500002593,514.0241999980062,0.0}
Trams141;14;23;17206;17:43;{5634.466500002891,2784.006800001487,0.0}
Trams182;18;14;17208;17:44;{5058.904000002891,2546.714799998328,0.0}
Trams142;14;23;17213;17:44;{6138.21238208538,2940.1058384544613,0.0}
Trams183;18;8;17215;17:45;{845.340600002557,806.1041999999434,0.0}
Trams181;18;2;17216;17:45;{5739.764803540053,2830.2159521656795,0.0}
Trams143;14;22;17216;17:45;{7477.508000001311,3581.729000000283,0.0}
Trams182;18;13;17217;17:45;{4624.179771982149,2375.8925514936154,0.0}
Trams141;14;24;17218;17:45;{5058.904000002891,2546.714799998328,0.0}
Trams142;14;21;17224;17:46;{5634.466500002891,2784.006800001487,0.0}
Trams143;14;23;17224;17:46;{7172.43200000003,3532.2607999984175,0.0}
Trams182;18;14;17230;17:47;{4031.8555000014603,2128.9623999986798,0.0}
Trams143;14;24;17232;17:48;{6831.853600002825,3315.144899999723,0.0}
Trams1410;14;3;17232;17:48;{6831.853600002825,3315.144899999723,0.0}
Trams142;14;20;17236;17:48;{5058.904000002891,2546.714799998328,0.0}
Trams183;18;11;17237;17:48;{1782.5218000002205,1208.6106000002474,0.0}
Trams1411;14;19;17237;17:48;{5010.473492013262,2527.781076226536,0.0}
Trams1411;14;13;17244;17:50;{4672.309900000691,2395.577299999073,0.0}
Trams1411;14;10;17245;17:50;{4624.179771982149,2375.8925514936154,0.0}
Trams143;14;23;17248;17:50;{6138.21238208538,2940.1058384544613,0.0}
Trams149;14;24;17250;17:51;{7477.508000001311,3581.729000000283,0.0}
Trams183;18;12;17255;17:51;{2627.1466000005603,1561.507400000468,0.0}
Trams181;18;24;17257;17:52;{7477.508000001311,3581.729000000283,0.0}
Trams142;14;19;17258;17:52;{4031.8555000014603,2128.9623999986798,0.0}
Trams144;14;4;17258;17:52;{4084.1569000035524,2161.088000001386,0.0}
Trams182;18;12;17261;17:52;{2589.0274000018835,1538.5219000000507,0.0}
Trams183;18;11;17264;17:53;{3035.1652000024915,1729.7097000014037,0.0}
Trams148;14;24;17270;17:54;{7477.508000001311,3581.729000000283,0.0}
Trams182;18;10;17271;17:54;{2110.2352000027895,1344.0613000001758,0.0}
Trams143;14;24;17271;17:54;{5058.904000002891,2546.714799998328,0.0}
Trams1410;14;2;17271;17:54;{5058.904000002891,2546.714799998328,0.0}
Trams182;18;8;17272;17:54;{2064.0685709043055,1320.5282183098925,0.0}
Trams143;14;22;17272;17:54;{5010.473492013262,2527.781076226536,0.0}
Trams1410;14;1;17272;17:54;{5010.473492013262,2527.781076226536,0.0}
Trams141;14;19;17275;17:55;{2808.1955000013113,1135.889900000766,0.0}
Trams141;14;15;17276;17:55;{2774.94460455129,1095.9101807449765,0.0}
Trams182;18;4;17279;17:55;{1740.6504000015557,1186.7970000002533,0.0}
Trams143;14;16;17279;17:55;{4672.309900000691,2395.577299999073,0.0}
Trams144;14;3;17281;17:56;{5123.508700001985,2583.745899999514,0.0}
Trams141;14;7;17282;17:56;{2569.3393000029027,869.8653000015765,0.0}
Trams141;14;5;17283;17:56;{2567.6414284064917,825.1840510346515,0.0}
Trams147;14;19;17285;17:56;{7477.508000001311,3581.729000000283,0.0}
Trams183;18;10;17286;17:57;{4084.1569000035524,2161.088000001386,0.0}
Trams147;14;24;17286;17:57;{7446.12100000307,3545.9720000009984,0.0}
Trams149;14;22;17292;17:58;{5641.738919684285,2786.998382666919,0.0}
Trams141;14;4;17293;17:58;{2894.896500002593,514.0241999980062,0.0}
Trams142;14;18;17293;17:58;{2808.1955000013113,1135.889900000766,0.0}
Trams143;14;15;17293;17:58;{4031.8555000014603,2128.9623999986798,0.0}
Trams181;18;23;17299;17:59;{5641.738919684285,2786.998382666919,0.0}
Trams182;18;9;17300;17:59;{845.340600002557,806.1041999999434,0.0}
Trams183;18;8;17300;17:59;{4722.0763000026345,2426.624300001189,0.0}
Trams142;14;14;17300;17:59;{2569.3393000029027,869.8653000015765,0.0}
Trams146;14;19;17300;17:59;{7477.508000001311,3581.729000000283,0.0}
Trams142;14;11;17301;17:59;{2567.6414284064917,825.1840510346515,0.0}
Trams1411;14;8;17301;17:59;{2567.6414284064917,825.1840510346515,0.0}
Trams148;14;23;17302;17:59;{6138.21238208538,2940.1058384544613,0.0}
Trams149;14;21;17305;18:0;{5058.904000002891,2546.714799998328,0.0}
Trams183;18;6;17308;18:0;{5108.905971347362,2577.745680309252,0.0}
Trams142;14;6;17311;18:1;{2894.896500002593,514.0241999980062,0.0}
Trams1411;14;0;17311;18:1;{2894.896500002593,514.0241999980062,0.0}
Trams181;18;21;17312;18:1;{5058.904000002891,2546.714799998328,0.0}
Trams181;18;19;17313;18:1;{5010.473492013262,2527.781076226536,0.0}
Trams148;14;22;17313;18:1;{5634.466500002891,2784.006800001487,0.0}
Trams145;14;7;17315;18:1;{7477.508000001311,3581.729000000283,0.0}
Trams145;14;11;17316;18:2;{7446.12100000307,3545.9720000009984,0.0}
Trams147;14;23;17317;18:2;{6138.21238208538,2940.1058384544613,0.0}
Trams181;18;18;17320;18:2;{4672.309900000691,2395.577299999073,0.0}
Trams181;18;16;17321;18:2;{4624.179771982149,2375.8925514936154,0.0}
Trams183;18;5;17321;18:2;{5689.812200002372,2815.7713999990374,0.0}
Trams182;18;10;17322;18:3;{1782.5218000002205,1208.6106000002474,0.0}
Trams183;18;4;17322;18:3;{5739.764803540053,2830.2159521656795,0.0}
Trams146;14;20;17323;18:3;{6563.806600000709,3123.2601999994367,0.0}
Trams141;14;6;17326;18:3;{3035.1652000024915,1729.7097000014037,0.0}
Trams149;14;20;17327;18:3;{4031.8555000014603,2128.9623999986798,0.0}
Trams143;14;12;17328;18:4;{2808.1955000013113,1135.889900000766,0.0}
Trams143;14;10;17329;18:4;{2774.94460455129,1095.9101807449765,0.0}
Trams182;18;9;17331;18:4;{2197.307743831217,1383.6548398164498,0.0}
Trams146;14;21;17331;18:4;{6188.119100000709,2954.7112999986857,0.0}
Trams146;14;20;17332;18:4;{6138.21238208538,2940.1058384544613,0.0}
Trams148;14;20;17333;18:4;{4672.309900000691,2395.577299999073,0.0}
Trams148;14;19;17334;18:5;{4624.179771982149,2375.8925514936154,0.0}
Trams143;14;11;17335;18:5;{2569.3393000029027,869.8653000015765,0.0}
Trams144;14;11;17335;18:5;{7477.508000001311,3581.729000000283,0.0}
Trams143;14;10;17336;18:5;{2567.6414284064917,825.1840510346515,0.0}
Trams147;14;19;17340;18:6;{5058.904000002891,2546.714799998328,0.0}
Trams147;14;17;17341;18:6;{5010.473492013262,2527.781076226536,0.0}
Trams146;14;19;17342;18:6;{5641.738919684285,2786.998382666919,0.0}
Trams143;14;5;17346;18:7;{2894.896500002593,514.0241999980062,0.0}
Trams1410;14;0;17346;18:7;{2894.896500002593,514.0241999980062,0.0}
Trams141;14;7;17348;18:7;{4084.1569000035524,2161.088000001386,0.0}
Trams147;14;16;17348;18:7;{4672.309900000691,2395.577299999073,0.0}
Trams146;14;18;17355;18:8;{5058.904000002891,2546.714799998328,0.0}
Trams146;14;14;17356;18:8;{5010.473492013262,2527.781076226536,0.0}
Trams145;14;10;17357;18:8;{5641.738919684285,2786.998382666919,0.0}
Trams147;14;15;17362;18:9;{4031.8555000014603,2128.9623999986798,0.0}
Trams149;14;17;17362;18:9;{2808.1955000013113,1135.889900000766,0.0}
Trams183;18;19;17363;18:9;{7477.508000001311,3581.729000000283,0.0}
Trams146;14;11;17363;18:9;{4672.309900000691,2395.577299999073,0.0}
Trams149;14;13;17363;18:9;{2774.94460455129,1095.9101807449765,0.0}
Trams146;14;10;17364;18:10;{4624.179771982149,2375.8925514936154,0.0}
Trams181;18;12;17365;18:10;{2589.0274000018835,1538.5219000000507,0.0}
Trams148;14;20;17369;18:10;{2992.747200001031,1703.0900999996811,0.0}
Trams149;14;9;17369;18:10;{2569.3393000029027,869.8653000015765,0.0}
Trams141;14;6;17370;18:11;{5108.905971347362,2577.745680309252,0.0}
Trams145;14;9;17370;18:11;{5058.904000002891,2546.714799998328,0.0}
Trams149;14;8;17370;18:11;{2567.6414284064917,825.1840510346515,0.0}
Trams182;18;8;17371;18:11;{4084.1569000035524,2161.088000001386,0.0}
Trams183;18;20;17371;18:11;{7172.43200000003,3532.2607999984175,0.0}
Trams141;14;5;17371;18:11;{5123.508700001985,2583.745899999514,0.0}
Trams145;14;8;17371;18:11;{5010.473492013262,2527.781076226536,0.0}
Trams181;18;9;17375;18:11;{2110.2352000027895,1344.0613000001758,0.0}
Trams181;18;7;17376;18:12;{2064.0685709043055,1320.5282183098925,0.0}
Trams145;14;7;17378;18:12;{4672.309900000691,2395.577299999073,0.0}
Trams143;14;6;17379;18:12;{3035.1652000024915,1729.7097000014037,0.0}
Trams149;14;10;17379;18:12;{2894.896500002593,514.0241999980062,0.0}
Trams149;14;8;17380;18:12;{2894.896500002593,514.0241999980062,0.0}
Trams148;14;19;17382;18:13;{2808.1955000013113,1135.889900000766,0.0}
Trams181;18;6;17383;18:13;{1740.6504000015557,1186.7970000002533,0.0}
Trams148;14;16;17383;18:13;{2774.94460455129,1095.9101807449765,0.0}
Trams141;14;4;17384;18:13;{5739.764803540053,2830.2159521656795,0.0}
Trams148;14;14;17389;18:14;{2569.3393000029027,869.8653000015765,0.0}
Trams148;14;12;17390;18:14;{2567.6414284064917,825.1840510346515,0.0}
Trams145;14;6;17392;18:14;{4031.8555000014603,2128.9623999986798,0.0}
Trams182;18;6;17393;18:14;{5108.905971347362,2577.745680309252,0.0}
Trams181;18;5;17394;18:15;{1213.7785956119094,964.194963392883,0.0}
Trams182;18;5;17394;18:15;{5123.508700001985,2583.745899999514,0.0}
Trams183;18;21;17394;18:15;{6188.119100000709,2954.7112999986857,0.0}
Trams147;14;13;17397;18:15;{2808.1955000013113,1135.889900000766,0.0}
Trams144;14;8;17398;18:15;{4672.309900000691,2395.577299999073,0.0}
Trams147;14;12;17398;18:15;{2774.94460455129,1095.9101807449765,0.0}
Trams144;14;7;17399;18:15;{4624.179771982149,2375.8925514936154,0.0}
Trams148;14;2;17400;18:16;{2894.896500002593,514.0241999980062,0.0}
Trams181;18;7;17404;18:16;{845.340600002557,806.1041999999434,0.0}
Trams147;14;11;17404;18:16;{2569.3393000029027,869.8653000015765,0.0}
Trams183;18;20;17405;18:16;{5641.738919684285,2786.998382666919,0.0}
Trams147;14;9;17405;18:16;{2567.6414284064917,825.1840510346515,0.0}
Trams182;18;4;17407;18:17;{5739.764803540053,2830.2159521656795,0.0}
Trams144;14;6;17412;18:18;{4031.8555000014603,2128.9623999986798,0.0}
Trams146;14;8;17412;18:18;{2808.1955000013113,1135.889900000766,0.0}
Trams146;14;4;17413;18:18;{2774.94460455129,1095.9101807449765,0.0}
Trams147;14;3;17415;18:18;{2894.896500002593,514.0241999980062,0.0}
Trams182;18;3;17417;18:18;{6221.943900000304,2968.579499999061,0.0}
Trams183;18;19;17418;18:19;{5058.904000002891,2546.714799998328,0.0}
Trams183;18;18;17419;18:19;{5010.473492013262,2527.781076226536,0.0}
Trams146;14;3;17419;18:19;{2569.3393000029027,869.8653000015765,0.0}
Trams141;14;24;17425;18:20;{7477.508000001311,3581.729000000283,0.0}
Trams183;18;17;17426;18:20;{4672.309900000691,2395.577299999073,0.0}
Trams183;18;16;17427;18:20;{4624.179771982149,2375.8925514936154,0.0}
Trams145;14;5;17427;18:20;{2808.1955000013113,1135.889900000766,0.0}
Trams145;14;4;17428;18:20;{2774.94460455129,1095.9101807449765,0.0}
Trams146;14;0;17430;18:21;{2894.896500002593,514.0241999980062,0.0}
Trams181;18;8;17434;18:21;{2149.2538000009954,1363.784799998626,0.0}
Trams143;14;5;17437;18:22;{5739.764803540053,2830.2159521656795,0.0}
Trams142;14;17;17443;18:23;{7477.508000001311,3581.729000000283,0.0}
Trams145;14;1;17445;18:23;{2894.896500002593,514.0241999980062,0.0}
Trams144;14;5;17447;18:23;{2808.1955000013113,1135.889900000766,0.0}
Trams182;18;12;17448;18:24;{7477.508000001311,3581.729000000283,0.0}
Trams144;14;4;17454;18:25;{2569.3393000029027,869.8653000015765,0.0}
Trams182;18;13;17456;18:25;{7172.43200000003,3532.2607999984175,0.0}
Trams141;14;21;17457;18:25;{6138.21238208538,2940.1058384544613,0.0}
Trams142;14;19;17459;18:25;{6831.853600002825,3315.144899999723,0.0}
Trams144;14;2;17465;18:26;{2894.896500002593,514.0241999980062,0.0}
Trams141;14;20;17468;18:27;{5634.466500002891,2784.006800001487,0.0}
Trams183;18;10;17471;18:27;{2589.0274000018835,1538.5219000000507,0.0}
Trams142;14;21;17474;18:28;{6188.119100000709,2954.7112999986857,0.0}
Trams143;14;22;17478;18:29;{7477.508000001311,3581.729000000283,0.0}
Trams141;14;18;17480;18:29;{5058.904000002891,2546.714799998328,0.0}
Trams183;18;6;17481;18:29;{2110.2352000027895,1344.0613000001758,0.0}
Trams183;18;3;17482;18:29;{2064.0685709043055,1320.5282183098925,0.0}
Trams141;14;19;17488;18:30;{4672.309900000691,2395.577299999073,0.0}
Trams181;18;6;17489;18:30;{4722.0763000026345,2426.624300001189,0.0}
Trams181;18;5;17497;18:32;{5108.905971347362,2577.745680309252,0.0}
Trams142;14;19;17499;18:32;{5010.473492013262,2527.781076226536,0.0}
Trams182;18;12;17503;18:33;{5058.904000002891,2546.714799998328,0.0}
Trams142;14;17;17506;18:33;{4672.309900000691,2395.577299999073,0.0}
Trams183;18;6;17510;18:34;{845.340600002557,806.1041999999434,0.0}
Trams181;18;4;17511;18:34;{5739.764803540053,2830.2159521656795,0.0}
Trams149;14;20;17512;18:34;{7477.508000001311,3581.729000000283,0.0}
Trams142;14;16;17520;18:36;{4031.8555000014603,2128.9623999986798,0.0}
Trams143;14;21;17520;18:36;{5641.738919684285,2786.998382666919,0.0}
Trams181;18;3;17521;18:36;{6221.943900000304,2968.579499999061,0.0}
Trams143;14;24;17521;18:36;{5634.466500002891,2784.006800001487,0.0}
Trams141;14;22;17524;18:36;{2992.747200001031,1703.0900999996811,0.0}
Trams149;14;21;17528;18:37;{6831.853600002825,3315.144899999723,0.0}
Trams183;18;5;17532;18:38;{1782.5218000002205,1208.6106000002474,0.0}
Trams148;14;10;17532;18:38;{7477.508000001311,3581.729000000283,0.0}
Trams143;14;22;17534;18:38;{5010.473492013262,2527.781076226536,0.0}
Trams149;14;22;17535;18:38;{6563.806600000709,3123.2601999994367,0.0}
Trams141;14;20;17537;18:38;{2808.1955000013113,1135.889900000766,0.0}
Trams141;14;19;17538;18:39;{2774.94460455129,1095.9101807449765,0.0}
Trams183;18;6;17540;18:39;{2149.2538000009954,1363.784799998626,0.0}
Trams148;14;11;17540;18:39;{7172.43200000003,3532.2607999984175,0.0}
Trams143;14;20;17541;18:39;{4672.309900000691,2395.577299999073,0.0}
Trams143;14;19;17542;18:39;{4624.179771982149,2375.8925514936154,0.0}
Trams141;14;15;17544;18:40;{2569.3393000029027,869.8653000015765,0.0}
Trams149;14;20;17544;18:40;{6138.21238208538,2940.1058384544613,0.0}
Trams141;14;10;17545;18:40;{2567.6414284064917,825.1840510346515,0.0}
Trams147;14;7;17547;18:40;{7477.508000001311,3581.729000000283,0.0}
Trams181;18;9;17552;18:41;{7477.508000001311,3581.729000000283,0.0}
Trams143;14;18;17554;18:41;{4048.297289360261,2135.7927898531034,0.0}
Trams149;14;18;17554;18:41;{5641.738919684285,2786.998382666919,0.0}
Trams141;14;5;17555;18:41;{2894.896500002593,514.0241999980062,0.0}
Trams142;14;14;17555;18:41;{2808.1955000013113,1135.889900000766,0.0}
Trams149;14;17;17555;18:41;{5634.466500002891,2784.006800001487,0.0}
Trams182;18;11;17556;18:42;{2589.0274000018835,1538.5219000000507,0.0}
Trams144;14;1;17556;18:42;{5739.764803540053,2830.2159521656795,0.0}
Trams146;14;8;17562;18:43;{7477.508000001311,3581.729000000283,0.0}
Trams142;14;13;17563;18:43;{2567.6414284064917,825.1840510346515,0.0}
Trams148;14;10;17564;18:43;{6138.21238208538,2940.1058384544613,0.0}
Trams182;18;7;17566;18:43;{2110.2352000027895,1344.0613000001758,0.0}
Trams182;18;4;17567;18:43;{2064.0685709043055,1320.5282183098925,0.0}
Trams149;14;16;17567;18:43;{5058.904000002891,2546.714799998328,0.0}
Trams149;14;14;17568;18:44;{5010.473492013262,2527.781076226536,0.0}
Trams142;14;14;17572;18:44;{2894.896500002593,514.0241999980062,0.0}
Trams142;14;8;17573;18:44;{2894.896500002593,514.0241999980062,0.0}
Trams181;18;10;17575;18:45;{6563.806600000709,3123.2601999994367,0.0}
Trams148;14;8;17575;18:45;{5634.466500002891,2784.006800001487,0.0}
Trams145;14;3;17577;18:45;{7477.508000001311,3581.729000000283,0.0}
Trams183;18;5;17581;18:46;{4084.1569000035524,2161.088000001386,0.0}
Trams182;18;3;17585;18:46;{1213.7785956119094,964.194963392883,0.0}
Trams141;14;6;17588;18:47;{3035.1652000024915,1729.7097000014037,0.0}
Trams148;14;6;17588;18:47;{5010.473492013262,2527.781076226536,0.0}
Trams143;14;14;17590;18:47;{2808.1955000013113,1135.889900000766,0.0}
Trams143;14;13;17591;18:47;{2774.94460455129,1095.9101807449765,0.0}
Trams182;18;4;17595;18:48;{845.340600002557,806.1041999999434,0.0}
Trams143;14;12;17597;18:48;{2569.3393000029027,869.8653000015765,0.0}
Trams144;14;3;17597;18:48;{7477.508000001311,3581.729000000283,0.0}
Trams143;14;7;17598;18:49;{2567.6414284064917,825.1840510346515,0.0}
Trams144;14;7;17598;18:49;{7446.12100000307,3545.9720000009984,0.0}
Trams183;18;4;17603;18:49;{5108.905971347362,2577.745680309252,0.0}
Trams147;14;6;17603;18:49;{5010.473492013262,2527.781076226536,0.0}
Trams182;18;5;17605;18:50;{1241.924200002104,980.4126999992877,0.0}
Trams143;14;8;17607;18:50;{2894.896500002593,514.0241999980062,0.0}
Trams143;14;7;17608;18:50;{2894.896500002593,514.0241999980062,0.0}
Trams148;14;7;17609;18:50;{4031.8555000014603,2128.9623999986798,0.0}
Trams141;14;7;17610;18:51;{4084.1569000035524,2161.088000001386,0.0}
Trams147;14;7;17610;18:51;{4672.309900000691,2395.577299999073,0.0}
Trams147;14;6;17611;18:51;{4624.179771982149,2375.8925514936154,0.0}
Trams149;14;13;17611;18:51;{2992.747200001031,1703.0900999996811,0.0}
Trams183;18;3;17616;18:52;{5689.812200002372,2815.7713999990374,0.0}
Trams141;14;8;17624;18:53;{4722.0763000026345,2426.624300001189,0.0}
Trams149;14;11;17624;18:53;{2808.1955000013113,1135.889900000766,0.0}
Trams182;18;6;17625;18:53;{2149.2538000009954,1363.784799998626,0.0}
Trams146;14;6;17625;18:53;{4672.309900000691,2395.577299999073,0.0}
Trams149;14;10;17625;18:53;{2774.94460455129,1095.9101807449765,0.0}
Trams144;14;6;17629;18:54;{6138.21238208538,2940.1058384544613,0.0}
Trams149;14;9;17632;18:54;{2567.6414284064917,825.1840510346515,0.0}
Trams141;14;7;17633;18:54;{5123.508700001985,2583.745899999514,0.0}
Trams182;18;7;17635;18:55;{2627.1466000005603,1561.507400000468,0.0}
Trams182;18;6;17644;18:56;{3035.1652000024915,1729.7097000014037,0.0}
Trams148;14;6;17645;18:56;{2774.94460455129,1095.9101807449765,0.0}
Trams141;14;6;17646;18:57;{5739.764803540053,2830.2159521656795,0.0}
Trams181;18;11;17651;18:57;{2992.747200001031,1703.0900999996811,0.0}
Trams148;14;4;17651;18:57;{2569.3393000029027,869.8653000015765,0.0}
Trams144;14;5;17652;18:58;{5058.904000002891,2546.714799998328,0.0}
Trams145;14;4;17654;18:58;{4031.8555000014603,2128.9623999986798,0.0}
Trams149;14;10;17654;18:58;{2597.49450000003,904.9190000016242,0.0}
Trams141;14;5;17656;18:58;{6221.943900000304,2968.579499999061,0.0}
Trams183;18;24;17658;18:59;{7477.508000001311,3581.729000000283,0.0}
Trams181;18;10;17660;18:59;{2589.0274000018835,1538.5219000000507,0.0}
Trams144;14;4;17660;18:59;{4672.309900000691,2395.577299999073,0.0}
Trams147;14;5;17660;18:59;{2774.94460455129,1095.9101807449765,0.0}
Trams144;14;2;17661;18:59;{4624.179771982149,2375.8925514936154,0.0}
Trams148;14;3;17662;18:59;{2894.896500002593,514.0241999980062,0.0}
Trams142;14;9;17663;18:59;{5689.812200002372,2815.7713999990374,0.0}
Trams147;14;4;17667;19:0;{2567.6414284064917,825.1840510346515,0.0}
Trams181;18;9;17670;19:1;{2110.2352000027895,1344.0613000001758,0.0}
Trams181;18;4;17671;19:1;{2064.0685709043055,1320.5282183098925,0.0}
Trams146;14;4;17674;19:1;{2808.1955000013113,1135.889900000766,0.0}
Trams147;14;5;17676;19:2;{2894.896500002593,514.0241999980062,0.0}
Trams147;14;4;17677;19:2;{2894.896500002593,514.0241999980062,0.0}
Trams181;18;3;17678;19:2;{1740.6504000015557,1186.7970000002533,0.0}
Trams182;18;4;17680;19:2;{4722.0763000026345,2426.624300001189,0.0}
Trams146;14;3;17681;19:2;{2569.3393000029027,869.8653000015765,0.0}
Trams146;14;2;17682;19:3;{2567.6414284064917,825.1840510346515,0.0}
Trams141;14;16;17687;19:3;{7477.508000001311,3581.729000000283,0.0}
Trams182;18;3;17689;19:4;{5123.508700001985,2583.745899999514,0.0}
Trams145;14;3;17689;19:4;{2808.1955000013113,1135.889900000766,0.0}
Trams183;18;22;17690;19:4;{6138.21238208538,2940.1058384544613,0.0}
Trams145;14;2;17690;19:4;{2774.94460455129,1095.9101807449765,0.0}
Trams146;14;0;17692;19:4;{2894.896500002593,514.0241999980062,0.0}
Trams141;14;18;17695;19:5;{7172.43200000003,3532.2607999984175,0.0}
Trams145;14;1;17697;19:5;{2567.6414284064917,825.1840510346515,0.0}
Trams181;18;2;17699;19:5;{845.340600002557,806.1041999999434,0.0}
Trams183;18;20;17700;19:6;{5641.738919684285,2786.998382666919,0.0}
Trams182;18;2;17702;19:6;{5739.764803540053,2830.2159521656795,0.0}
Trams183;18;19;17713;19:8;{5058.904000002891,2546.714799998328,0.0}
Trams183;18;17;17714;19:8;{5010.473492013262,2527.781076226536,0.0}
Trams144;14;1;17717;19:8;{2567.6414284064917,825.1840510346515,0.0}
Trams141;14;19;17718;19:9;{6188.119100000709,2954.7112999986857,0.0}
Trams183;18;14;17721;19:9;{4672.309900000691,2395.577299999073,0.0}
Trams181;18;3;17729;19:10;{2149.2538000009954,1363.784799998626,0.0}
Trams141;14;17;17729;19:10;{5641.738919684285,2786.998382666919,0.0}
Trams141;14;18;17730;19:11;{5634.466500002891,2784.006800001487,0.0}
Trams149;14;9;17732;19:11;{5689.812200002372,2815.7713999990374,0.0}
Trams183;18;12;17735;19:11;{4031.8555000014603,2128.9623999986798,0.0}
Trams183;18;10;17766;19:17;{2589.0274000018835,1538.5219000000507,0.0}
Trams183;18;7;17776;19:18;{2110.2352000027895,1344.0613000001758,0.0}
Trams183;18;4;17777;19:18;{2064.0685709043055,1320.5282183098925,0.0}
Trams181;18;2;17792;19:21;{5108.905971347362,2577.745680309252,0.0}
Trams141;14;15;17799;19:22;{2808.1955000013113,1135.889900000766,0.0}
Trams141;14;13;17800;19:22;{2774.94460455129,1095.9101807449765,0.0}
Trams141;14;12;17806;19:23;{2569.3393000029027,869.8653000015765,0.0}
Trams141;14;10;17807;19:23;{2567.6414284064917,825.1840510346515,0.0}
Trams141;14;6;17817;19:25;{2894.896500002593,514.0241999980062,0.0}
Trams142;14;10;17834;19:28;{2894.896500002593,514.0241999980062,0.0}
