tramName;tramLine;nPassengers;cycleNo;time;location
Trams141;14;6;6551;6:0;{2894.896500002593,514.0241999980062,0.0}
Trams188;18;3;6560;6:1;{2627.1466000005603,1561.507400000468,0.0}
Trams141;14;7;6563;6:2;{2597.49450000003,904.9190000016242,0.0}
Trams184;18;3;6568;6:3;{5058.904000002891,2546.714799998328,0.0}
Trams181;18;4;6574;6:4;{4722.0763000026345,2426.624300001189,0.0}
Trams142;14;7;6581;6:5;{2597.49450000003,904.9190000016242,0.0}
Trams181;18;6;6583;6:5;{5123.508700001985,2583.745899999514,0.0}
Trams187;18;5;6597;6:7;{1782.5218000002205,1208.6106000002474,0.0}
Trams185;18;3;6598;6:8;{2589.0274000018835,1538.5219000000507,0.0}
Trams147;14;4;6598;6:8;{5058.904000002891,2546.714799998328,0.0}
Trams143;14;7;6604;6:9;{2894.896500002593,514.0241999980062,0.0}
Trams188;18;5;6605;6:9;{4722.0763000026345,2426.624300001189,0.0}
Trams181;18;7;6606;6:9;{6221.943900000304,2968.579499999061,0.0}
Trams183;18;3;6609;6:9;{5058.904000002891,2546.714799998328,0.0}
Trams188;18;8;6614;6:10;{5123.508700001985,2583.745899999514,0.0}
Trams187;18;6;6615;6:10;{2627.1466000005603,1561.507400000468,0.0}
Trams143;14;13;6616;6:11;{2597.49450000003,904.9190000016242,0.0}
Trams141;14;8;6620;6:11;{4722.0763000026345,2426.624300001189,0.0}
Trams184;18;2;6621;6:11;{2589.0274000018835,1538.5219000000507,0.0}
Trams143;14;14;6624;6:12;{2839.1857000030577,1180.8036000002176,0.0}
Trams188;18;9;6626;6:12;{5689.812200002372,2815.7713999990374,0.0}
Trams182;18;2;6628;6:13;{6188.119100000709,2954.7112999986857,0.0}
Trams185;18;2;6628;6:13;{1208.916700001806,962.1525999996811,0.0}
Trams141;14;10;6629;6:13;{5123.508700001985,2583.745899999514,0.0}
Trams181;18;6;6630;6:13;{7223.311400000006,3570.043500000611,0.0}
Trams181;18;3;6636;6:14;{7477.508000001311,3581.729000000283,0.0}
Trams181;18;2;6637;6:14;{7477.508000001311,3581.729000000283,0.0}
Trams188;18;10;6637;6:14;{6221.943900000304,2968.579499999061,0.0}
Trams143;14;13;6637;6:14;{3035.1652000024915,1729.7097000014037,0.0}
Trams142;14;11;6638;6:14;{4722.0763000026345,2426.624300001189,0.0}
Trams149;14;8;6638;6:14;{2894.896500002593,514.0241999980062,0.0}
Trams182;18;3;6640;6:15;{5634.466500002891,2784.006800001487,0.0}
Trams147;14;3;6642;6:15;{2992.747200001031,1703.0900999996811,0.0}
Trams186;18;1;6645;6:15;{2627.1466000005603,1561.507400000468,0.0}
Trams142;14;12;6647;6:16;{5123.508700001985,2583.745899999514,0.0}
Trams149;14;11;6650;6:16;{2597.49450000003,904.9190000016242,0.0}
Trams188;18;9;6653;6:17;{6883.719200000167,3354.242599999532,0.0}
Trams148;14;4;6658;6:18;{2894.896500002593,514.0241999980062,0.0}
Trams149;14;14;6658;6:18;{2839.1857000030577,1180.8036000002176,0.0}
Trams185;18;6;6659;6:18;{1782.5218000002205,1208.6106000002474,0.0}
Trams143;14;12;6659;6:18;{4084.1569000035524,2161.088000001386,0.0}
Trams182;18;4;6660;6:18;{4672.309900000691,2395.577299999073,0.0}
Trams188;18;8;6661;6:18;{7223.311400000006,3570.043500000611,0.0}
Trams185;18;7;6667;6:19;{2149.2538000009954,1363.784799998626,0.0}
Trams188;18;2;6667;6:19;{7477.508000001311,3581.729000000283,0.0}
Trams141;14;9;6667;6:19;{6864.837443928478,3341.6995773341046,0.0}
Trams187;18;9;6669;6:19;{5123.508700001985,2583.745899999514,0.0}
Trams142;14;13;6670;6:20;{6221.943900000304,2968.579499999061,0.0}
Trams148;14;9;6670;6:20;{2597.49450000003,904.9190000016242,0.0}
Trams183;18;2;6672;6:20;{2110.2352000027895,1344.0613000001758,0.0}
Trams143;14;13;6673;6:20;{4722.0763000026345,2426.624300001189,0.0}
Trams147;14;4;6673;6:20;{2894.896500002593,514.0241999980062,0.0}
Trams146;14;3;6677;6:21;{2569.3393000029027,869.8653000015765,0.0}
Trams181;18;3;6680;6:21;{5634.466500002891,2784.006800001487,0.0}
Trams187;18;10;6681;6:21;{5689.812200002372,2815.7713999990374,0.0}
Trams141;14;3;6682;6:22;{7477.508000001311,3581.729000000283,0.0}
Trams143;14;12;6682;6:22;{5123.508700001985,2583.745899999514,0.0}
Trams147;14;6;6685;6:22;{2597.49450000003,904.9190000016242,0.0}
Trams146;14;4;6688;6:23;{2894.896500002593,514.0241999980062,0.0}
Trams186;18;4;6690;6:23;{4722.0763000026345,2426.624300001189,0.0}
Trams187;18;9;6692;6:23;{6221.943900000304,2968.579499999061,0.0}
Trams147;14;7;6693;6:23;{2839.1857000030577,1180.8036000002176,0.0}
Trams186;18;5;6699;6:24;{5123.508700001985,2583.745899999514,0.0}
Trams142;14;6;6700;6:25;{7477.508000001311,3581.729000000283,0.0}
Trams146;14;6;6700;6:25;{2597.49450000003,904.9190000016242,0.0}
Trams142;14;5;6701;6:25;{7477.508000001311,3581.729000000283,0.0}
Trams145;14;3;6703;6:25;{2894.896500002593,514.0241999980062,0.0}
Trams182;18;5;6705;6:25;{2589.0274000018835,1538.5219000000507,0.0}
Trams149;14;13;6706;6:26;{4707.823850244834,2420.7529164061234,0.0}
Trams149;14;12;6707;6:26;{4722.0763000026345,2426.624300001189,0.0}
Trams186;18;7;6711;6:26;{5689.812200002372,2815.7713999990374,0.0}
Trams145;14;4;6715;6:27;{2597.49450000003,904.9190000016242,0.0}
Trams187;18;8;6716;6:27;{7223.311400000006,3570.043500000611,0.0}
Trams149;14;13;6716;6:27;{5123.508700001985,2583.745899999514,0.0}
Trams143;14;11;6720;6:28;{6864.837443928478,3341.6995773341046,0.0}
Trams185;18;8;6722;6:28;{4722.0763000026345,2426.624300001189,0.0}
Trams186;18;10;6722;6:28;{6221.943900000304,2968.579499999061,0.0}
Trams187;18;4;6722;6:28;{7477.508000001311,3581.729000000283,0.0}
Trams183;18;3;6723;6:28;{1782.5218000002205,1208.6106000002474,0.0}
Trams188;18;3;6723;6:28;{5058.904000002891,2546.714799998328,0.0}
Trams145;14;5;6723;6:28;{2839.1857000030577,1180.8036000002176,0.0}
Trams148;14;10;6727;6:29;{4722.0763000026345,2426.624300001189,0.0}
Trams183;18;5;6731;6:30;{2149.2538000009954,1363.784799998626,0.0}
Trams184;18;3;6731;6:30;{4084.1569000035524,2161.088000001386,0.0}
Trams185;18;9;6731;6:30;{5123.508700001985,2583.745899999514,0.0}
Trams186;18;9;6731;6:30;{6609.992500003427,3161.7836000006646,0.0}
Trams143;14;6;6735;6:30;{7477.508000001311,3581.729000000283,0.0}
Trams144;14;1;6735;6:30;{2597.49450000003,904.9190000016242,0.0}
Trams183;18;6;6741;6:31;{2627.1466000005603,1561.507400000468,0.0}
Trams182;18;4;6742;6:32;{874.5067790792331,818.4381949221134,0.0}
Trams147;14;9;6742;6:32;{4722.0763000026345,2426.624300001189,0.0}
Trams144;14;2;6743;6:32;{2839.1857000030577,1180.8036000002176,0.0}
Trams146;14;7;6743;6:32;{4084.1569000035524,2161.088000001386,0.0}
Trams182;18;1;6744;6:32;{845.340600002557,806.1041999999434,0.0}
Trams186;18;8;6747;6:32;{7267.007879060962,3598.2324644667874,0.0}
Trams147;14;10;6751;6:33;{5123.508700001985,2583.745899999514,0.0}
Trams186;18;0;6752;6:33;{7477.508000001311,3581.729000000283,0.0}
Trams187;18;5;6754;6:34;{6188.119100000709,2954.7112999986857,0.0}
Trams149;14;12;6755;6:34;{6883.719200000167,3354.242599999532,0.0}
Trams146;14;9;6757;6:34;{4722.0763000026345,2426.624300001189,0.0}
Trams145;14;4;6758;6:34;{4084.1569000035524,2161.088000001386,0.0}
Trams149;14;13;6763;6:35;{7223.311400000006,3570.043500000611,0.0}
Trams147;14;9;6764;6:35;{5739.764803540053,2830.2159521656795,0.0}
Trams149;14;12;6764;6:35;{7267.007879060962,3598.2324644667874,0.0}
Trams182;18;2;6766;6:36;{1782.5218000002205,1208.6106000002474,0.0}
Trams146;14;10;6766;6:36;{5123.508700001985,2583.745899999514,0.0}
Trams149;14;3;6769;6:36;{7477.508000001311,3581.729000000283,0.0}
Trams145;14;6;6772;6:37;{4722.0763000026345,2426.624300001189,0.0}
Trams182;18;4;6774;6:37;{2149.2538000009954,1363.784799998626,0.0}
Trams147;14;10;6774;6:37;{6221.943900000304,2968.579499999061,0.0}
Trams188;18;2;6776;6:37;{2589.0274000018835,1538.5219000000507,0.0}
Trams146;14;9;6778;6:38;{5689.812200002372,2815.7713999990374,0.0}
Trams181;18;2;6782;6:38;{874.5067790792331,818.4381949221134,0.0}
Trams182;18;6;6784;6:39;{2627.1466000005603,1561.507400000468,0.0}
Trams185;18;1;6784;6:39;{7477.508000001311,3581.729000000283,0.0}
Trams184;18;2;6785;6:39;{6593.146138654794,3149.575753243163,0.0}
Trams185;18;0;6785;6:39;{7477.508000001311,3581.729000000283,0.0}
Trams187;18;6;6786;6:39;{4672.309900000691,2395.577299999073,0.0}
Trams148;14;1;6789;6:39;{7477.508000001311,3581.729000000283,0.0}
Trams144;14;3;6792;6:40;{4722.0763000026345,2426.624300001189,0.0}
Trams182;18;7;6793;6:40;{3035.1652000024915,1729.7097000014037,0.0}
Trams145;14;7;6793;6:40;{5689.812200002372,2815.7713999990374,0.0}
Trams183;18;7;6795;6:40;{5123.508700001985,2583.745899999514,0.0}
Trams146;14;8;6798;6:41;{6609.992500003427,3161.7836000006646,0.0}
Trams144;14;5;6801;6:41;{5123.508700001985,2583.745899999514,0.0}
Trams147;14;2;6804;6:42;{7477.508000001311,3581.729000000283,0.0}
Trams186;18;1;6808;6:43;{5058.904000002891,2546.714799998328,0.0}
Trams141;14;12;6813;6:43;{2894.896500002593,514.0241999980062,0.0}
Trams181;18;4;6814;6:44;{2149.2538000009954,1363.784799998626,0.0}
Trams182;18;8;6815;6:44;{4084.1569000035524,2161.088000001386,0.0}
Trams146;14;2;6819;6:44;{7477.508000001311,3581.729000000283,0.0}
Trams181;18;6;6824;6:45;{2627.1466000005603,1561.507400000468,0.0}
Trams141;14;20;6825;6:45;{2597.49450000003,904.9190000016242,0.0}
Trams185;18;2;6828;6:46;{5634.466500002891,2784.006800001487,0.0}
Trams182;18;11;6829;6:46;{4722.0763000026345,2426.624300001189,0.0}
Trams187;18;7;6831;6:46;{2589.0274000018835,1538.5219000000507,0.0}
Trams142;14;7;6831;6:46;{2894.896500002593,514.0241999980062,0.0}
Trams142;14;8;6832;6:47;{2892.683600001037,511.3241000007838,0.0}
Trams141;14;24;6833;6:47;{2839.1857000030577,1180.8036000002176,0.0}
Trams145;14;1;6834;6:47;{7477.508000001311,3581.729000000283,0.0}
Trams182;18;16;6838;6:48;{5123.508700001985,2583.745899999514,0.0}
Trams183;18;6;6843;6:48;{7267.007879060962,3598.2324644667874,0.0}
Trams142;14;10;6843;6:48;{2597.49450000003,904.9190000016242,0.0}
Trams188;18;3;6845;6:49;{2149.2538000009954,1363.784799998626,0.0}
Trams141;14;22;6847;6:49;{3084.0353342962862,1747.4296273253601,0.0}
Trams183;18;2;6848;6:49;{7477.508000001311,3581.729000000283,0.0}
Trams182;18;20;6850;6:50;{5689.812200002372,2815.7713999990374,0.0}
Trams187;18;6;6850;6:50;{1692.722305299079,1166.6255241828771,0.0}
Trams142;14;11;6851;6:50;{2839.1857000030577,1180.8036000002176,0.0}
Trams144;14;1;6854;6:50;{7477.508000001311,3581.729000000283,0.0}
Trams188;18;4;6855;6:50;{2627.1466000005603,1561.507400000468,0.0}
Trams144;14;0;6855;6:50;{7477.508000001311,3581.729000000283,0.0}
Trams187;18;5;6861;6:51;{1208.916700001806,962.1525999996811,0.0}
Trams184;18;3;6863;6:52;{5058.904000002891,2546.714799998328,0.0}
Trams143;14;7;6866;6:52;{2894.896500002593,514.0241999980062,0.0}
Trams182;18;19;6869;6:53;{6593.146138654794,3149.575753243163,0.0}
Trams187;18;4;6870;6:53;{845.340600002557,806.1041999999434,0.0}
Trams184;18;5;6871;6:53;{4672.309900000691,2395.577299999073,0.0}
Trams143;14;10;6878;6:54;{2597.49450000003,904.9190000016242,0.0}
Trams186;18;0;6879;6:54;{1740.6504000015557,1186.7970000002533,0.0}
Trams182;18;18;6886;6:56;{7267.007879060962,3598.2324644667874,0.0}
Trams143;14;15;6886;6:56;{2839.1857000030577,1180.8036000002176,0.0}
Trams181;18;8;6890;6:56;{5689.812200002372,2815.7713999990374,0.0}
Trams182;18;3;6891;6:56;{7477.508000001311,3581.729000000283,0.0}
Trams141;14;21;6891;6:56;{5123.508700001985,2583.745899999514,0.0}
Trams182;18;1;6892;6:57;{7477.508000001311,3581.729000000283,0.0}
Trams145;14;2;6898;6:58;{4672.309900000691,2395.577299999073,0.0}
Trams143;14;14;6899;6:58;{3035.1652000024915,1729.7097000014037,0.0}
Trams187;18;7;6900;6:58;{2149.2538000009954,1363.784799998626,0.0}
Trams188;18;5;6900;6:58;{4722.0763000026345,2426.624300001189,0.0}
Trams149;14;7;6900;6:58;{2894.896500002593,514.0241999980062,0.0}
Trams181;18;9;6901;6:58;{6221.943900000304,2968.579499999061,0.0}
Trams183;18;3;6912;7:0;{4672.309900000691,2395.577299999073,0.0}
Trams145;14;1;6912;7:0;{4031.8555000014603,2128.9623999986798,0.0}
Trams149;14;12;6912;7:0;{2597.49450000003,904.9190000016242,0.0}
Trams141;14;20;6914;7:0;{6221.943900000304,2968.579499999061,0.0}
Trams187;18;6;6919;7:1;{3035.1652000024915,1729.7097000014037,0.0}
Trams148;14;3;6920;7:1;{2894.896500002593,514.0241999980062,0.0}
Trams188;18;7;6921;7:1;{5689.812200002372,2815.7713999990374,0.0}
Trams143;14;15;6921;7:1;{4084.1569000035524,2161.088000001386,0.0}
Trams188;18;6;6922;7:2;{5739.764803540053,2830.2159521656795,0.0}
Trams181;18;8;6925;7:2;{7223.311400000006,3570.043500000611,0.0}
Trams186;18;4;6930;7:3;{2149.2538000009954,1363.784799998626,0.0}
Trams181;18;2;6931;7:3;{7477.508000001311,3581.729000000283,0.0}
Trams185;18;0;6932;7:3;{845.340600002557,806.1041999999434,0.0}
Trams188;18;8;6932;7:3;{6221.943900000304,2968.579499999061,0.0}
Trams148;14;5;6932;7:3;{2597.49450000003,904.9190000016242,0.0}
Trams185;18;1;6934;7:4;{902.5305000022054,834.7037000004202,0.0}
Trams149;14;11;6934;7:4;{3084.0353342962862,1747.4296273253601,0.0}
Trams182;18;2;6935;7:4;{5634.466500002891,2784.006800001487,0.0}
Trams184;18;4;6935;7:4;{1692.722305299079,1166.6255241828771,0.0}
Trams143;14;19;6935;7:4;{4722.0763000026345,2426.624300001189,0.0}
Trams147;14;4;6935;7:4;{2894.896500002593,514.0241999980062,0.0}
Trams186;18;5;6940;7:5;{2627.1466000005603,1561.507400000468,0.0}
Trams141;14;5;6944;7:5;{7477.508000001311,3581.729000000283,0.0}
Trams143;14;24;6944;7:5;{5123.508700001985,2583.745899999514,0.0}
Trams1410;14;1;6944;7:5;{5123.508700001985,2583.745899999514,0.0}
Trams141;14;2;6945;7:5;{7477.508000001311,3581.729000000283,0.0}
Trams182;18;4;6947;7:6;{5058.904000002891,2546.714799998328,0.0}
Trams147;14;6;6947;7:6;{2597.49450000003,904.9190000016242,0.0}
Trams186;18;6;6949;7:6;{3035.1652000024915,1729.7097000014037,0.0}
Trams146;14;5;6950;7:6;{2894.896500002593,514.0241999980062,0.0}
Trams185;18;0;6953;7:7;{1768.882714616512,1202.84636491075,0.0}
Trams182;18;7;6955;7:7;{4672.309900000691,2395.577299999073,0.0}
Trams184;18;2;6955;7:7;{845.340600002557,806.1041999999434,0.0}
Trams187;18;7;6955;7:7;{4722.0763000026345,2426.624300001189,0.0}
Trams147;14;9;6955;7:7;{2839.1857000030577,1180.8036000002176,0.0}
Trams1410;14;2;6956;7:7;{5689.812200002372,2815.7713999990374,0.0}
Trams143;14;23;6957;7:7;{5739.764803540053,2830.2159521656795,0.0}
Trams185;18;1;6962;7:8;{2149.2538000009954,1363.784799998626,0.0}
Trams188;18;1;6962;7:8;{7477.508000001311,3581.729000000283,0.0}
Trams142;14;4;6962;7:8;{7477.508000001311,3581.729000000283,0.0}
Trams146;14;7;6962;7:8;{2597.49450000003,904.9190000016242,0.0}
Trams187;18;11;6964;7:9;{5123.508700001985,2583.745899999514,0.0}
Trams145;14;3;6965;7:9;{2894.896500002593,514.0241999980062,0.0}
Trams182;18;6;6968;7:9;{4048.297289360261,2135.7927898531034,0.0}
Trams182;18;5;6969;7:9;{4031.8555000014603,2128.9623999986798,0.0}
Trams149;14;13;6969;7:9;{4722.0763000026345,2426.624300001189,0.0}
Trams146;14;9;6970;7:10;{2839.1857000030577,1180.8036000002176,0.0}
Trams185;18;2;6972;7:10;{2627.1466000005603,1561.507400000468,0.0}
Trams181;18;3;6975;7:10;{5634.466500002891,2784.006800001487,0.0}
Trams183;18;4;6975;7:10;{1740.6504000015557,1186.7970000002533,0.0}
Trams187;18;12;6976;7:11;{5689.812200002372,2815.7713999990374,0.0}
Trams145;14;8;6977;7:11;{2597.49450000003,904.9190000016242,0.0}
Trams149;14;15;6978;7:11;{5123.508700001985,2583.745899999514,0.0}
Trams143;14;22;6982;7:12;{6864.837443928478,3341.6995773341046,0.0}
Trams184;18;4;6985;7:12;{2149.2538000009954,1363.784799998626,0.0}
Trams186;18;10;6985;7:12;{4722.0763000026345,2426.624300001189,0.0}
Trams144;14;1;6985;7:12;{2894.896500002593,514.0241999980062,0.0}
Trams145;14;10;6985;7:12;{2839.1857000030577,1180.8036000002176,0.0}
Trams181;18;4;6987;7:12;{5058.904000002891,2546.714799998328,0.0}
Trams149;14;16;6990;7:13;{5689.812200002372,2815.7713999990374,0.0}
Trams182;18;4;6991;7:13;{2992.747200001031,1703.0900999996811,0.0}
Trams149;14;15;6991;7:13;{5739.764803540053,2830.2159521656795,0.0}
Trams186;18;11;6994;7:14;{5123.508700001985,2583.745899999514,0.0}
Trams181;18;5;6995;7:14;{4672.309900000691,2395.577299999073,0.0}
Trams184;18;6;6995;7:14;{2627.1466000005603,1561.507400000468,0.0}
Trams183;18;2;6996;7:14;{845.340600002557,806.1041999999434,0.0}
Trams143;14;3;6997;7:14;{7477.508000001311,3581.729000000283,0.0}
Trams144;14;5;6997;7:14;{2597.49450000003,904.9190000016242,0.0}
Trams1410;14;0;6997;7:14;{7477.508000001311,3581.729000000283,0.0}
Trams182;18;7;7000;7:15;{2589.0274000018835,1538.5219000000507,0.0}
Trams141;14;4;7000;7:15;{5058.904000002891,2546.714799998328,0.0}
Trams147;14;11;7004;7:15;{4722.0763000026345,2426.624300001189,0.0}
Trams144;14;7;7005;7:15;{2839.1857000030577,1180.8036000002176,0.0}
Trams186;18;10;7006;7:16;{5689.812200002372,2815.7713999990374,0.0}
Trams141;14;5;7008;7:16;{4672.309900000691,2395.577299999073,0.0}
Trams147;14;13;7013;7:17;{5123.508700001985,2583.745899999514,0.0}
Trams185;18;5;7017;7:17;{4722.0763000026345,2426.624300001189,0.0}
Trams186;18;11;7017;7:17;{6221.943900000304,2968.579499999061,0.0}
Trams187;18;4;7017;7:17;{7477.508000001311,3581.729000000283,0.0}
Trams182;18;6;7018;7:18;{1740.6504000015557,1186.7970000002533,0.0}
Trams146;14;12;7019;7:18;{4722.0763000026345,2426.624300001189,0.0}
Trams141;14;6;7022;7:18;{4031.8555000014603,2128.9623999986798,0.0}
Trams147;14;14;7025;7:19;{5689.812200002372,2815.7713999990374,0.0}
Trams183;18;7;7026;7:19;{2149.2538000009954,1363.784799998626,0.0}
Trams185;18;6;7026;7:19;{5123.508700001985,2583.745899999514,0.0}
Trams149;14;14;7026;7:19;{7267.007879060962,3598.2324644667874,0.0}
Trams182;18;5;7030;7:20;{1208.916700001806,962.1525999996811,0.0}
Trams181;18;4;7031;7:20;{2992.747200001031,1703.0900999996811,0.0}
Trams149;14;4;7031;7:20;{7477.508000001311,3581.729000000283,0.0}
Trams149;14;3;7032;7:20;{7477.508000001311,3581.729000000283,0.0}
Trams145;14;12;7034;7:20;{4722.0763000026345,2426.624300001189,0.0}
Trams183;18;13;7036;7:21;{2627.1466000005603,1561.507400000468,0.0}
Trams185;18;7;7038;7:21;{5689.812200002372,2815.7713999990374,0.0}
Trams182;18;1;7039;7:21;{845.340600002557,806.1041999999434,0.0}
Trams144;14;8;7040;7:21;{4084.1569000035524,2161.088000001386,0.0}
Trams145;14;15;7043;7:22;{5123.508700001985,2583.745899999514,0.0}
Trams141;14;5;7044;7:22;{2992.747200001031,1703.0900999996811,0.0}
Trams183;18;14;7045;7:22;{3035.1652000024915,1729.7097000014037,0.0}
Trams186;18;0;7047;7:22;{7477.508000001311,3581.729000000283,0.0}
Trams182;18;2;7049;7:23;{1241.924200002104,980.4126999992877,0.0}
Trams184;18;7;7049;7:23;{5123.508700001985,2583.745899999514,0.0}
Trams185;18;8;7049;7:23;{6221.943900000304,2968.579499999061,0.0}
Trams148;14;1;7051;7:23;{7477.508000001311,3581.729000000283,0.0}
Trams144;14;13;7054;7:24;{4722.0763000026345,2426.624300001189,0.0}
Trams141;14;3;7057;7:24;{2808.1955000013113,1135.889900000766,0.0}
Trams147;14;13;7061;7:25;{7267.007879060962,3598.2324644667874,0.0}
Trams144;14;17;7063;7:25;{5123.508700001985,2583.745899999514,0.0}
Trams141;14;2;7065;7:25;{2567.6414284064917,825.1840510346515,0.0}
Trams145;14;16;7066;7:26;{6221.943900000304,2968.579499999061,0.0}
Trams147;14;1;7066;7:26;{7477.508000001311,3581.729000000283,0.0}
Trams183;18;15;7067;7:26;{4084.1569000035524,2161.088000001386,0.0}
Trams182;18;4;7069;7:26;{2149.2538000009954,1363.784799998626,0.0}
Trams141;14;12;7075;7:27;{2894.896500002593,514.0241999980062,0.0}
Trams144;14;19;7075;7:27;{5689.812200002372,2815.7713999990374,0.0}
Trams181;18;3;7077;7:27;{874.5067790792331,818.4381949221134,0.0}
Trams181;18;4;7078;7:28;{845.340600002557,806.1041999999434,0.0}
Trams181;18;3;7079;7:28;{845.340600002557,806.1041999999434,0.0}
Trams182;18;7;7079;7:28;{2627.1466000005603,1561.507400000468,0.0}
Trams185;18;1;7079;7:28;{7477.508000001311,3581.729000000283,0.0}
Trams185;18;0;7080;7:28;{7477.508000001311,3581.729000000283,0.0}
Trams183;18;16;7081;7:28;{4722.0763000026345,2426.624300001189,0.0}
Trams146;14;2;7081;7:28;{7477.508000001311,3581.729000000283,0.0}
Trams145;14;15;7082;7:28;{6883.719200000167,3354.242599999532,0.0}
Trams144;14;20;7086;7:29;{6221.943900000304,2968.579499999061,0.0}
Trams141;14;24;7087;7:29;{2597.49450000003,904.9190000016242,0.0}
Trams183;18;22;7090;7:30;{5123.508700001985,2583.745899999514,0.0}
Trams142;14;8;7093;7:30;{2894.896500002593,514.0241999980062,0.0}
Trams145;14;1;7096;7:31;{7477.508000001311,3581.729000000283,0.0}
Trams183;18;23;7102;7:32;{5689.812200002372,2815.7713999990374,0.0}
Trams184;18;1;7102;7:32;{7477.508000001311,3581.729000000283,0.0}
Trams142;14;9;7105;7:32;{2597.49450000003,904.9190000016242,0.0}
Trams181;18;6;7109;7:33;{2149.2538000009954,1363.784799998626,0.0}
Trams182;18;8;7110;7:33;{4084.1569000035524,2161.088000001386,0.0}
Trams144;14;19;7111;7:33;{7267.007879060962,3598.2324644667874,0.0}
Trams142;14;24;7113;7:33;{2839.1857000030577,1180.8036000002176,0.0}
Trams1411;14;1;7113;7:33;{2839.1857000030577,1180.8036000002176,0.0}
Trams144;14;1;7116;7:34;{7477.508000001311,3581.729000000283,0.0}
Trams144;14;0;7117;7:34;{7477.508000001311,3581.729000000283,0.0}
Trams182;18;11;7124;7:35;{4722.0763000026345,2426.624300001189,0.0}
Trams143;14;9;7128;7:36;{2894.896500002593,514.0241999980062,0.0}
Trams183;18;22;7129;7:36;{6883.719200000167,3354.242599999532,0.0}
Trams188;18;2;7132;7:37;{1782.5218000002205,1208.6106000002474,0.0}
Trams182;18;13;7133;7:37;{5123.508700001985,2583.745899999514,0.0}
Trams185;18;1;7135;7:37;{5058.904000002891,2546.714799998328,0.0}
Trams188;18;4;7140;7:38;{2149.2538000009954,1363.784799998626,0.0}
Trams143;14;15;7140;7:38;{2597.49450000003,904.9190000016242,0.0}
Trams183;18;3;7143;7:38;{7477.508000001311,3581.729000000283,0.0}
Trams141;14;23;7143;7:38;{4707.823850244834,2420.7529164061234,0.0}
Trams183;18;2;7144;7:39;{7477.508000001311,3581.729000000283,0.0}
Trams187;18;5;7144;7:39;{1740.6504000015557,1186.7970000002533,0.0}
Trams141;14;24;7144;7:39;{4722.0763000026345,2426.624300001189,0.0}
Trams182;18;15;7145;7:39;{5689.812200002372,2815.7713999990374,0.0}
Trams143;14;18;7148;7:39;{2839.1857000030577,1180.8036000002176,0.0}
Trams1411;14;2;7148;7:39;{4084.1569000035524,2161.088000001386,0.0}
Trams188;18;5;7150;7:40;{2627.1466000005603,1561.507400000468,0.0}
Trams182;18;17;7156;7:41;{6221.943900000304,2968.579499999061,0.0}
Trams184;18;2;7158;7:41;{5058.904000002891,2546.714799998328,0.0}
Trams149;14;10;7162;7:42;{2894.896500002593,514.0241999980062,0.0}
Trams1411;14;6;7162;7:42;{4722.0763000026345,2426.624300001189,0.0}
Trams187;18;4;7165;7:42;{845.340600002557,806.1041999999434,0.0}
Trams1411;14;7;7171;7:43;{5123.508700001985,2583.745899999514,0.0}
Trams182;18;15;7172;7:43;{6883.719200000167,3354.242599999532,0.0}
Trams144;14;1;7172;7:43;{5058.904000002891,2546.714799998328,0.0}
Trams149;14;18;7174;7:44;{2597.49450000003,904.9190000016242,0.0}
Trams148;14;2;7182;7:45;{2894.896500002593,514.0241999980062,0.0}
Trams149;14;21;7182;7:45;{2839.1857000030577,1180.8036000002176,0.0}
Trams1411;14;9;7183;7:45;{5689.812200002372,2815.7713999990374,0.0}
Trams182;18;3;7186;7:46;{7477.508000001311,3581.729000000283,0.0}
Trams182;18;2;7187;7:46;{7477.508000001311,3581.729000000283,0.0}
Trams187;18;6;7187;7:46;{1782.5218000002205,1208.6106000002474,0.0}
Trams148;14;3;7194;7:47;{2597.49450000003,904.9190000016242,0.0}
Trams1411;14;12;7194;7:47;{6221.943900000304,2968.579499999061,0.0}
Trams187;18;8;7195;7:47;{2149.2538000009954,1363.784799998626,0.0}
Trams188;18;7;7195;7:47;{4722.0763000026345,2426.624300001189,0.0}
Trams147;14;2;7197;7:47;{2894.896500002593,514.0241999980062,0.0}
Trams141;14;23;7201;7:48;{7267.007879060962,3598.2324644667874,0.0}
Trams148;14;5;7202;7:48;{2839.1857000030577,1180.8036000002176,0.0}
Trams188;18;13;7204;7:49;{5123.508700001985,2583.745899999514,0.0}
Trams187;18;10;7205;7:49;{2627.1466000005603,1561.507400000468,0.0}
Trams141;14;2;7206;7:49;{7477.508000001311,3581.729000000283,0.0}
Trams183;18;3;7207;7:49;{4672.309900000691,2395.577299999073,0.0}
Trams185;18;0;7207;7:49;{1692.722305299079,1166.6255241828771,0.0}
Trams147;14;6;7209;7:49;{2597.49450000003,904.9190000016242,0.0}
Trams1411;14;11;7209;7:49;{6864.837443928478,3341.6995773341046,0.0}
Trams146;14;4;7212;7:50;{2894.896500002593,514.0241999980062,0.0}
Trams188;18;16;7216;7:51;{5689.812200002372,2815.7713999990374,0.0}
Trams144;14;0;7216;7:51;{2992.747200001031,1703.0900999996811,0.0}
Trams186;18;1;7217;7:51;{1782.5218000002205,1208.6106000002474,0.0}
Trams147;14;10;7217;7:51;{2839.1857000030577,1180.8036000002176,0.0}
Trams181;18;5;7221;7:51;{7267.007879060962,3598.2324644667874,0.0}
Trams183;18;4;7221;7:51;{4031.8555000014603,2128.9623999986798,0.0}
Trams142;14;2;7224;7:52;{7477.508000001311,3581.729000000283,0.0}
Trams146;14;8;7224;7:52;{2597.49450000003,904.9190000016242,0.0}
Trams1411;14;2;7224;7:52;{7477.508000001311,3581.729000000283,0.0}
Trams186;18;4;7225;7:52;{2149.2538000009954,1363.784799998626,0.0}
Trams1411;14;1;7225;7:52;{7477.508000001311,3581.729000000283,0.0}
Trams181;18;2;7226;7:52;{7477.508000001311,3581.729000000283,0.0}
Trams188;18;17;7227;7:52;{6221.943900000304,2968.579499999061,0.0}
Trams145;14;2;7227;7:52;{2894.896500002593,514.0241999980062,0.0}
Trams181;18;1;7229;7:53;{7399.735580409566,3546.353579350148,0.0}
Trams182;18;3;7230;7:53;{5634.466500002891,2784.006800001487,0.0}
Trams149;14;24;7231;7:53;{4722.0763000026345,2426.624300001189,0.0}
Trams146;14;9;7232;7:53;{2839.1857000030577,1180.8036000002176,0.0}
Trams186;18;5;7235;7:54;{2627.1466000005603,1561.507400000468,0.0}
Trams145;14;3;7239;7:54;{2597.49450000003,904.9190000016242,0.0}
Trams183;18;3;7244;7:55;{2942.963136644313,1688.2069726773154,0.0}
Trams144;14;3;7247;7:56;{2894.896500002593,514.0241999980062,0.0}
Trams184;18;1;7250;7:56;{845.340600002557,806.1041999999434,0.0}
Trams187;18;17;7250;7:56;{4722.0763000026345,2426.624300001189,0.0}
Trams141;14;3;7250;7:56;{5634.466500002891,2784.006800001487,0.0}
Trams147;14;12;7252;7:57;{4084.1569000035524,2161.088000001386,0.0}
Trams147;14;11;7253;7:57;{4132.967545312427,2178.980077572535,0.0}
Trams149;14;23;7253;7:57;{5739.764803540053,2830.2159521656795,0.0}
Trams185;18;1;7257;7:57;{2149.2538000009954,1363.784799998626,0.0}
Trams188;18;1;7257;7:57;{7477.508000001311,3581.729000000283,0.0}
Trams188;18;0;7258;7:58;{7477.508000001311,3581.729000000283,0.0}
Trams187;18;20;7259;7:58;{5123.508700001985,2583.745899999514,0.0}
Trams143;14;2;7259;7:58;{7477.508000001311,3581.729000000283,0.0}
Trams144;14;5;7259;7:58;{2597.49450000003,904.9190000016242,0.0}
Trams183;18;2;7262;7:58;{2110.2352000027895,1344.0613000001758,0.0}
Trams149;14;24;7263;7:58;{6221.943900000304,2968.579499999061,0.0}
Trams186;18;6;7266;7:59;{4084.1569000035524,2161.088000001386,0.0}
Trams147;14;13;7266;7:59;{4722.0763000026345,2426.624300001189,0.0}
Trams185;18;2;7267;7:59;{2627.1466000005603,1561.507400000468,0.0}
Trams144;14;8;7267;7:59;{2839.1857000030577,1180.8036000002176,0.0}
Trams141;14;4;7270;8:0;{4672.309900000691,2395.577299999073,0.0}
Trams187;18;23;7271;8:0;{5689.812200002372,2815.7713999990374,0.0}
Trams184;18;2;7280;8:1;{2149.2538000009954,1363.784799998626,0.0}
Trams141;14;3;7284;8:2;{4031.8555000014603,2128.9623999986798,0.0}
Trams182;18;2;7287;8:2;{2942.963136644313,1688.2069726773154,0.0}
Trams186;18;7;7289;8:3;{5123.508700001985,2583.745899999514,0.0}
Trams188;18;1;7289;8:3;{6188.119100000709,2954.7112999986857,0.0}
Trams143;14;3;7291;8:3;{6188.119100000709,2954.7112999986857,0.0}
Trams149;14;3;7293;8:3;{7477.508000001311,3581.729000000283,0.0}
Trams149;14;2;7294;8:4;{7477.508000001311,3581.729000000283,0.0}
Trams145;14;4;7296;8:4;{4722.0763000026345,2426.624300001189,0.0}
Trams186;18;9;7301;8:5;{5689.812200002372,2815.7713999990374,0.0}
Trams188;18;2;7301;8:5;{5634.466500002891,2784.006800001487,0.0}
Trams145;14;6;7305;8:5;{5123.508700001985,2583.745899999514,0.0}
Trams187;18;22;7307;8:6;{7267.007879060962,3598.2324644667874,0.0}
Trams185;18;4;7312;8:7;{4722.0763000026345,2426.624300001189,0.0}
Trams187;18;5;7312;8:7;{7477.508000001311,3581.729000000283,0.0}
Trams183;18;5;7313;8:7;{1782.5218000002205,1208.6106000002474,0.0}
Trams148;14;1;7313;8:7;{7477.508000001311,3581.729000000283,0.0}
Trams145;14;7;7317;8:7;{5689.812200002372,2815.7713999990374,0.0}
Trams141;14;2;7320;8:8;{2774.94460455129,1095.9101807449765,0.0}
Trams185;18;5;7321;8:8;{5123.508700001985,2583.745899999514,0.0}
Trams147;14;1;7328;8:9;{7477.508000001311,3581.729000000283,0.0}
Trams145;14;6;7329;8:9;{6271.932036142039,2982.903802087056,0.0}
Trams183;18;7;7331;8:10;{2627.1466000005603,1561.507400000468,0.0}
Trams181;18;2;7335;8:10;{2589.0274000018835,1538.5219000000507,0.0}
Trams184;18;4;7335;8:10;{4722.0763000026345,2426.624300001189,0.0}
Trams188;18;1;7335;8:10;{4031.8555000014603,2128.9623999986798,0.0}
Trams141;14;14;7337;8:11;{2894.896500002593,514.0241999980062,0.0}
Trams183;18;6;7340;8:11;{3035.1652000024915,1729.7097000014037,0.0}
Trams186;18;1;7342;8:12;{7477.508000001311,3581.729000000283,0.0}
Trams186;18;0;7343;8:12;{7477.508000001311,3581.729000000283,0.0}
Trams146;14;1;7343;8:12;{7477.508000001311,3581.729000000283,0.0}
Trams184;18;6;7344;8:12;{5123.508700001985,2583.745899999514,0.0}
Trams141;14;22;7349;8:13;{2597.49450000003,904.9190000016242,0.0}
Trams149;14;3;7349;8:13;{5058.904000002891,2546.714799998328,0.0}
Trams142;14;4;7355;8:14;{2894.896500002593,514.0241999980062,0.0}
Trams184;18;7;7356;8:14;{5689.812200002372,2815.7713999990374,0.0}
Trams187;18;6;7356;8:14;{5634.466500002891,2784.006800001487,0.0}
Trams141;14;24;7357;8:14;{2839.1857000030577,1180.8036000002176,0.0}
Trams145;14;0;7358;8:14;{7477.508000001311,3581.729000000283,0.0}
Trams147;14;2;7360;8:15;{6188.119100000709,2954.7112999986857,0.0}
Trams183;18;4;7362;8:15;{4084.1569000035524,2161.088000001386,0.0}
Trams182;18;3;7364;8:15;{2149.2538000009954,1363.784799998626,0.0}
Trams142;14;6;7367;8:16;{2597.49450000003,904.9190000016242,0.0}
Trams187;18;7;7368;8:16;{5058.904000002891,2546.714799998328,0.0}
Trams181;18;1;7374;8:17;{845.340600002557,806.1041999999434,0.0}
Trams182;18;5;7374;8:17;{2627.1466000005603,1561.507400000468,0.0}
Trams185;18;0;7374;8:17;{7477.508000001311,3581.729000000283,0.0}
Trams142;14;13;7375;8:17;{2839.1857000030577,1180.8036000002176,0.0}
Trams183;18;7;7376;8:17;{4722.0763000026345,2426.624300001189,0.0}
Trams187;18;8;7376;8:17;{4672.309900000691,2395.577299999073,0.0}
Trams148;14;2;7377;8:17;{4672.309900000691,2395.577299999073,0.0}
Trams144;14;2;7378;8:18;{7477.508000001311,3581.729000000283,0.0}
Trams144;14;1;7379;8:18;{7477.508000001311,3581.729000000283,0.0}
Trams143;14;2;7380;8:18;{2567.6414284064917,825.1840510346515,0.0}
Trams188;18;0;7384;8:19;{1740.6504000015557,1186.7970000002533,0.0}
Trams183;18;10;7385;8:19;{5123.508700001985,2583.745899999514,0.0}
Trams142;14;12;7389;8:19;{3084.0353342962862,1747.4296273253601,0.0}
Trams143;14;6;7390;8:20;{2894.896500002593,514.0241999980062,0.0}
Trams184;18;6;7392;8:20;{7267.007879060962,3598.2324644667874,0.0}
Trams141;14;23;7392;8:20;{4084.1569000035524,2161.088000001386,0.0}
Trams141;14;19;7393;8:20;{4132.967545312427,2178.980077572535,0.0}
Trams149;14;2;7393;8:20;{2992.747200001031,1703.0900999996811,0.0}
Trams181;18;2;7396;8:21;{1782.5218000002205,1208.6106000002474,0.0}
Trams184;18;0;7397;8:21;{7477.508000001311,3581.729000000283,0.0}
Trams143;14;9;7402;8:22;{2597.49450000003,904.9190000016242,0.0}
Trams181;18;4;7404;8:22;{2149.2538000009954,1363.784799998626,0.0}
Trams182;18;6;7405;8:22;{4084.1569000035524,2161.088000001386,0.0}
Trams141;14;20;7406;8:22;{4722.0763000026345,2426.624300001189,0.0}
Trams147;14;1;7406;8:22;{4031.8555000014603,2128.9623999986798,0.0}
Trams143;14;12;7410;8:23;{2839.1857000030577,1180.8036000002176,0.0}
Trams181;18;5;7414;8:24;{2627.1466000005603,1561.507400000468,0.0}
Trams141;14;23;7415;8:24;{5123.508700001985,2583.745899999514,0.0}
Trams149;14;4;7424;8:25;{2894.896500002593,514.0241999980062,0.0}
Trams188;18;1;7427;8:26;{1782.5218000002205,1208.6106000002474,0.0}
Trams148;14;1;7427;8:26;{2774.94460455129,1095.9101807449765,0.0}
Trams187;18;7;7431;8:26;{2110.2352000027895,1344.0613000001758,0.0}
Trams183;18;11;7432;8:27;{7223.311400000006,3570.043500000611,0.0}
Trams187;18;6;7432;8:27;{2064.0685709043055,1320.5282183098925,0.0}
Trams149;14;6;7436;8:27;{2597.49450000003,904.9190000016242,0.0}
Trams183;18;3;7438;8:28;{7477.508000001311,3581.729000000283,0.0}
Trams141;14;22;7439;8:28;{6271.932036142039,2982.903802087056,0.0}
Trams182;18;7;7440;8:28;{5689.812200002372,2815.7713999990374,0.0}
Trams148;14;2;7444;8:29;{2894.896500002593,514.0241999980062,0.0}
Trams149;14;9;7444;8:29;{2839.1857000030577,1180.8036000002176,0.0}
Trams143;14;11;7446;8:29;{4132.967545312427,2178.980077572535,0.0}
Trams148;14;3;7456;8:31;{2597.49450000003,904.9190000016242,0.0}
Trams143;14;10;7458;8:31;{4707.823850244834,2420.7529164061234,0.0}
Trams181;18;7;7459;8:31;{4722.0763000026345,2426.624300001189,0.0}
Trams187;18;4;7460;8:31;{845.340600002557,806.1041999999434,0.0}
Trams186;18;1;7461;8:31;{2110.2352000027895,1344.0613000001758,0.0}
Trams181;18;8;7468;8:33;{5123.508700001985,2583.745899999514,0.0}
Trams141;14;5;7468;8:33;{7477.508000001311,3581.729000000283,0.0}
Trams141;14;3;7469;8:33;{7477.508000001311,3581.729000000283,0.0}
Trams147;14;2;7471;8:33;{2597.49450000003,904.9190000016242,0.0}
Trams146;14;4;7474;8:34;{2894.896500002593,514.0241999980062,0.0}
Trams182;18;6;7476;8:34;{7267.007879060962,3598.2324644667874,0.0}
Trams181;18;9;7480;8:35;{5689.812200002372,2815.7713999990374,0.0}
Trams142;14;11;7480;8:35;{7223.311400000006,3570.043500000611,0.0}
Trams182;18;1;7481;8:35;{7477.508000001311,3581.729000000283,0.0}
Trams142;14;10;7481;8:35;{7267.007879060962,3598.2324644667874,0.0}
Trams183;18;4;7482;8:35;{5634.466500002891,2784.006800001487,0.0}
Trams187;18;5;7482;8:35;{1782.5218000002205,1208.6106000002474,0.0}
Trams185;18;1;7483;8:35;{2589.0274000018835,1538.5219000000507,0.0}
Trams142;14;1;7486;8:36;{7477.508000001311,3581.729000000283,0.0}
Trams146;14;6;7486;8:36;{2597.49450000003,904.9190000016242,0.0}
Trams145;14;3;7489;8:36;{2894.896500002593,514.0241999980062,0.0}
Trams187;18;10;7490;8:36;{2149.2538000009954,1363.784799998626,0.0}
Trams188;18;2;7490;8:36;{4722.0763000026345,2426.624300001189,0.0}
Trams143;14;9;7491;8:36;{6221.943900000304,2968.579499999061,0.0}
Trams143;14;8;7492;8:37;{6271.932036142039,2982.903802087056,0.0}
Trams183;18;5;7494;8:37;{5058.904000002891,2546.714799998328,0.0}
Trams146;14;9;7494;8:37;{2839.1857000030577,1180.8036000002176,0.0}
Trams188;18;5;7499;8:38;{5123.508700001985,2583.745899999514,0.0}
Trams181;18;8;7500;8:38;{6609.992500003427,3161.7836000006646,0.0}
Trams146;14;10;7507;8:39;{3035.1652000024915,1729.7097000014037,0.0}
Trams144;14;2;7509;8:39;{2894.896500002593,514.0241999980062,0.0}
Trams145;14;4;7509;8:39;{2839.1857000030577,1180.8036000002176,0.0}
Trams188;18;6;7511;8:40;{5689.812200002372,2815.7713999990374,0.0}
Trams141;14;4;7512;8:40;{5634.466500002891,2784.006800001487,0.0}
Trams185;18;0;7513;8:40;{1208.916700001806,962.1525999996811,0.0}
Trams148;14;6;7513;8:40;{4722.0763000026345,2426.624300001189,0.0}
Trams143;14;7;7516;8:41;{7267.007879060962,3598.2324644667874,0.0}
Trams186;18;3;7520;8:41;{2149.2538000009954,1363.784799998626,0.0}
Trams181;18;1;7521;8:41;{7477.508000001311,3581.729000000283,0.0}
Trams143;14;2;7521;8:41;{7477.508000001311,3581.729000000283,0.0}
Trams144;14;5;7521;8:41;{2597.49450000003,904.9190000016242,0.0}
Trams144;14;8;7529;8:43;{2839.1857000030577,1180.8036000002176,0.0}
Trams146;14;11;7529;8:43;{4084.1569000035524,2161.088000001386,0.0}
Trams186;18;4;7530;8:43;{2627.1466000005603,1561.507400000468,0.0}
Trams187;18;9;7531;8:43;{4084.1569000035524,2161.088000001386,0.0}
Trams141;14;5;7532;8:43;{4672.309900000691,2395.577299999073,0.0}
Trams148;14;7;7534;8:44;{5689.812200002372,2815.7713999990374,0.0}
Trams182;18;3;7537;8:44;{5058.904000002891,2546.714799998328,0.0}
Trams149;14;8;7541;8:45;{6883.719200000167,3354.242599999532,0.0}
Trams144;14;7;7543;8:45;{3084.0353342962862,1747.4296273253601,0.0}
Trams146;14;12;7543;8:45;{4722.0763000026345,2426.624300001189,0.0}
Trams185;18;2;7544;8:45;{1782.5218000002205,1208.6106000002474,0.0}
Trams182;18;4;7545;8:45;{4672.309900000691,2395.577299999073,0.0}
Trams141;14;4;7545;8:45;{4048.297289360261,2135.7927898531034,0.0}
Trams141;14;3;7546;8:46;{4031.8555000014603,2128.9623999986798,0.0}
Trams188;18;5;7547;8:46;{7267.007879060962,3598.2324644667874,0.0}
Trams149;14;9;7549;8:46;{7223.311400000006,3570.043500000611,0.0}
Trams185;18;3;7552;8:47;{2149.2538000009954,1363.784799998626,0.0}
Trams188;18;0;7552;8:47;{7477.508000001311,3581.729000000283,0.0}
Trams181;18;4;7553;8:47;{6188.119100000709,2954.7112999986857,0.0}
Trams149;14;2;7555;8:47;{7477.508000001311,3581.729000000283,0.0}
Trams145;14;6;7558;8:48;{4722.0763000026345,2426.624300001189,0.0}
Trams185;18;4;7562;8:48;{2627.1466000005603,1561.507400000468,0.0}
Trams146;14;15;7564;8:49;{5689.812200002372,2815.7713999990374,0.0}
Trams181;18;5;7565;8:49;{5634.466500002891,2784.006800001487,0.0}
Trams183;18;4;7566;8:49;{1692.722305299079,1166.6255241828771,0.0}
Trams147;14;1;7569;8:49;{6609.992500003427,3161.7836000006646,0.0}
Trams184;18;2;7575;8:50;{2149.2538000009954,1363.784799998626,0.0}
Trams186;18;5;7575;8:50;{4722.0763000026345,2426.624300001189,0.0}
Trams148;14;0;7575;8:50;{7477.508000001311,3581.729000000283,0.0}
Trams181;18;6;7577;8:51;{5058.904000002891,2546.714799998328,0.0}
Trams144;14;8;7578;8:51;{4722.0763000026345,2426.624300001189,0.0}
Trams186;18;7;7584;8:52;{5123.508700001985,2583.745899999514,0.0}
Trams181;18;7;7585;8:52;{4672.309900000691,2395.577299999073,0.0}
Trams184;18;3;7585;8:52;{2627.1466000005603,1561.507400000468,0.0}
Trams183;18;3;7586;8:52;{845.340600002557,806.1041999999434,0.0}
Trams145;14;7;7590;8:53;{6221.943900000304,2968.579499999061,0.0}
Trams186;18;8;7596;8:54;{5689.812200002372,2815.7713999990374,0.0}
Trams145;14;6;7598;8:54;{6593.146138654794,3149.575753243163,0.0}
Trams141;14;8;7599;8:54;{2894.896500002593,514.0241999980062,0.0}
Trams143;14;1;7599;8:54;{4031.8555000014603,2128.9623999986798,0.0}
Trams141;14;10;7600;8:55;{2892.683600001037,511.3241000007838,0.0}
Trams182;18;3;7601;8:55;{2064.0685709043055,1320.5282183098925,0.0}
Trams146;14;2;7605;8:55;{7477.508000001311,3581.729000000283,0.0}
Trams146;14;1;7606;8:56;{7477.508000001311,3581.729000000283,0.0}
Trams185;18;7;7607;8:56;{4722.0763000026345,2426.624300001189,0.0}
Trams187;18;3;7607;8:56;{7477.508000001311,3581.729000000283,0.0}
Trams188;18;1;7608;8:56;{5058.904000002891,2546.714799998328,0.0}
Trams144;14;7;7610;8:56;{6221.943900000304,2968.579499999061,0.0}
Trams141;14;15;7611;8:56;{2597.49450000003,904.9190000016242,0.0}
Trams149;14;3;7611;8:56;{5058.904000002891,2546.714799998328,0.0}
Trams185;18;9;7616;8:57;{5123.508700001985,2583.745899999514,0.0}
Trams188;18;2;7616;8:57;{4672.309900000691,2395.577299999073,0.0}
Trams142;14;2;7618;8:58;{2892.683600001037,511.3241000007838,0.0}
Trams144;14;6;7618;8:58;{6593.146138654794,3149.575753243163,0.0}
Trams182;18;2;7619;8:58;{1213.7785956119094,964.194963392883,0.0}
Trams141;14;17;7619;8:58;{2839.1857000030577,1180.8036000002176,0.0}
Trams182;18;1;7620;8:58;{1208.916700001806,962.1525999996811,0.0}
Trams145;14;0;7620;8:58;{7477.508000001311,3581.729000000283,0.0}
Trams181;18;5;7621;8:58;{2992.747200001031,1703.0900999996811,0.0}
Trams183;18;5;7626;8:59;{2627.1466000005603,1561.507400000468,0.0}
Trams185;18;10;7628;8:59;{5689.812200002372,2815.7713999990374,0.0}
Trams142;14;3;7629;8:59;{2597.49450000003,904.9190000016242,0.0}
Trams184;18;4;7630;9:0;{4722.0763000026345,2426.624300001189,0.0}
Trams188;18;1;7630;9:0;{4031.8555000014603,2128.9623999986798,0.0}
Trams186;18;1;7637;9:1;{7477.508000001311,3581.729000000283,0.0}
Trams184;18;5;7639;9:1;{5123.508700001985,2583.745899999514,0.0}
Trams181;18;4;7640;9:1;{2110.2352000027895,1344.0613000001758,0.0}
Trams144;14;2;7640;9:1;{7477.508000001311,3581.729000000283,0.0}
Trams187;18;4;7651;9:3;{5634.466500002891,2784.006800001487,0.0}
Trams143;14;3;7652;9:3;{2894.896500002593,514.0241999980062,0.0}
Trams181;18;2;7669;9:6;{845.340600002557,806.1041999999434,0.0}
Trams185;18;2;7669;9:6;{7477.508000001311,3581.729000000283,0.0}
Trams149;14;2;7669;9:6;{2774.94460455129,1095.9101807449765,0.0}
Trams185;18;0;7670;9:6;{7477.508000001311,3581.729000000283,0.0}
Trams188;18;0;7671;9:6;{2110.2352000027895,1344.0613000001758,0.0}
Trams141;14;16;7689;9:9;{5689.812200002372,2815.7713999990374,0.0}
Trams184;18;0;7692;9:10;{7477.508000001311,3581.729000000283,0.0}
Trams141;14;5;7730;9:16;{7477.508000001311,3581.729000000283,0.0}
Trams141;14;4;7731;9:16;{7477.508000001311,3581.729000000283,0.0}
Trams183;18;3;7733;9:17;{7477.508000001311,3581.729000000283,0.0}
Trams142;14;1;7748;9:19;{7477.508000001311,3581.729000000283,0.0}
Trams187;18;3;7755;9:20;{845.340600002557,806.1041999999434,0.0}
Trams143;14;1;7783;9:25;{7477.508000001311,3581.729000000283,0.0}
Trams143;14;0;7784;9:25;{7477.508000001311,3581.729000000283,0.0}
Trams143;14;1;10158;16:1;{6831.853600002825,3315.144899999723,0.0}
Trams149;14;10;10176;16:4;{7477.508000001311,3581.729000000283,0.0}
Trams149;14;12;10184;16:5;{7172.43200000003,3532.2607999984175,0.0}
Trams181;18;3;10185;16:5;{7172.43200000003,3532.2607999984175,0.0}
Trams186;18;2;10185;16:5;{2627.1466000005603,1561.507400000468,0.0}
Trams185;18;1;10187;16:6;{1241.924200002104,980.4126999992877,0.0}
Trams181;18;4;10193;16:7;{6831.853600002825,3315.144899999723,0.0}
Trams186;18;3;10194;16:7;{3035.1652000024915,1729.7097000014037,0.0}
Trams148;14;4;10196;16:7;{7477.508000001311,3581.729000000283,0.0}
Trams148;14;5;10204;16:9;{7172.43200000003,3532.2607999984175,0.0}
Trams142;14;2;10206;16:9;{2992.747200001031,1703.0900999996811,0.0}
Trams185;18;3;10207;16:9;{2149.2538000009954,1363.784799998626,0.0}
Trams188;18;3;10208;16:9;{7477.508000001311,3581.729000000283,0.0}
Trams149;14;11;10208;16:9;{6138.21238208538,2940.1058384544613,0.0}
Trams147;14;5;10211;16:10;{7477.508000001311,3581.729000000283,0.0}
Trams148;14;6;10212;16:10;{6831.853600002825,3315.144899999723,0.0}
Trams185;18;2;10218;16:11;{2675.4015184145933,1580.8842637522473,0.0}
Trams143;14;2;10219;16:11;{4031.8555000014603,2128.9623999986798,0.0}
Trams146;14;8;10226;16:12;{7477.508000001311,3581.729000000283,0.0}
Trams142;14;1;10227;16:12;{2567.6414284064917,825.1840510346515,0.0}
Trams149;14;12;10231;16:13;{5058.904000002891,2546.714799998328,0.0}
Trams149;14;11;10232;16:13;{5010.473492013262,2527.781076226536,0.0}
Trams186;18;1;10238;16:14;{5108.905971347362,2577.745680309252,0.0}
Trams149;14;10;10239;16:14;{4672.309900000691,2395.577299999073,0.0}
Trams183;18;5;10241;16:15;{845.340600002557,806.1041999999434,0.0}
Trams145;14;7;10241;16:15;{7477.508000001311,3581.729000000283,0.0}
Trams188;18;2;10250;16:16;{5641.738919684285,2786.998382666919,0.0}
Trams148;14;4;10251;16:16;{5058.904000002891,2546.714799998328,0.0}
Trams148;14;2;10252;16:17;{5010.473492013262,2527.781076226536,0.0}
Trams148;14;3;10259;16:18;{4672.309900000691,2395.577299999073,0.0}
Trams144;14;14;10261;16:18;{7477.508000001311,3581.729000000283,0.0}
Trams143;14;1;10262;16:18;{2567.6414284064917,825.1840510346515,0.0}
Trams187;18;9;10263;16:18;{7477.508000001311,3581.729000000283,0.0}
Trams187;18;11;10264;16:19;{7446.12100000307,3545.9720000009984,0.0}
Trams185;18;1;10271;16:20;{5123.508700001985,2583.745899999514,0.0}
Trams188;18;0;10271;16:20;{4672.309900000691,2395.577299999073,0.0}
Trams145;14;8;10272;16:20;{6188.119100000709,2954.7112999986857,0.0}
Trams145;14;7;10273;16:20;{6138.21238208538,2940.1058384544613,0.0}
Trams146;14;6;10282;16:22;{5010.473492013262,2527.781076226536,0.0}
Trams182;18;3;10284;16:22;{845.340600002557,806.1041999999434,0.0}
Trams145;14;8;10284;16:22;{5634.466500002891,2784.006800001487,0.0}
Trams181;18;3;10285;16:22;{2589.0274000018835,1538.5219000000507,0.0}
Trams143;14;0;10285;16:22;{2633.281761326615,942.6452763450786,0.0}
Trams146;14;4;10290;16:23;{4624.179771982149,2375.8925514936154,0.0}
Trams186;18;5;10293;16:23;{7477.508000001311,3581.729000000283,0.0}
Trams144;14;13;10293;16:23;{6138.21238208538,2940.1058384544613,0.0}
Trams185;18;0;10294;16:24;{6221.943900000304,2968.579499999061,0.0}
Trams145;14;7;10296;16:24;{5058.904000002891,2546.714799998328,0.0}
Trams149;14;7;10296;16:24;{2567.6414284064917,825.1840510346515,0.0}
Trams145;14;6;10297;16:24;{5010.473492013262,2527.781076226536,0.0}
Trams186;18;6;10301;16:25;{7172.43200000003,3532.2607999984175,0.0}
Trams181;18;2;10303;16:25;{1740.6504000015557,1186.7970000002533,0.0}
Trams145;14;4;10304;16:25;{4672.309900000691,2395.577299999073,0.0}
Trams145;14;3;10305;16:25;{4624.179771982149,2375.8925514936154,0.0}
Trams149;14;5;10306;16:26;{2894.896500002593,514.0241999980062,0.0}
Trams148;14;2;10308;16:26;{2808.1955000013113,1135.889900000766,0.0}
Trams186;18;7;10309;16:26;{6831.853600002825,3315.144899999723,0.0}
Trams182;18;2;10314;16:27;{2149.2538000009954,1363.784799998626,0.0}
Trams186;18;8;10316;16:27;{6563.806600000709,3123.2601999994367,0.0}
Trams144;14;12;10316;16:27;{5058.904000002891,2546.714799998328,0.0}
Trams148;14;1;10316;16:27;{2567.6414284064917,825.1840510346515,0.0}
Trams145;14;4;10318;16:28;{4031.8555000014603,2128.9623999986798,0.0}
Trams187;18;10;10319;16:28;{5010.473492013262,2527.781076226536,0.0}
Trams181;18;3;10324;16:29;{845.340600002557,806.1041999999434,0.0}
Trams182;18;3;10324;16:29;{2627.1466000005603,1561.507400000468,0.0}
Trams147;14;4;10324;16:29;{2774.94460455129,1095.9101807449765,0.0}
Trams185;18;10;10325;16:29;{7477.508000001311,3581.729000000283,0.0}
Trams183;18;4;10326;16:29;{4722.0763000026345,2426.624300001189,0.0}
Trams187;18;9;10326;16:29;{4672.309900000691,2395.577299999073,0.0}
Trams148;14;0;10326;16:29;{2894.896500002593,514.0241999980062,0.0}
Trams147;14;3;10330;16:30;{2569.3393000029027,869.8653000015765,0.0}
Trams147;14;2;10331;16:30;{2567.6414284064917,825.1840510346515,0.0}
Trams181;18;4;10334;16:30;{1241.924200002104,980.4126999992877,0.0}
Trams183;18;3;10334;16:30;{5108.905971347362,2577.745680309252,0.0}
Trams186;18;7;10335;16:30;{5641.738919684285,2786.998382666919,0.0}
Trams146;14;2;10346;16:32;{2567.6414284064917,825.1840510346515,0.0}
Trams183;18;2;10347;16:32;{5689.812200002372,2815.7713999990374,0.0}
Trams184;18;6;10348;16:33;{7477.508000001311,3581.729000000283,0.0}
Trams185;18;11;10348;16:33;{6563.806600000709,3123.2601999994367,0.0}
Trams186;18;6;10348;16:33;{5058.904000002891,2546.714799998328,0.0}
Trams141;14;24;10351;16:33;{7477.508000001311,3581.729000000283,0.0}
Trams145;14;3;10353;16:33;{2808.1955000013113,1135.889900000766,0.0}
Trams186;18;3;10356;16:34;{4672.309900000691,2395.577299999073,0.0}
Trams146;14;1;10356;16:34;{2894.896500002593,514.0241999980062,0.0}
Trams185;18;8;10357;16:34;{6138.21238208538,2940.1058384544613,0.0}
Trams186;18;2;10357;16:34;{4624.179771982149,2375.8925514936154,0.0}
Trams144;14;13;10360;16:35;{2992.747200001031,1703.0900999996811,0.0}
Trams181;18;3;10364;16:35;{2627.1466000005603,1561.507400000468,0.0}
Trams185;18;7;10367;16:36;{5641.738919684285,2786.998382666919,0.0}
Trams142;14;10;10369;16:36;{7477.508000001311,3581.729000000283,0.0}
Trams184;18;7;10371;16:36;{6563.806600000709,3123.2601999994367,0.0}
Trams187;18;7;10371;16:36;{2589.0274000018835,1538.5219000000507,0.0}
Trams145;14;0;10371;16:36;{2894.896500002593,514.0241999980062,0.0}
Trams144;14;12;10373;16:37;{2808.1955000013113,1135.889900000766,0.0}
Trams144;14;11;10374;16:37;{2774.94460455129,1095.9101807449765,0.0}
Trams182;18;2;10377;16:37;{5108.905971347362,2577.745680309252,0.0}
Trams188;18;1;10377;16:37;{1782.5218000002205,1208.6106000002474,0.0}
Trams144;14;9;10380;16:38;{2569.3393000029027,869.8653000015765,0.0}
Trams185;18;6;10381;16:38;{5010.473492013262,2527.781076226536,0.0}
Trams187;18;6;10381;16:38;{2110.2352000027895,1344.0613000001758,0.0}
Trams144;14;5;10381;16:38;{2567.6414284064917,825.1840510346515,0.0}
Trams149;14;4;10383;16:38;{5108.905971347362,2577.745680309252,0.0}
Trams185;18;4;10388;16:39;{4672.309900000691,2395.577299999073,0.0}
Trams183;18;10;10389;16:39;{7477.508000001311,3581.729000000283,0.0}
Trams187;18;2;10389;16:39;{1740.6504000015557,1186.7970000002533,0.0}
Trams183;18;13;10390;16:40;{7446.12100000307,3545.9720000009984,0.0}
Trams182;18;1;10391;16:40;{5739.764803540053,2830.2159521656795,0.0}
Trams144;14;2;10391;16:40;{2894.896500002593,514.0241999980062,0.0}
Trams183;18;14;10397;16:41;{7172.43200000003,3532.2607999984175,0.0}
Trams142;14;11;10400;16:41;{6188.119100000709,2954.7112999986857,0.0}
Trams142;14;10;10401;16:41;{6138.21238208538,2940.1058384544613,0.0}
Trams185;18;3;10402;16:42;{4031.8555000014603,2128.9623999986798,0.0}
Trams184;18;6;10404;16:42;{5010.473492013262,2527.781076226536,0.0}
Trams143;14;8;10404;16:42;{7477.508000001311,3581.729000000283,0.0}
Trams187;18;4;10410;16:43;{845.340600002557,806.1041999999434,0.0}
Trams184;18;3;10411;16:43;{4672.309900000691,2395.577299999073,0.0}
Trams183;18;15;10412;16:43;{6563.806600000709,3123.2601999994367,0.0}
Trams186;18;1;10419;16:44;{1740.6504000015557,1186.7970000002533,0.0}
Trams142;14;11;10424;16:45;{5058.904000002891,2546.714799998328,0.0}
Trams184;18;2;10425;16:45;{4031.8555000014603,2128.9623999986798,0.0}
Trams142;14;10;10425;16:45;{5010.473492013262,2527.781076226536,0.0}
Trams182;18;12;10432;16:47;{7477.508000001311,3581.729000000283,0.0}
Trams183;18;14;10432;16:47;{5634.466500002891,2784.006800001487,0.0}
Trams187;18;5;10432;16:47;{1782.5218000002205,1208.6106000002474,0.0}
Trams142;14;9;10432;16:47;{4672.309900000691,2395.577299999073,0.0}
Trams185;18;2;10433;16:47;{2589.0274000018835,1538.5219000000507,0.0}
Trams149;14;12;10438;16:48;{7477.508000001311,3581.729000000283,0.0}
Trams186;18;2;10440;16:48;{845.340600002557,806.1041999999434,0.0}
Trams188;18;0;10440;16:48;{4722.0763000026345,2426.624300001189,0.0}
Trams181;18;2;10441;16:48;{6221.943900000304,2968.579499999061,0.0}
Trams183;18;13;10444;16:49;{5058.904000002891,2546.714799998328,0.0}
Trams185;18;1;10444;16:49;{2064.0685709043055,1320.5282183098925,0.0}
Trams187;18;4;10450;16:50;{2627.1466000005603,1561.507400000468,0.0}
Trams183;18;12;10452;16:50;{4672.309900000691,2395.577299999073,0.0}
Trams183;18;11;10453;16:50;{4624.179771982149,2375.8925514936154,0.0}
Trams148;14;6;10458;16:51;{7477.508000001311,3581.729000000283,0.0}
Trams143;14;6;10460;16:51;{5010.473492013262,2527.781076226536,0.0}
Trams186;18;3;10462;16:52;{1782.5218000002205,1208.6106000002474,0.0}
Trams141;14;22;10463;16:52;{2808.1955000013113,1135.889900000766,0.0}
Trams183;18;10;10466;16:52;{4031.8555000014603,2128.9623999986798,0.0}
Trams184;18;0;10467;16:52;{2064.0685709043055,1320.5282183098925,0.0}
Trams142;14;11;10468;16:53;{2992.747200001031,1703.0900999996811,0.0}
Trams141;14;18;10470;16:53;{2569.3393000029027,869.8653000015765,0.0}
Trams141;14;11;10471;16:53;{2567.6414284064917,825.1840510346515,0.0}
Trams181;18;5;10472;16:53;{7477.508000001311,3581.729000000283,0.0}
Trams185;18;3;10472;16:53;{845.340600002557,806.1041999999434,0.0}
Trams147;14;5;10473;16:53;{7477.508000001311,3581.729000000283,0.0}
Trams182;18;11;10474;16:54;{5641.738919684285,2786.998382666919,0.0}
Trams148;14;7;10474;16:54;{6831.853600002825,3315.144899999723,0.0}
Trams182;18;12;10475;16:54;{5634.466500002891,2784.006800001487,0.0}
Trams141;14;12;10480;16:55;{2894.896500002593,514.0241999980062,0.0}
Trams149;14;11;10480;16:55;{5641.738919684285,2786.998382666919,0.0}
Trams141;14;5;10481;16:55;{2894.896500002593,514.0241999980062,0.0}
Trams149;14;13;10481;16:55;{5634.466500002891,2784.006800001487,0.0}
Trams142;14;10;10482;16:55;{2774.94460455129,1095.9101807449765,0.0}
Trams182;18;10;10487;16:56;{5058.904000002891,2546.714799998328,0.0}
Trams182;18;8;10488;16:56;{5010.473492013262,2527.781076226536,0.0}
Trams142;14;9;10488;16:56;{2569.3393000029027,869.8653000015765,0.0}
Trams146;14;3;10488;16:56;{7477.508000001311,3581.729000000283,0.0}
Trams142;14;8;10489;16:56;{2567.6414284064917,825.1840510346515,0.0}
Trams149;14;12;10494;16:57;{5010.473492013262,2527.781076226536,0.0}
Trams182;18;5;10495;16:57;{4672.309900000691,2395.577299999073,0.0}
Trams146;14;4;10496;16:57;{7172.43200000003,3532.2607999984175,0.0}
Trams183;18;8;10497;16:57;{2589.0274000018835,1538.5219000000507,0.0}
Trams142;14;9;10498;16:58;{2894.896500002593,514.0241999980062,0.0}
Trams142;14;3;10499;16:58;{2894.896500002593,514.0241999980062,0.0}
Trams148;14;6;10500;16:58;{5641.738919684285,2786.998382666919,0.0}
Trams148;14;5;10501;16:58;{5634.466500002891,2784.006800001487,0.0}
Trams188;18;3;10503;16:58;{7477.508000001311,3581.729000000283,0.0}
Trams143;14;7;10503;16:58;{2992.747200001031,1703.0900999996811,0.0}
Trams145;14;3;10503;16:58;{7477.508000001311,3581.729000000283,0.0}
Trams187;18;3;10504;16:59;{5123.508700001985,2583.745899999514,0.0}
Trams188;18;6;10504;16:59;{7446.12100000307,3545.9720000009984,0.0}
Trams183;18;5;10508;16:59;{2064.0685709043055,1320.5282183098925,0.0}
Trams186;18;4;10511;17:0;{4084.1569000035524,2161.088000001386,0.0}
Trams181;18;4;10514;17:0;{5641.738919684285,2786.998382666919,0.0}
Trams183;18;4;10515;17:0;{1740.6504000015557,1186.7970000002533,0.0}
Trams143;14;5;10516;17:1;{2808.1955000013113,1135.889900000766,0.0}
Trams187;18;2;10517;17:1;{5739.764803540053,2830.2159521656795,0.0}
Trams185;18;4;10521;17:1;{3035.1652000024915,1729.7097000014037,0.0}
Trams143;14;3;10523;17:2;{2569.3393000029027,869.8653000015765,0.0}
Trams144;14;18;10523;17:2;{7477.508000001311,3581.729000000283,0.0}
Trams186;18;2;10525;17:2;{4722.0763000026345,2426.624300001189,0.0}
Trams146;14;3;10530;17:3;{5641.738919684285,2786.998382666919,0.0}
Trams144;14;19;10531;17:3;{7172.43200000003,3532.2607999984175,0.0}
Trams143;14;4;10533;17:3;{2894.896500002593,514.0241999980062,0.0}
Trams143;14;1;10534;17:4;{2894.896500002593,514.0241999980062,0.0}
Trams188;18;5;10535;17:4;{6138.21238208538,2940.1058384544613,0.0}
Trams183;18;6;10536;17:4;{845.340600002557,806.1041999999434,0.0}
Trams141;14;7;10536;17:4;{4084.1569000035524,2161.088000001386,0.0}
Trams182;18;2;10540;17:5;{2589.0274000018835,1538.5219000000507,0.0}
Trams183;18;7;10546;17:6;{1241.924200002104,980.4126999992877,0.0}
Trams188;18;6;10546;17:6;{5634.466500002891,2784.006800001487,0.0}
Trams186;18;1;10547;17:6;{5739.764803540053,2830.2159521656795,0.0}
Trams149;14;11;10550;17:6;{2808.1955000013113,1135.889900000766,0.0}
Trams182;18;1;10551;17:6;{2064.0685709043055,1320.5282183098925,0.0}
Trams143;14;2;10554;17:7;{2839.1857000030577,1180.8036000002176,0.0}
Trams144;14;17;10555;17:7;{6138.21238208538,2940.1058384544613,0.0}
Trams185;18;3;10557;17:7;{4722.0763000026345,2426.624300001189,0.0}
Trams149;14;9;10557;17:7;{2569.3393000029027,869.8653000015765,0.0}
Trams182;18;2;10558;17:8;{1740.6504000015557,1186.7970000002533,0.0}
Trams187;18;20;10558;17:8;{7477.508000001311,3581.729000000283,0.0}
Trams141;14;6;10558;17:8;{5108.905971347362,2577.745680309252,0.0}
Trams185;18;2;10565;17:9;{5108.905971347362,2577.745680309252,0.0}
Trams144;14;15;10565;17:9;{5641.738919684285,2786.998382666919,0.0}
Trams185;18;1;10566;17:9;{5123.508700001985,2583.745899999514,0.0}
Trams187;18;21;10566;17:9;{7172.43200000003,3532.2607999984175,0.0}
Trams188;18;4;10566;17:9;{4672.309900000691,2395.577299999073,0.0}
Trams188;18;3;10567;17:9;{4624.179771982149,2375.8925514936154,0.0}
Trams149;14;4;10568;17:9;{2894.896500002593,514.0241999980062,0.0}
Trams148;14;4;10570;17:10;{2808.1955000013113,1135.889900000766,0.0}
Trams148;14;2;10571;17:10;{2774.94460455129,1095.9101807449765,0.0}
Trams141;14;5;10572;17:10;{5739.764803540053,2830.2159521656795,0.0}
Trams148;14;1;10577;17:11;{2569.3393000029027,869.8653000015765,0.0}
Trams144;14;14;10578;17:11;{5058.904000002891,2546.714799998328,0.0}
Trams148;14;0;10578;17:11;{2567.6414284064917,825.1840510346515,0.0}
Trams182;18;5;10579;17:11;{845.340600002557,806.1041999999434,0.0}
Trams144;14;12;10579;17:11;{5010.473492013262,2527.781076226536,0.0}
Trams149;14;5;10580;17:11;{2597.49450000003,904.9190000016242,0.0}
Trams183;18;8;10585;17:12;{3035.1652000024915,1729.7097000014037,0.0}
Trams147;14;3;10586;17:12;{2774.94460455129,1095.9101807449765,0.0}
Trams186;18;14;10588;17:13;{7477.508000001311,3581.729000000283,0.0}
Trams149;14;6;10588;17:13;{2839.1857000030577,1180.8036000002176,0.0}
Trams143;14;1;10589;17:13;{4084.1569000035524,2161.088000001386,0.0}
Trams181;18;3;10590;17:13;{2110.2352000027895,1344.0613000001758,0.0}
Trams181;18;2;10591;17:13;{2064.0685709043055,1320.5282183098925,0.0}
Trams147;14;4;10592;17:13;{2569.3393000029027,869.8653000015765,0.0}
Trams147;14;3;10593;17:13;{2567.6414284064917,825.1840510346515,0.0}
Trams187;18;20;10600;17:15;{5641.738919684285,2786.998382666919,0.0}
Trams144;14;11;10600;17:15;{4031.8555000014603,2128.9623999986798,0.0}
Trams187;18;19;10601;17:15;{5634.466500002891,2784.006800001487,0.0}
Trams146;14;2;10601;17:15;{2774.94460455129,1095.9101807449765,0.0}
Trams149;14;7;10601;17:15;{3035.1652000024915,1729.7097000014037,0.0}
Trams188;18;2;10602;17:15;{2992.747200001031,1703.0900999996811,0.0}
Trams187;18;16;10613;17:17;{5058.904000002891,2546.714799998328,0.0}
Trams141;14;24;10613;17:17;{7477.508000001311,3581.729000000283,0.0}
Trams187;18;13;10614;17:17;{5010.473492013262,2527.781076226536,0.0}
Trams146;14;1;10618;17:18;{2894.896500002593,514.0241999980062,0.0}
Trams181;18;3;10619;17:18;{845.340600002557,806.1041999999434,0.0}
Trams182;18;3;10620;17:18;{2675.4015184145933,1580.8842637522473,0.0}
Trams183;18;7;10620;17:18;{4707.823850244834,2420.7529164061234,0.0}
Trams185;18;18;10620;17:18;{7477.508000001311,3581.729000000283,0.0}
Trams183;18;5;10621;17:18;{4722.0763000026345,2426.624300001189,0.0}
Trams187;18;8;10621;17:18;{4672.309900000691,2395.577299999073,0.0}
Trams188;18;0;10622;17:18;{2064.0685709043055,1320.5282183098925,0.0}
Trams145;14;1;10622;17:18;{2569.3393000029027,869.8653000015765,0.0}
Trams183;18;4;10630;17:20;{5123.508700001985,2583.745899999514,0.0}
Trams186;18;13;10630;17:20;{5641.738919684285,2786.998382666919,0.0}
Trams142;14;24;10631;17:20;{7477.508000001311,3581.729000000283,0.0}
Trams1411;14;15;10631;17:20;{7477.508000001311,3581.729000000283,0.0}
Trams145;14;0;10633;17:20;{2894.896500002593,514.0241999980062,0.0}
Trams185;18;19;10636;17:21;{6831.853600002825,3315.144899999723,0.0}
Trams144;14;10;10636;17:21;{2774.94460455129,1095.9101807449765,0.0}
Trams149;14;6;10636;17:21;{4707.823850244834,2420.7529164061234,0.0}
Trams1411;14;16;10639;17:21;{7172.43200000003,3532.2607999984175,0.0}
Trams144;14;8;10642;17:22;{2569.3393000029027,869.8653000015765,0.0}
Trams184;18;10;10643;17:22;{7477.508000001311,3581.729000000283,0.0}
Trams186;18;12;10643;17:22;{5058.904000002891,2546.714799998328,0.0}
Trams144;14;6;10643;17:22;{2567.6414284064917,825.1840510346515,0.0}
Trams186;18;9;10644;17:22;{5010.473492013262,2527.781076226536,0.0}
Trams141;14;23;10645;17:22;{6138.21238208538,2940.1058384544613,0.0}
Trams149;14;4;10645;17:22;{5108.905971347362,2577.745680309252,0.0}
Trams1411;14;17;10647;17:22;{6831.853600002825,3315.144899999723,0.0}
Trams186;18;5;10651;17:23;{4672.309900000691,2395.577299999073,0.0}
Trams144;14;2;10653;17:23;{2894.896500002593,514.0241999980062,0.0}
Trams184;18;11;10659;17:24;{6831.853600002825,3315.144899999723,0.0}
Trams181;18;2;10660;17:25;{2675.4015184145933,1580.8842637522473,0.0}
Trams182;18;1;10664;17:25;{4722.0763000026345,2426.624300001189,0.0}
Trams187;18;7;10666;17:26;{2589.0274000018835,1538.5219000000507,0.0}
Trams143;14;23;10666;17:26;{7477.508000001311,3581.729000000283,0.0}
Trams141;14;21;10668;17:26;{5058.904000002891,2546.714799998328,0.0}
Trams142;14;22;10673;17:27;{5641.738919684285,2786.998382666919,0.0}
Trams184;18;10;10675;17:27;{6138.21238208538,2940.1058384544613,0.0}
Trams185;18;18;10675;17:27;{5058.904000002891,2546.714799998328,0.0}
Trams185;18;17;10676;17:27;{5010.473492013262,2527.781076226536,0.0}
Trams187;18;5;10676;17:27;{2110.2352000027895,1344.0613000001758,0.0}
Trams141;14;22;10676;17:27;{4672.309900000691,2395.577299999073,0.0}
Trams187;18;3;10677;17:27;{2064.0685709043055,1320.5282183098925,0.0}
Trams141;14;21;10677;17:27;{4624.179771982149,2375.8925514936154,0.0}
Trams185;18;13;10683;17:28;{4672.309900000691,2395.577299999073,0.0}
Trams183;18;15;10684;17:29;{7477.508000001311,3581.729000000283,0.0}
Trams185;18;10;10684;17:29;{4624.179771982149,2375.8925514936154,0.0}
Trams142;14;23;10686;17:29;{5058.904000002891,2546.714799998328,0.0}
Trams1411;14;16;10687;17:29;{5010.473492013262,2527.781076226536,0.0}
Trams1411;14;14;10694;17:30;{4672.309900000691,2395.577299999073,0.0}
Trams186;18;4;10696;17:31;{2589.0274000018835,1538.5219000000507,0.0}
Trams143;14;24;10697;17:31;{6188.119100000709,2954.7112999986857,0.0}
Trams184;18;9;10698;17:31;{5058.904000002891,2546.714799998328,0.0}
Trams143;14;23;10698;17:31;{6138.21238208538,2940.1058384544613,0.0}
Trams184;18;8;10699;17:31;{5010.473492013262,2527.781076226536,0.0}
Trams183;18;16;10700;17:31;{6831.853600002825,3315.144899999723,0.0}
Trams149;14;24;10700;17:31;{7477.508000001311,3581.729000000283,0.0}
Trams184;18;7;10706;17:32;{4672.309900000691,2395.577299999073,0.0}
Trams186;18;1;10706;17:32;{2110.2352000027895,1344.0613000001758,0.0}
Trams184;18;5;10707;17:32;{4624.179771982149,2375.8925514936154,0.0}
Trams183;18;15;10716;17:34;{6138.21238208538,2940.1058384544613,0.0}
Trams184;18;4;10720;17:35;{4031.8555000014603,2128.9623999986798,0.0}
Trams148;14;13;10720;17:35;{7477.508000001311,3581.729000000283,0.0}
Trams143;14;16;10722;17:35;{5010.473492013262,2527.781076226536,0.0}
Trams141;14;16;10725;17:35;{2808.1955000013113,1135.889900000766,0.0}
Trams181;18;1;10726;17:36;{5739.764803540053,2830.2159521656795,0.0}
Trams141;14;14;10726;17:36;{2774.94460455129,1095.9101807449765,0.0}
Trams182;18;11;10727;17:36;{7477.508000001311,3581.729000000283,0.0}
Trams183;18;13;10727;17:36;{5634.466500002891,2784.006800001487,0.0}
Trams187;18;4;10727;17:36;{1782.5218000002205,1208.6106000002474,0.0}
Trams185;18;5;10728;17:36;{2589.0274000018835,1538.5219000000507,0.0}
Trams143;14;15;10729;17:36;{4672.309900000691,2395.577299999073,0.0}
Trams142;14;22;10730;17:36;{2992.747200001031,1703.0900999996811,0.0}
Trams143;14;14;10730;17:36;{4624.179771982149,2375.8925514936154,0.0}
Trams141;14;10;10732;17:37;{2569.3393000029027,869.8653000015765,0.0}
Trams149;14;23;10732;17:37;{6138.21238208538,2940.1058384544613,0.0}
Trams141;14;8;10733;17:37;{2567.6414284064917,825.1840510346515,0.0}
Trams182;18;12;10735;17:37;{7172.43200000003,3532.2607999984175,0.0}
Trams186;18;2;10735;17:37;{845.340600002557,806.1041999999434,0.0}
Trams147;14;12;10735;17:37;{7477.508000001311,3581.729000000283,0.0}
Trams183;18;11;10739;17:38;{5058.904000002891,2546.714799998328,0.0}
Trams185;18;1;10739;17:38;{2064.0685709043055,1320.5282183098925,0.0}
Trams183;18;10;10740;17:38;{5010.473492013262,2527.781076226536,0.0}
Trams149;14;22;10742;17:38;{5641.738919684285,2786.998382666919,0.0}
Trams141;14;6;10743;17:38;{2894.896500002593,514.0241999980062,0.0}
Trams142;14;19;10743;17:38;{2808.1955000013113,1135.889900000766,0.0}
Trams143;14;13;10743;17:38;{4031.8555000014603,2128.9623999986798,0.0}
Trams149;14;23;10743;17:38;{5634.466500002891,2784.006800001487,0.0}
Trams1411;14;13;10743;17:38;{2808.1955000013113,1135.889900000766,0.0}
Trams142;14;17;10744;17:39;{2774.94460455129,1095.9101807449765,0.0}
Trams1411;14;12;10744;17:39;{2774.94460455129,1095.9101807449765,0.0}
Trams183;18;8;10747;17:39;{4672.309900000691,2395.577299999073,0.0}
Trams142;14;8;10750;17:40;{2569.3393000029027,869.8653000015765,0.0}
Trams146;14;15;10750;17:40;{7477.508000001311,3581.729000000283,0.0}
Trams1411;14;11;10750;17:40;{2569.3393000029027,869.8653000015765,0.0}
Trams184;18;1;10751;17:40;{2589.0274000018835,1538.5219000000507,0.0}
Trams1411;14;7;10751;17:40;{2567.6414284064917,825.1840510346515,0.0}
Trams149;14;21;10756;17:41;{5010.473492013262,2527.781076226536,0.0}
Trams186;18;1;10757;17:41;{1782.5218000002205,1208.6106000002474,0.0}
Trams182;18;10;10759;17:41;{6138.21238208538,2940.1058384544613,0.0}
Trams183;18;7;10761;17:41;{4031.8555000014603,2128.9623999986798,0.0}
Trams142;14;5;10761;17:41;{2894.896500002593,514.0241999980062,0.0}
Trams1411;14;0;10761;17:41;{2894.896500002593,514.0241999980062,0.0}
Trams184;18;0;10762;17:42;{2064.0685709043055,1320.5282183098925,0.0}
Trams148;14;11;10762;17:42;{5641.738919684285,2786.998382666919,0.0}
Trams149;14;20;10764;17:42;{4624.179771982149,2375.8925514936154,0.0}
Trams186;18;2;10765;17:42;{2149.2538000009954,1363.784799998626,0.0}
Trams145;14;6;10765;17:42;{7477.508000001311,3581.729000000283,0.0}
Trams146;14;16;10766;17:42;{6831.853600002825,3315.144899999723,0.0}
Trams181;18;5;10767;17:42;{7477.508000001311,3581.729000000283,0.0}
Trams181;18;6;10768;17:43;{7446.12100000307,3545.9720000009984,0.0}
Trams181;18;7;10775;17:44;{7172.43200000003,3532.2607999984175,0.0}
Trams141;14;7;10776;17:44;{3035.1652000024915,1729.7097000014037,0.0}
Trams143;14;11;10778;17:44;{2808.1955000013113,1135.889900000766,0.0}
Trams143;14;10;10779;17:44;{2774.94460455129,1095.9101807449765,0.0}
Trams182;18;9;10783;17:45;{5010.473492013262,2527.781076226536,0.0}
Trams148;14;10;10783;17:45;{4672.309900000691,2395.577299999073,0.0}
Trams183;18;6;10784;17:45;{2942.963136644313,1688.2069726773154,0.0}
Trams143;14;8;10785;17:45;{2569.3393000029027,869.8653000015765,0.0}
Trams144;14;11;10785;17:45;{7477.508000001311,3581.729000000283,0.0}
Trams143;14;6;10786;17:46;{2567.6414284064917,825.1840510346515,0.0}
Trams144;14;17;10786;17:46;{7446.12100000307,3545.9720000009984,0.0}
Trams147;14;13;10790;17:46;{5058.904000002891,2546.714799998328,0.0}
Trams147;14;12;10791;17:46;{5010.473492013262,2527.781076226536,0.0}
Trams183;18;3;10792;17:47;{2589.0274000018835,1538.5219000000507,0.0}
Trams143;14;7;10795;17:47;{2894.896500002593,514.0241999980062,0.0}
Trams143;14;3;10796;17:47;{2894.896500002593,514.0241999980062,0.0}
Trams185;18;2;10797;17:47;{2149.2538000009954,1363.784799998626,0.0}
Trams187;18;3;10798;17:48;{5108.905971347362,2577.745680309252,0.0}
Trams188;18;5;10798;17:48;{7477.508000001311,3581.729000000283,0.0}
Trams147;14;11;10798;17:48;{4672.309900000691,2395.577299999073,0.0}
Trams181;18;5;10799;17:48;{6138.21238208538,2940.1058384544613,0.0}
Trams149;14;21;10799;17:48;{2992.747200001031,1703.0900999996811,0.0}
Trams183;18;2;10802;17:48;{2110.2352000027895,1344.0613000001758,0.0}
Trams146;14;15;10806;17:49;{5010.473492013262,2527.781076226536,0.0}
Trams147;14;12;10812;17:50;{4031.8555000014603,2128.9623999986798,0.0}
Trams149;14;15;10812;17:50;{2808.1955000013113,1135.889900000766,0.0}
Trams146;14;13;10813;17:50;{4672.309900000691,2395.577299999073,0.0}
Trams185;18;4;10816;17:51;{3035.1652000024915,1729.7097000014037,0.0}
Trams143;14;4;10816;17:51;{2839.1857000030577,1180.8036000002176,0.0}
Trams144;14;16;10817;17:51;{6138.21238208538,2940.1058384544613,0.0}
Trams149;14;12;10820;17:51;{2567.6414284064917,825.1840510346515,0.0}
Trams141;14;6;10821;17:51;{5123.508700001985,2583.745899999514,0.0}
Trams146;14;12;10827;17:52;{4031.8555000014603,2128.9623999986798,0.0}
Trams144;14;14;10828;17:53;{5634.466500002891,2784.006800001487,0.0}
Trams145;14;5;10828;17:53;{4672.309900000691,2395.577299999073,0.0}
Trams186;18;1;10829;17:53;{5123.508700001985,2583.745899999514,0.0}
Trams145;14;4;10829;17:53;{4624.179771982149,2375.8925514936154,0.0}
Trams149;14;6;10830;17:53;{2894.896500002593,514.0241999980062,0.0}
Trams183;18;3;10831;17:53;{845.340600002557,806.1041999999434,0.0}
Trams148;14;8;10832;17:53;{2808.1955000013113,1135.889900000766,0.0}
Trams148;14;7;10833;17:53;{2774.94460455129,1095.9101807449765,0.0}
Trams182;18;8;10835;17:54;{2589.0274000018835,1538.5219000000507,0.0}
Trams185;18;3;10838;17:54;{4084.1569000035524,2161.088000001386,0.0}
Trams148;14;6;10839;17:54;{2569.3393000029027,869.8653000015765,0.0}
Trams188;18;3;10840;17:55;{5641.738919684285,2786.998382666919,0.0}
Trams148;14;4;10840;17:55;{2567.6414284064917,825.1840510346515,0.0}
Trams144;14;11;10841;17:55;{5010.473492013262,2527.781076226536,0.0}
Trams182;18;7;10845;17:55;{2110.2352000027895,1344.0613000001758,0.0}
Trams182;18;3;10846;17:56;{2064.0685709043055,1320.5282183098925,0.0}
Trams147;14;11;10847;17:56;{2808.1955000013113,1135.889900000766,0.0}
Trams144;14;9;10848;17:56;{4672.309900000691,2395.577299999073,0.0}
Trams147;14;10;10848;17:56;{2774.94460455129,1095.9101807449765,0.0}
Trams148;14;0;10850;17:56;{2894.896500002593,514.0241999980062,0.0}
Trams143;14;5;10851;17:56;{4084.1569000035524,2161.088000001386,0.0}
Trams185;18;2;10852;17:57;{4722.0763000026345,2426.624300001189,0.0}
Trams182;18;2;10853;17:57;{1740.6504000015557,1186.7970000002533,0.0}
Trams187;18;24;10853;17:57;{7477.508000001311,3581.729000000283,0.0}
Trams188;18;2;10854;17:57;{5010.473492013262,2527.781076226536,0.0}
Trams147;14;9;10854;17:57;{2569.3393000029027,869.8653000015765,0.0}
Trams147;14;6;10855;17:57;{2567.6414284064917,825.1840510346515,0.0}
Trams188;18;1;10861;17:58;{4672.309900000691,2395.577299999073,0.0}
Trams183;18;2;10862;17:58;{2197.307743831217,1383.6548398164498,0.0}
Trams148;14;1;10862;17:58;{2597.49450000003,904.9190000016242,0.0}
Trams182;18;1;10864;17:59;{1213.7785956119094,964.194963392883,0.0}
Trams143;14;4;10865;17:59;{4722.0763000026345,2426.624300001189,0.0}
Trams147;14;4;10865;17:59;{2894.896500002593,514.0241999980062,0.0}
Trams146;14;9;10869;17:59;{2569.3393000029027,869.8653000015765,0.0}
Trams146;14;8;10870;18:0;{2567.6414284064917,825.1840510346515,0.0}
Trams185;18;1;10874;18:0;{5739.764803540053,2830.2159521656795,0.0}
Trams181;18;4;10875;18:0;{2589.0274000018835,1538.5219000000507,0.0}
Trams141;14;24;10875;18:0;{7477.508000001311,3581.729000000283,0.0}
Trams146;14;2;10880;18:1;{2894.896500002593,514.0241999980062,0.0}
Trams186;18;12;10883;18:2;{7477.508000001311,3581.729000000283,0.0}
Trams181;18;3;10885;18:2;{2110.2352000027895,1344.0613000001758,0.0}
Trams187;18;22;10885;18:2;{6138.21238208538,2940.1058384544613,0.0}
Trams145;14;1;10885;18:2;{2567.6414284064917,825.1840510346515,0.0}
Trams181;18;2;10886;18:2;{2064.0685709043055,1320.5282183098925,0.0}
Trams143;14;3;10887;18:2;{5739.764803540053,2830.2159521656795,0.0}
Trams186;18;13;10891;18:3;{7172.43200000003,3532.2607999984175,0.0}
Trams181;18;1;10893;18:3;{1740.6504000015557,1186.7970000002533,0.0}
Trams142;14;23;10893;18:3;{7477.508000001311,3581.729000000283,0.0}
Trams142;14;24;10894;18:4;{7446.12100000307,3545.9720000009984,0.0}
Trams145;14;2;10894;18:4;{2894.896500002593,514.0241999980062,0.0}
Trams1411;14;4;10894;18:4;{7446.12100000307,3545.9720000009984,0.0}
Trams187;18;21;10895;18:4;{5641.738919684285,2786.998382666919,0.0}
Trams145;14;1;10895;18:4;{2894.896500002593,514.0241999980062,0.0}
Trams182;18;2;10896;18:4;{1782.5218000002205,1208.6106000002474,0.0}
Trams187;18;19;10896;18:4;{5634.466500002891,2784.006800001487,0.0}
Trams188;18;2;10897;18:4;{2992.747200001031,1703.0900999996811,0.0}
Trams144;14;8;10897;18:4;{2808.1955000013113,1135.889900000766,0.0}
Trams144;14;5;10898;18:4;{2774.94460455129,1095.9101807449765,0.0}
Trams1411;14;5;10901;18:5;{7172.43200000003,3532.2607999984175,0.0}
Trams183;18;3;10902;18:5;{4084.1569000035524,2161.088000001386,0.0}
Trams144;14;3;10905;18:5;{2567.6414284064917,825.1840510346515,0.0}
Trams187;18;17;10909;18:6;{5010.473492013262,2527.781076226536,0.0}
Trams181;18;2;10914;18:7;{845.340600002557,806.1041999999434,0.0}
Trams186;18;14;10914;18:7;{6188.119100000709,2954.7112999986857,0.0}
Trams185;18;8;10915;18:7;{7477.508000001311,3581.729000000283,0.0}
Trams144;14;1;10915;18:7;{2894.896500002593,514.0241999980062,0.0}
Trams187;18;14;10916;18:7;{4672.309900000691,2395.577299999073,0.0}
Trams187;18;12;10917;18:7;{4624.179771982149,2375.8925514936154,0.0}
Trams141;14;23;10917;18:7;{5641.738919684285,2786.998382666919,0.0}
Trams188;18;0;10924;18:9;{1740.6504000015557,1186.7970000002533,0.0}
Trams186;18;13;10925;18:9;{5641.738919684285,2786.998382666919,0.0}
Trams186;18;12;10926;18:9;{5634.466500002891,2784.006800001487,0.0}
Trams143;14;12;10928;18:9;{7477.508000001311,3581.729000000283,0.0}
Trams145;14;2;10928;18:9;{3035.1652000024915,1729.7097000014037,0.0}
Trams141;14;22;10930;18:10;{5058.904000002891,2546.714799998328,0.0}
Trams184;18;2;10938;18:11;{7477.508000001311,3581.729000000283,0.0}
Trams141;14;23;10938;18:11;{4672.309900000691,2395.577299999073,0.0}
Trams186;18;10;10939;18:11;{5010.473492013262,2527.781076226536,0.0}
Trams186;18;7;10946;18:12;{4672.309900000691,2395.577299999073,0.0}
Trams186;18;4;10947;18:12;{4624.179771982149,2375.8925514936154,0.0}
Trams183;18;2;10948;18:13;{6221.943900000304,2968.579499999061,0.0}
Trams142;14;23;10948;18:13;{5058.904000002891,2546.714799998328,0.0}
Trams1411;14;4;10948;18:13;{5058.904000002891,2546.714799998328,0.0}
Trams142;14;22;10949;18:13;{5010.473492013262,2527.781076226536,0.0}
Trams148;14;0;10951;18:13;{6221.943900000304,2968.579499999061,0.0}
Trams141;14;24;10952;18:13;{4031.8555000014603,2128.9623999986798,0.0}
Trams181;18;1;10954;18:14;{2627.1466000005603,1561.507400000468,0.0}
Trams1411;14;3;10956;18:14;{4672.309900000691,2395.577299999073,0.0}
Trams185;18;6;10957;18:14;{5641.738919684285,2786.998382666919,0.0}
Trams187;18;8;10961;18:15;{2589.0274000018835,1538.5219000000507,0.0}
Trams149;14;20;10962;18:15;{7477.508000001311,3581.729000000283,0.0}
Trams185;18;5;10970;18:16;{5058.904000002891,2546.714799998328,0.0}
Trams142;14;24;10970;18:16;{4031.8555000014603,2128.9623999986798,0.0}
Trams144;14;2;10970;18:16;{4084.1569000035524,2161.088000001386,0.0}
Trams149;14;21;10970;18:16;{7172.43200000003,3532.2607999984175,0.0}
Trams1411;14;4;10970;18:16;{4031.8555000014603,2128.9623999986798,0.0}
Trams187;18;5;10971;18:16;{2110.2352000027895,1344.0613000001758,0.0}
Trams145;14;1;10972;18:17;{5108.905971347362,2577.745680309252,0.0}
Trams188;18;1;10975;18:17;{2149.2538000009954,1363.784799998626,0.0}
Trams185;18;3;10978;18:18;{4672.309900000691,2395.577299999073,0.0}
Trams149;14;22;10978;18:18;{6831.853600002825,3315.144899999723,0.0}
Trams183;18;7;10979;18:18;{7477.508000001311,3581.729000000283,0.0}
Trams187;18;4;10979;18:18;{1740.6504000015557,1186.7970000002533,0.0}
Trams182;18;1;10980;18:18;{5689.812200002372,2815.7713999990374,0.0}
Trams148;14;2;10982;18:18;{7477.508000001311,3581.729000000283,0.0}
Trams141;14;18;10987;18:19;{2808.1955000013113,1135.889900000766,0.0}
Trams141;14;14;10988;18:19;{2774.94460455129,1095.9101807449765,0.0}
Trams143;14;11;10992;18:20;{4624.179771982149,2375.8925514936154,0.0}
Trams1411;14;5;10992;18:20;{2992.747200001031,1703.0900999996811,0.0}
Trams149;14;24;10993;18:20;{6188.119100000709,2954.7112999986857,0.0}
Trams184;18;1;10994;18:20;{5010.473492013262,2527.781076226536,0.0}
Trams141;14;7;10994;18:20;{2569.3393000029027,869.8653000015765,0.0}
Trams147;14;10;10997;18:21;{7477.508000001311,3581.729000000283,0.0}
Trams187;18;6;11000;18:21;{845.340600002557,806.1041999999434,0.0}
Trams184;18;0;11001;18:21;{4672.309900000691,2395.577299999073,0.0}
Trams186;18;3;11001;18:21;{2110.2352000027895,1344.0613000001758,0.0}
Trams186;18;2;11002;18:22;{2064.0685709043055,1320.5282183098925,0.0}
Trams141;14;8;11004;18:22;{2894.896500002593,514.0241999980062,0.0}
Trams149;14;23;11004;18:22;{5641.738919684285,2786.998382666919,0.0}
Trams141;14;6;11005;18:22;{2894.896500002593,514.0241999980062,0.0}
Trams143;14;12;11005;18:22;{4031.8555000014603,2128.9623999986798,0.0}
Trams1411;14;4;11005;18:22;{2808.1955000013113,1135.889900000766,0.0}
Trams142;14;23;11006;18:22;{2774.94460455129,1095.9101807449765,0.0}
Trams1411;14;3;11006;18:22;{2774.94460455129,1095.9101807449765,0.0}
Trams186;18;1;11009;18:23;{1740.6504000015557,1186.7970000002533,0.0}
Trams142;14;20;11012;18:23;{2569.3393000029027,869.8653000015765,0.0}
Trams146;14;5;11012;18:23;{7477.508000001311,3581.729000000283,0.0}
Trams1411;14;2;11012;18:23;{2569.3393000029027,869.8653000015765,0.0}
Trams142;14;17;11013;18:23;{2567.6414284064917,825.1840510346515,0.0}
Trams148;14;3;11013;18:23;{6188.119100000709,2954.7112999986857,0.0}
Trams144;14;1;11016;18:24;{6221.943900000304,2968.579499999061,0.0}
Trams149;14;21;11017;18:24;{5058.904000002891,2546.714799998328,0.0}
Trams182;18;8;11022;18:25;{7477.508000001311,3581.729000000283,0.0}
Trams185;18;2;11023;18:25;{2589.0274000018835,1538.5219000000507,0.0}
Trams142;14;6;11023;18:25;{2894.896500002593,514.0241999980062,0.0}
Trams1411;14;0;11023;18:25;{2894.896500002593,514.0241999980062,0.0}
Trams141;14;7;11025;18:25;{2839.1857000030577,1180.8036000002176,0.0}
Trams149;14;19;11025;18:25;{4672.309900000691,2395.577299999073,0.0}
Trams145;14;5;11027;18:26;{7477.508000001311,3581.729000000283,0.0}
Trams187;18;5;11031;18:26;{2197.307743831217,1383.6548398164498,0.0}
Trams183;18;6;11035;18:27;{5010.473492013262,2527.781076226536,0.0}
Trams188;18;0;11038;18:28;{5108.905971347362,2577.745680309252,0.0}
Trams143;14;11;11040;18:28;{2808.1955000013113,1135.889900000766,0.0}
Trams185;18;1;11041;18:28;{1740.6504000015557,1186.7970000002533,0.0}
Trams143;14;10;11041;18:28;{2774.94460455129,1095.9101807449765,0.0}
Trams183;18;5;11042;18:28;{4672.309900000691,2395.577299999073,0.0}
Trams182;18;9;11045;18:29;{6563.806600000709,3123.2601999994367,0.0}
Trams143;14;8;11047;18:29;{2569.3393000029027,869.8653000015765,0.0}
Trams144;14;5;11047;18:29;{7477.508000001311,3581.729000000283,0.0}
Trams143;14;7;11048;18:29;{2567.6414284064917,825.1840510346515,0.0}
Trams147;14;8;11052;18:30;{5058.904000002891,2546.714799998328,0.0}
Trams143;14;8;11057;18:31;{2894.896500002593,514.0241999980062,0.0}
Trams143;14;4;11058;18:31;{2894.896500002593,514.0241999980062,0.0}
Trams186;18;2;11060;18:31;{2149.2538000009954,1363.784799998626,0.0}
Trams147;14;7;11061;18:31;{4624.179771982149,2375.8925514936154,0.0}
Trams181;18;6;11062;18:32;{7477.508000001311,3581.729000000283,0.0}
Trams185;18;2;11062;18:32;{845.340600002557,806.1041999999434,0.0}
Trams181;18;7;11070;18:33;{7172.43200000003,3532.2607999984175,0.0}
Trams144;14;6;11070;18:33;{6563.806600000709,3123.2601999994367,0.0}
Trams185;18;3;11072;18:33;{1241.924200002104,980.4126999992877,0.0}
Trams141;14;6;11074;18:34;{4722.0763000026345,2426.624300001189,0.0}
Trams149;14;17;11074;18:34;{2808.1955000013113,1135.889900000766,0.0}
Trams149;14;16;11075;18:34;{2774.94460455129,1095.9101807449765,0.0}
Trams182;18;7;11077;18:34;{5058.904000002891,2546.714799998328,0.0}
Trams182;18;6;11078;18:34;{5010.473492013262,2527.781076226536,0.0}
Trams149;14;13;11081;18:35;{2569.3393000029027,869.8653000015765,0.0}
Trams149;14;12;11082;18:35;{2567.6414284064917,825.1840510346515,0.0}
Trams187;18;4;11085;18:35;{4722.0763000026345,2426.624300001189,0.0}
Trams183;18;3;11087;18:36;{2589.0274000018835,1538.5219000000507,0.0}
Trams144;14;5;11089;18:36;{5641.738919684285,2786.998382666919,0.0}
Trams146;14;4;11089;18:36;{4031.8555000014603,2128.9623999986798,0.0}
Trams145;14;4;11090;18:36;{4672.309900000691,2395.577299999073,0.0}
Trams149;14;6;11092;18:37;{2894.896500002593,514.0241999980062,0.0}
Trams188;18;5;11093;18:37;{7477.508000001311,3581.729000000283,0.0}
Trams183;18;2;11097;18:37;{2110.2352000027895,1344.0613000001758,0.0}
Trams182;18;7;11099;18:38;{4031.8555000014603,2128.9623999986798,0.0}
Trams186;18;3;11101;18:38;{4084.1569000035524,2161.088000001386,0.0}
Trams188;18;6;11101;18:38;{7172.43200000003,3532.2607999984175,0.0}
Trams148;14;2;11101;18:38;{2569.3393000029027,869.8653000015765,0.0}
Trams185;18;2;11102;18:38;{2627.1466000005603,1561.507400000468,0.0}
Trams184;18;1;11107;18:39;{1782.5218000002205,1208.6106000002474,0.0}
Trams147;14;6;11109;18:39;{2808.1955000013113,1135.889900000766,0.0}
Trams147;14;5;11110;18:40;{2774.94460455129,1095.9101807449765,0.0}
Trams146;14;5;11111;18:40;{2992.747200001031,1703.0900999996811,0.0}
Trams148;14;3;11111;18:40;{2894.896500002593,514.0241999980062,0.0}
Trams148;14;1;11112;18:40;{2894.896500002593,514.0241999980062,0.0}
Trams147;14;4;11116;18:41;{2569.3393000029027,869.8653000015765,0.0}
Trams181;18;6;11118;18:41;{5010.473492013262,2527.781076226536,0.0}
Trams181;18;5;11125;18:42;{4672.309900000691,2395.577299999073,0.0}
Trams149;14;8;11125;18:42;{3035.1652000024915,1729.7097000014037,0.0}
Trams182;18;6;11130;18:43;{2589.0274000018835,1538.5219000000507,0.0}
Trams146;14;3;11131;18:43;{2569.3393000029027,869.8653000015765,0.0}
Trams185;18;3;11133;18:43;{4084.1569000035524,2161.088000001386,0.0}
Trams188;18;5;11135;18:44;{5641.738919684285,2786.998382666919,0.0}
Trams183;18;4;11136;18:44;{1241.924200002104,980.4126999992877,0.0}
Trams186;18;2;11137;18:44;{5739.764803540053,2830.2159521656795,0.0}
Trams141;14;24;11137;18:44;{7477.508000001311,3581.729000000283,0.0}
Trams145;14;3;11139;18:44;{2808.1955000013113,1135.889900000766,0.0}
Trams182;18;3;11140;18:45;{2110.2352000027895,1344.0613000001758,0.0}
Trams146;14;2;11142;18:45;{2894.896500002593,514.0241999980062,0.0}
Trams185;18;2;11147;18:46;{4722.0763000026345,2426.624300001189,0.0}
Trams145;14;2;11147;18:46;{2567.6414284064917,825.1840510346515,0.0}
Trams182;18;1;11148;18:46;{1740.6504000015557,1186.7970000002533,0.0}
Trams187;18;13;11148;18:46;{7477.508000001311,3581.729000000283,0.0}
Trams188;18;3;11148;18:46;{5058.904000002891,2546.714799998328,0.0}
Trams142;14;13;11155;18:47;{7477.508000001311,3581.729000000283,0.0}
Trams183;18;5;11156;18:47;{2149.2538000009954,1363.784799998626,0.0}
Trams188;18;2;11156;18:47;{4672.309900000691,2395.577299999073,0.0}
Trams188;18;1;11157;18:47;{4624.179771982149,2375.8925514936154,0.0}
Trams145;14;1;11157;18:47;{2894.896500002593,514.0241999980062,0.0}
Trams144;14;3;11159;18:48;{2808.1955000013113,1135.889900000766,0.0}
Trams144;14;1;11167;18:49;{2567.6414284064917,825.1840510346515,0.0}
Trams185;18;1;11168;18:49;{5689.812200002372,2815.7713999990374,0.0}
Trams182;18;3;11169;18:49;{845.340600002557,806.1041999999434,0.0}
Trams188;18;2;11170;18:50;{4031.8555000014603,2128.9623999986798,0.0}
Trams144;14;0;11177;18:51;{2894.896500002593,514.0241999980062,0.0}
Trams184;18;0;11178;18:51;{5108.905971347362,2577.745680309252,0.0}
Trams186;18;12;11178;18:51;{7477.508000001311,3581.729000000283,0.0}
Trams142;14;15;11178;18:51;{6563.806600000709,3123.2601999994367,0.0}
Trams141;14;23;11179;18:51;{5641.738919684285,2786.998382666919,0.0}
Trams181;18;3;11180;18:51;{2110.2352000027895,1344.0613000001758,0.0}
Trams181;18;2;11181;18:51;{2064.0685709043055,1320.5282183098925,0.0}
Trams142;14;16;11186;18:52;{6188.119100000709,2954.7112999986857,0.0}
Trams181;18;1;11188;18:53;{1740.6504000015557,1186.7970000002533,0.0}
Trams143;14;14;11190;18:53;{7477.508000001311,3581.729000000283,0.0}
Trams141;14;22;11192;18:53;{5058.904000002891,2546.714799998328,0.0}
Trams149;14;6;11193;18:53;{6221.943900000304,2968.579499999061,0.0}
Trams142;14;15;11197;18:54;{5641.738919684285,2786.998382666919,0.0}
Trams182;18;5;11199;18:54;{2149.2538000009954,1363.784799998626,0.0}
Trams141;14;20;11200;18:55;{4672.309900000691,2395.577299999073,0.0}
Trams181;18;2;11209;18:56;{845.340600002557,806.1041999999434,0.0}
Trams183;18;4;11210;18:56;{4707.823850244834,2420.7529164061234,0.0}
Trams185;18;7;11210;18:56;{7477.508000001311,3581.729000000283,0.0}
Trams187;18;11;11211;18:56;{4672.309900000691,2395.577299999073,0.0}
Trams188;18;1;11211;18:56;{2110.2352000027895,1344.0613000001758,0.0}
Trams187;18;10;11212;18:57;{4624.179771982149,2375.8925514936154,0.0}
Trams188;18;0;11212;18:57;{2064.0685709043055,1320.5282183098925,0.0}
Trams145;14;2;11212;18:57;{4084.1569000035524,2161.088000001386,0.0}
Trams183;18;3;11220;18:58;{5123.508700001985,2583.745899999514,0.0}
Trams186;18;11;11220;18:58;{5641.738919684285,2786.998382666919,0.0}
Trams186;18;10;11221;18:58;{5634.466500002891,2784.006800001487,0.0}
Trams143;14;13;11222;18:58;{6138.21238208538,2940.1058384544613,0.0}
Trams149;14;17;11224;18:59;{7477.508000001311,3581.729000000283,0.0}
Trams145;14;1;11225;18:59;{4707.823850244834,2420.7529164061234,0.0}
Trams143;14;12;11232;19:0;{5641.738919684285,2786.998382666919,0.0}
Trams184;18;1;11233;19:0;{7477.508000001311,3581.729000000283,0.0}
Trams186;18;9;11233;19:0;{5058.904000002891,2546.714799998328,0.0}
Trams186;18;8;11234;19:0;{5010.473492013262,2527.781076226536,0.0}
Trams141;14;19;11236;19:1;{2992.747200001031,1703.0900999996811,0.0}
Trams186;18;7;11241;19:1;{4672.309900000691,2395.577299999073,0.0}
Trams186;18;6;11242;19:2;{4624.179771982149,2375.8925514936154,0.0}
Trams183;18;2;11243;19:2;{6221.943900000304,2968.579499999061,0.0}
Trams141;14;17;11249;19:3;{2808.1955000013113,1135.889900000766,0.0}
Trams141;14;11;11250;19:3;{2774.94460455129,1095.9101807449765,0.0}
Trams185;18;6;11252;19:3;{5641.738919684285,2786.998382666919,0.0}
Trams182;18;4;11254;19:4;{4722.0763000026345,2426.624300001189,0.0}
Trams143;14;11;11254;19:4;{4624.179771982149,2375.8925514936154,0.0}
Trams187;18;9;11256;19:4;{2589.0274000018835,1538.5219000000507,0.0}
Trams141;14;10;11256;19:4;{2569.3393000029027,869.8653000015765,0.0}
Trams141;14;8;11257;19:4;{2567.6414284064917,825.1840510346515,0.0}
Trams182;18;2;11262;19:5;{5108.905971347362,2577.745680309252,0.0}
Trams185;18;5;11266;19:6;{5010.473492013262,2527.781076226536,0.0}
Trams187;18;7;11266;19:6;{2110.2352000027895,1344.0613000001758,0.0}
Trams187;18;6;11267;19:6;{2064.0685709043055,1320.5282183098925,0.0}
Trams141;14;5;11267;19:6;{2894.896500002593,514.0241999980062,0.0}
Trams185;18;4;11273;19:7;{4672.309900000691,2395.577299999073,0.0}
Trams187;18;4;11274;19:7;{1740.6504000015557,1186.7970000002533,0.0}
Trams142;14;14;11275;19:7;{2567.6414284064917,825.1840510346515,0.0}
Trams182;18;1;11276;19:7;{5739.764803540053,2830.2159521656795,0.0}
Trams149;14;16;11279;19:8;{5058.904000002891,2546.714799998328,0.0}
Trams149;14;15;11280;19:8;{5010.473492013262,2527.781076226536,0.0}
Trams142;14;7;11285;19:9;{2894.896500002593,514.0241999980062,0.0}
Trams185;18;3;11286;19:9;{4048.297289360261,2135.7927898531034,0.0}
Trams186;18;4;11286;19:9;{2589.0274000018835,1538.5219000000507,0.0}
Trams185;18;2;11287;19:9;{4031.8555000014603,2128.9623999986798,0.0}
Trams141;14;6;11287;19:9;{2839.1857000030577,1180.8036000002176,0.0}
Trams149;14;14;11288;19:9;{4624.179771982149,2375.8925514936154,0.0}
Trams186;18;3;11296;19:11;{2110.2352000027895,1344.0613000001758,0.0}
Trams186;18;2;11297;19:11;{2064.0685709043055,1320.5282183098925,0.0}
Trams143;14;10;11303;19:12;{2774.94460455129,1095.9101807449765,0.0}
Trams143;14;8;11310;19:13;{2567.6414284064917,825.1840510346515,0.0}
Trams181;18;1;11316;19:14;{5739.764803540053,2830.2159521656795,0.0}
Trams185;18;1;11318;19:14;{2589.0274000018835,1538.5219000000507,0.0}
Trams143;14;9;11319;19:14;{2894.896500002593,514.0241999980062,0.0}
Trams143;14;5;11320;19:15;{2894.896500002593,514.0241999980062,0.0}
Trams185;18;2;11328;19:16;{2110.2352000027895,1344.0613000001758,0.0}
Trams183;18;3;11337;19:17;{4672.309900000691,2395.577299999073,0.0}
Trams184;18;0;11341;19:18;{2589.0274000018835,1538.5219000000507,0.0}
Trams149;14;11;11343;19:18;{2569.3393000029027,869.8653000015765,0.0}
Trams141;14;5;11344;19:19;{5108.905971347362,2577.745680309252,0.0}
Trams149;14;10;11344;19:19;{2567.6414284064917,825.1840510346515,0.0}
Trams183;18;2;11351;19:20;{4031.8555000014603,2128.9623999986798,0.0}
Trams149;14;6;11354;19:20;{2894.896500002593,514.0241999980062,0.0}
