tramName;tramLine;nPassengers;cycleNo;time;location
Trams146;14;5;38634;6:2;{2808.1955000013113,1135.889900000766,0.0}
Trams148;14;9;38634;6:2;{2597.49450000003,904.9190000016242,0.0}
Trams148;14;12;38642;6:3;{2839.1857000030577,1180.8036000002176,0.0}
Trams147;14;3;38649;6:4;{2597.49450000003,904.9190000016242,0.0}
Trams146;14;6;38652;6:5;{2894.896500002593,514.0241999980062,0.0}
Trams147;14;6;38657;6:5;{2839.1857000030577,1180.8036000002176,0.0}
Trams146;14;7;38664;6:7;{2597.49450000003,904.9190000016242,0.0}
Trams181;18;6;38666;6:7;{1782.5218000002205,1208.6106000002474,0.0}
Trams149;14;9;38671;6:8;{4722.0763000026345,2426.624300001189,0.0}
Trams146;14;8;38672;6:8;{2839.1857000030577,1180.8036000002176,0.0}
Trams181;18;10;38674;6:8;{2149.2538000009954,1363.784799998626,0.0}
Trams145;14;8;38679;6:9;{2597.49450000003,904.9190000016242,0.0}
Trams183;18;8;38680;6:9;{4031.8555000014603,2128.9623999986798,0.0}
Trams149;14;12;38680;6:9;{5123.508700001985,2583.745899999514,0.0}
Trams181;18;11;38684;6:10;{2627.1466000005603,1561.507400000468,0.0}
Trams144;14;6;38687;6:10;{2894.896500002593,514.0241999980062,0.0}
Trams148;14;14;38691;6:11;{4722.0763000026345,2426.624300001189,0.0}
Trams149;14;14;38692;6:11;{5689.812200002372,2815.7713999990374,0.0}
Trams181;18;10;38693;6:11;{3035.1652000024915,1729.7097000014037,0.0}
Trams144;14;7;38699;6:12;{2597.49450000003,904.9190000016242,0.0}
Trams148;14;16;38700;6:13;{5123.508700001985,2583.745899999514,0.0}
Trams183;18;7;38702;6:13;{2992.747200001031,1703.0900999996811,0.0}
Trams141;14;10;38702;6:13;{5058.904000002891,2546.714799998328,0.0}
Trams147;14;8;38706;6:14;{4722.0763000026345,2426.624300001189,0.0}
Trams144;14;11;38707;6:14;{2839.1857000030577,1180.8036000002176,0.0}
Trams183;18;9;38711;6:14;{2589.0274000018835,1538.5219000000507,0.0}
Trams146;14;9;38721;6:16;{4722.0763000026345,2426.624300001189,0.0}
Trams141;14;9;38723;6:16;{4048.297289360261,2135.7927898531034,0.0}
Trams147;14;10;38727;6:17;{5689.812200002372,2815.7713999990374,0.0}
Trams181;18;9;38728;6:17;{4707.823850244834,2420.7529164061234,0.0}
Trams182;18;6;38731;6:18;{5634.466500002891,2784.006800001487,0.0}
Trams149;14;4;38733;6:18;{7477.508000001311,3581.729000000283,0.0}
Trams145;14;9;38736;6:19;{4722.0763000026345,2426.624300001189,0.0}
Trams181;18;10;38738;6:19;{5123.508700001985,2583.745899999514,0.0}
Trams144;14;10;38742;6:20;{4084.1569000035524,2161.088000001386,0.0}
Trams146;14;11;38742;6:20;{5689.812200002372,2815.7713999990374,0.0}
Trams182;18;8;38743;6:20;{5058.904000002891,2546.714799998328,0.0}
Trams183;18;7;38750;6:21;{845.340600002557,806.1041999999434,0.0}
Trams148;14;7;38753;6:21;{7477.508000001311,3581.729000000283,0.0}
Trams148;14;6;38754;6:22;{7477.508000001311,3581.729000000283,0.0}
Trams144;14;9;38755;6:22;{4707.823850244834,2420.7529164061234,0.0}
Trams144;14;13;38765;6:23;{5123.508700001985,2583.745899999514,0.0}
Trams147;14;3;38768;6:24;{7477.508000001311,3581.729000000283,0.0}
Trams147;14;2;38769;6:24;{7477.508000001311,3581.729000000283,0.0}
Trams183;18;13;38772;6:25;{1782.5218000002205,1208.6106000002474,0.0}
Trams141;14;17;38777;6:25;{2894.896500002593,514.0241999980062,0.0}
Trams144;14;14;38777;6:25;{5689.812200002372,2815.7713999990374,0.0}
Trams183;18;19;38780;6:26;{2149.2538000009954,1363.784799998626,0.0}
Trams145;14;8;38783;6:26;{6864.837443928478,3341.6995773341046,0.0}
Trams146;14;4;38783;6:26;{7477.508000001311,3581.729000000283,0.0}
Trams141;14;24;38789;6:27;{2597.49450000003,904.9190000016242,0.0}
Trams183;18;20;38790;6:28;{2627.1466000005603,1561.507400000468,0.0}
Trams181;18;5;38791;6:28;{7477.508000001311,3581.729000000283,0.0}
Trams181;18;4;38792;6:28;{7477.508000001311,3581.729000000283,0.0}
Trams182;18;10;38796;6:29;{2589.0274000018835,1538.5219000000507,0.0}
Trams145;14;5;38798;6:29;{7477.508000001311,3581.729000000283,0.0}
Trams144;14;13;38803;6:30;{6864.837443928478,3341.6995773341046,0.0}
Trams142;14;6;38807;6:30;{2597.49450000003,904.9190000016242,0.0}
Trams141;14;23;38811;6:31;{3084.0353342962862,1747.4296273253601,0.0}
Trams144;14;12;38812;6:31;{7223.311400000006,3570.043500000611,0.0}
Trams182;18;9;38814;6:32;{1740.6504000015557,1186.7970000002533,0.0}
Trams182;18;8;38815;6:32;{1692.722305299079,1166.6255241828771,0.0}
Trams142;14;13;38815;6:32;{2839.1857000030577,1180.8036000002176,0.0}
Trams148;14;7;38817;6:32;{4672.309900000691,2395.577299999073,0.0}
Trams144;14;5;38818;6:32;{7477.508000001311,3581.729000000283,0.0}
Trams183;18;21;38821;6:33;{4084.1569000035524,2161.088000001386,0.0}
Trams143;14;7;38830;6:34;{2894.896500002593,514.0241999980062,0.0}
Trams148;14;6;38831;6:34;{4031.8555000014603,2128.9623999986798,0.0}
Trams182;18;7;38833;6:35;{874.5067790792331,818.4381949221134,0.0}
Trams181;18;7;38835;6:35;{5634.466500002891,2784.006800001487,0.0}
Trams182;18;3;38835;6:35;{845.340600002557,806.1041999999434,0.0}
Trams183;18;23;38835;6:35;{4722.0763000026345,2426.624300001189,0.0}
Trams146;14;5;38839;6:36;{5058.904000002891,2546.714799998328,0.0}
Trams143;14;10;38842;6:36;{2597.49450000003,904.9190000016242,0.0}
Trams183;18;24;38844;6:37;{5123.508700001985,2583.745899999514,0.0}
Trams141;14;24;38846;6:37;{4722.0763000026345,2426.624300001189,0.0}
Trams181;18;9;38847;6:37;{5058.904000002891,2546.714799998328,0.0}
Trams142;14;14;38850;6:38;{4084.1569000035524,2161.088000001386,0.0}
Trams143;14;13;38850;6:38;{2839.1857000030577,1180.8036000002176,0.0}
Trams146;14;4;38861;6:39;{4031.8555000014603,2128.9623999986798,0.0}
Trams144;14;6;38862;6:40;{5634.466500002891,2784.006800001487,0.0}
Trams142;14;15;38864;6:40;{4722.0763000026345,2426.624300001189,0.0}
Trams149;14;7;38864;6:40;{2894.896500002593,514.0241999980062,0.0}
Trams182;18;6;38865;6:40;{2149.2538000009954,1363.784799998626,0.0}
Trams142;14;17;38873;6:41;{5123.508700001985,2583.745899999514,0.0}
Trams144;14;7;38874;6:42;{5058.904000002891,2546.714799998328,0.0}
Trams182;18;9;38875;6:42;{2627.1466000005603,1561.507400000468,0.0}
Trams149;14;11;38876;6:42;{2597.49450000003,904.9190000016242,0.0}
Trams182;18;8;38884;6:43;{3035.1652000024915,1729.7097000014037,0.0}
Trams148;14;7;38884;6:43;{2894.896500002593,514.0241999980062,0.0}
Trams149;14;15;38884;6:43;{2839.1857000030577,1180.8036000002176,0.0}
Trams142;14;22;38885;6:43;{5689.812200002372,2815.7713999990374,0.0}
Trams142;14;21;38886;6:44;{5739.764803540053,2830.2159521656795,0.0}
Trams183;18;23;38892;6:45;{7267.007879060962,3598.2324644667874,0.0}
Trams142;14;24;38896;6:45;{6221.943900000304,2968.579499999061,0.0}
Trams144;14;8;38896;6:45;{4031.8555000014603,2128.9623999986798,0.0}
Trams148;14;8;38896;6:45;{2597.49450000003,904.9190000016242,0.0}
Trams1411;14;2;38896;6:45;{6221.943900000304,2968.579499999061,0.0}
Trams183;18;7;38897;6:45;{7477.508000001311,3581.729000000283,0.0}
Trams143;14;16;38899;6:46;{4722.0763000026345,2426.624300001189,0.0}
Trams147;14;3;38899;6:46;{2894.896500002593,514.0241999980062,0.0}
Trams181;18;8;38900;6:46;{2589.0274000018835,1538.5219000000507,0.0}
Trams148;14;9;38904;6:47;{2839.1857000030577,1180.8036000002176,0.0}
Trams141;14;8;38908;6:47;{7477.508000001311,3581.729000000283,0.0}
Trams143;14;19;38908;6:47;{5123.508700001985,2583.745899999514,0.0}
Trams141;14;5;38909;6:47;{7477.508000001311,3581.729000000283,0.0}
Trams147;14;5;38911;6:48;{2597.49450000003,904.9190000016242,0.0}
Trams144;14;6;38918;6:49;{2992.747200001031,1703.0900999996811,0.0}
Trams144;14;5;38919;6:49;{2952.0448504139104,1673.1693294131398,0.0}
Trams149;14;14;38919;6:49;{4084.1569000035524,2161.088000001386,0.0}
Trams143;14;20;38920;6:49;{5689.812200002372,2815.7713999990374,0.0}
Trams143;14;19;38921;6:49;{5739.764803540053,2830.2159521656795,0.0}
Trams142;14;4;38926;6:50;{7477.508000001311,3581.729000000283,0.0}
Trams146;14;5;38926;6:50;{2597.49450000003,904.9190000016242,0.0}
Trams1411;14;1;38926;6:50;{7477.508000001311,3581.729000000283,0.0}
Trams142;14;3;38927;6:50;{7477.508000001311,3581.729000000283,0.0}
Trams182;18;10;38929;6:51;{5123.508700001985,2583.745899999514,0.0}
Trams145;14;6;38929;6:51;{2894.896500002593,514.0241999980062,0.0}
Trams143;14;20;38931;6:51;{6221.943900000304,2968.579499999061,0.0}
Trams149;14;16;38933;6:51;{4722.0763000026345,2426.624300001189,0.0}
Trams146;14;6;38934;6:52;{2839.1857000030577,1180.8036000002176,0.0}
Trams181;18;7;38937;6:52;{874.5067790792331,818.4381949221134,0.0}
Trams181;18;8;38938;6:52;{845.340600002557,806.1041999999434,0.0}
Trams181;18;5;38939;6:52;{845.340600002557,806.1041999999434,0.0}
Trams183;18;8;38941;6:53;{5634.466500002891,2784.006800001487,0.0}
Trams145;14;10;38941;6:53;{2597.49450000003,904.9190000016242,0.0}
Trams143;14;19;38946;6:54;{6864.837443928478,3341.6995773341046,0.0}
Trams144;14;6;38949;6:54;{2894.896500002593,514.0241999980062,0.0}
Trams145;14;12;38949;6:54;{2839.1857000030577,1180.8036000002176,0.0}
Trams183;18;9;38953;6:55;{5058.904000002891,2546.714799998328,0.0}
Trams148;14;13;38953;6:55;{4722.0763000026345,2426.624300001189,0.0}
Trams143;14;18;38956;6:55;{7267.007879060962,3598.2324644667874,0.0}
Trams181;18;9;38961;6:56;{1782.5218000002205,1208.6106000002474,0.0}
Trams183;18;11;38961;6:56;{4672.309900000691,2395.577299999073,0.0}
Trams143;14;6;38961;6:56;{7477.508000001311,3581.729000000283,0.0}
Trams144;14;7;38961;6:56;{2597.49450000003,904.9190000016242,0.0}
Trams143;14;4;38962;6:56;{7477.508000001311,3581.729000000283,0.0}
Trams148;14;15;38962;6:56;{5123.508700001985,2583.745899999514,0.0}
Trams182;18;9;38967;6:57;{6864.837443928478,3341.6995773341046,0.0}
Trams147;14;6;38968;6:57;{4722.0763000026345,2426.624300001189,0.0}
Trams181;18;11;38969;6:57;{2149.2538000009954,1363.784799998626,0.0}
Trams181;18;13;38979;6:59;{2627.1466000005603,1561.507400000468,0.0}
Trams182;18;2;38982;7:0;{7477.508000001311,3581.729000000283,0.0}
Trams146;14;8;38983;7:0;{4722.0763000026345,2426.624300001189,0.0}
Trams148;14;14;38985;7:0;{6221.943900000304,2968.579499999061,0.0}
Trams147;14;7;38989;7:1;{5689.812200002372,2815.7713999990374,0.0}
Trams146;14;9;38992;7:1;{5123.508700001985,2583.745899999514,0.0}
Trams149;14;5;38995;7:2;{7477.508000001311,3581.729000000283,0.0}
Trams149;14;4;38996;7:2;{7477.508000001311,3581.729000000283,0.0}
Trams183;18;10;38997;7:2;{2992.747200001031,1703.0900999996811,0.0}
Trams145;14;13;38998;7:2;{4722.0763000026345,2426.624300001189,0.0}
Trams147;14;9;39000;7:3;{6221.943900000304,2968.579499999061,0.0}
Trams148;14;13;39000;7:3;{6864.837443928478,3341.6995773341046,0.0}
Trams146;14;10;39004;7:3;{5689.812200002372,2815.7713999990374,0.0}
Trams145;14;17;39007;7:4;{5123.508700001985,2583.745899999514,0.0}
Trams147;14;8;39015;7:5;{6864.837443928478,3341.6995773341046,0.0}
Trams148;14;7;39015;7:5;{7477.508000001311,3581.729000000283,0.0}
Trams183;18;9;39016;7:5;{2110.2352000027895,1344.0613000001758,0.0}
Trams148;14;6;39016;7:5;{7477.508000001311,3581.729000000283,0.0}
Trams183;18;8;39017;7:5;{2064.0685709043055,1320.5282183098925,0.0}
Trams144;14;9;39018;7:6;{4722.0763000026345,2426.624300001189,0.0}
Trams145;14;18;39019;7:6;{5689.812200002372,2815.7713999990374,0.0}
Trams181;18;14;39024;7:7;{4722.0763000026345,2426.624300001189,0.0}
Trams182;18;3;39026;7:7;{5634.466500002891,2784.006800001487,0.0}
Trams145;14;19;39030;7:8;{6221.943900000304,2968.579499999061,0.0}
Trams147;14;5;39030;7:8;{7477.508000001311,3581.729000000283,0.0}
Trams147;14;4;39031;7:8;{7477.508000001311,3581.729000000283,0.0}
Trams181;18;13;39032;7:8;{5108.905971347362,2577.745680309252,0.0}
Trams141;14;16;39039;7:9;{2894.896500002593,514.0241999980062,0.0}
Trams143;14;5;39039;7:9;{4031.8555000014603,2128.9623999986798,0.0}
Trams144;14;10;39039;7:9;{5689.812200002372,2815.7713999990374,0.0}
Trams146;14;9;39039;7:9;{7223.311400000006,3570.043500000611,0.0}
Trams149;14;5;39039;7:9;{5634.466500002891,2784.006800001487,0.0}
Trams183;18;9;39044;7:10;{845.340600002557,806.1041999999434,0.0}
Trams183;18;8;39045;7:10;{845.340600002557,806.1041999999434,0.0}
Trams146;14;5;39045;7:10;{7477.508000001311,3581.729000000283,0.0}
Trams182;18;4;39046;7:10;{4672.309900000691,2395.577299999073,0.0}
Trams146;14;4;39046;7:10;{7477.508000001311,3581.729000000283,0.0}
Trams144;14;11;39050;7:11;{6221.943900000304,2968.579499999061,0.0}
Trams141;14;24;39051;7:11;{2597.49450000003,904.9190000016242,0.0}
Trams142;14;5;39057;7:12;{2894.896500002593,514.0241999980062,0.0}
Trams149;14;6;39059;7:12;{4672.309900000691,2395.577299999073,0.0}
Trams145;14;5;39060;7:13;{7477.508000001311,3581.729000000283,0.0}
Trams145;14;4;39061;7:13;{7477.508000001311,3581.729000000283,0.0}
Trams143;14;4;39062;7:13;{2952.0448504139104,1673.1693294131398,0.0}
Trams142;14;12;39069;7:14;{2597.49450000003,904.9190000016242,0.0}
Trams181;18;12;39072;7:15;{6883.719200000167,3354.242599999532,0.0}
Trams149;14;5;39072;7:15;{4048.297289360261,2135.7927898531034,0.0}
Trams183;18;18;39075;7:15;{2149.2538000009954,1363.784799998626,0.0}
Trams142;14;24;39077;7:15;{2839.1857000030577,1180.8036000002176,0.0}
Trams1411;14;3;39077;7:15;{2839.1857000030577,1180.8036000002176,0.0}
Trams148;14;7;39079;7:16;{4672.309900000691,2395.577299999073,0.0}
Trams144;14;4;39080;7:16;{7477.508000001311,3581.729000000283,0.0}
Trams182;18;3;39082;7:16;{2992.747200001031,1703.0900999996811,0.0}
Trams183;18;23;39085;7:17;{2627.1466000005603,1561.507400000468,0.0}
Trams181;18;4;39086;7:17;{7477.508000001311,3581.729000000283,0.0}
Trams1411;14;5;39090;7:18;{3035.1652000024915,1729.7097000014037,0.0}
Trams143;14;7;39092;7:18;{2894.896500002593,514.0241999980062,0.0}
Trams145;14;5;39092;7:18;{6188.119100000709,2954.7112999986857,0.0}
Trams148;14;6;39092;7:18;{4048.297289360261,2135.7927898531034,0.0}
Trams182;18;5;39101;7:19;{2110.2352000027895,1344.0613000001758,0.0}
Trams143;14;13;39104;7:20;{2597.49450000003,904.9190000016242,0.0}
Trams149;14;4;39109;7:21;{2774.94460455129,1095.9101807449765,0.0}
Trams182;18;4;39110;7:21;{1692.722305299079,1166.6255241828771,0.0}
Trams143;14;18;39112;7:21;{2839.1857000030577,1180.8036000002176,0.0}
Trams145;14;6;39116;7:22;{5058.904000002891,2546.714799998328,0.0}
Trams149;14;8;39126;7:24;{2894.896500002593,514.0241999980062,0.0}
Trams1411;14;24;39126;7:24;{4722.0763000026345,2426.624300001189,0.0}
Trams182;18;3;39128;7:24;{874.5067790792331,818.4381949221134,0.0}
Trams181;18;7;39130;7:24;{5634.466500002891,2784.006800001487,0.0}
Trams183;18;24;39130;7:24;{4722.0763000026345,2426.624300001189,0.0}
Trams148;14;5;39136;7:25;{2567.6414284064917,825.1840510346515,0.0}
Trams149;14;14;39138;7:26;{2597.49450000003,904.9190000016242,0.0}
Trams181;18;8;39142;7:26;{5058.904000002891,2546.714799998328,0.0}
Trams148;14;9;39146;7:27;{2894.896500002593,514.0241999980062,0.0}
Trams149;14;17;39146;7:27;{2839.1857000030577,1180.8036000002176,0.0}
Trams1411;14;23;39148;7:27;{5739.764803540053,2830.2159521656795,0.0}
Trams181;18;9;39150;7:28;{4672.309900000691,2395.577299999073,0.0}
Trams182;18;7;39152;7:28;{1782.5218000002205,1208.6106000002474,0.0}
Trams183;18;23;39152;7:28;{5739.764803540053,2830.2159521656795,0.0}
Trams141;14;23;39156;7:29;{6883.719200000167,3354.242599999532,0.0}
Trams148;14;11;39158;7:29;{2597.49450000003,904.9190000016242,0.0}
Trams1411;14;24;39158;7:29;{6221.943900000304,2968.579499999061,0.0}
Trams142;14;23;39159;7:29;{6271.932036142039,2982.903802087056,0.0}
Trams149;14;18;39159;7:29;{3035.1652000024915,1729.7097000014037,0.0}
Trams182;18;14;39160;7:29;{2149.2538000009954,1363.784799998626,0.0}
Trams145;14;5;39160;7:29;{2992.747200001031,1703.0900999996811,0.0}
Trams149;14;17;39160;7:29;{3084.0353342962862,1747.4296273253601,0.0}
Trams143;14;23;39161;7:29;{4722.0763000026345,2426.624300001189,0.0}
Trams183;18;24;39162;7:30;{6221.943900000304,2968.579499999061,0.0}
Trams147;14;6;39162;7:30;{2892.683600001037,511.3241000007838,0.0}
Trams148;14;13;39166;7:30;{2839.1857000030577,1180.8036000002176,0.0}
Trams182;18;16;39170;7:31;{2627.1466000005603,1561.507400000468,0.0}
Trams141;14;6;39170;7:31;{7477.508000001311,3581.729000000283,0.0}
Trams143;14;24;39170;7:31;{5123.508700001985,2583.745899999514,0.0}
Trams1410;14;12;39170;7:31;{5123.508700001985,2583.745899999514,0.0}
Trams147;14;7;39173;7:31;{2597.49450000003,904.9190000016242,0.0}
Trams146;14;7;39176;7:32;{2894.896500002593,514.0241999980062,0.0}
Trams183;18;23;39178;7:32;{6883.719200000167,3354.242599999532,0.0}
Trams144;14;5;39180;7:33;{2992.747200001031,1703.0900999996811,0.0}
Trams147;14;10;39181;7:33;{2839.1857000030577,1180.8036000002176,0.0}
Trams149;14;18;39181;7:33;{4084.1569000035524,2161.088000001386,0.0}
Trams1410;14;23;39182;7:33;{5689.812200002372,2815.7713999990374,0.0}
Trams142;14;22;39183;7:33;{7267.007879060962,3598.2324644667874,0.0}
Trams142;14;4;39188;7:34;{7477.508000001311,3581.729000000283,0.0}
Trams146;14;8;39188;7:34;{2597.49450000003,904.9190000016242,0.0}
Trams1411;14;1;39188;7:34;{7477.508000001311,3581.729000000283,0.0}
Trams142;14;2;39189;7:34;{7477.508000001311,3581.729000000283,0.0}
Trams145;14;4;39191;7:34;{2894.896500002593,514.0241999980062,0.0}
Trams183;18;8;39192;7:35;{7477.508000001311,3581.729000000283,0.0}
Trams183;18;7;39193;7:35;{7477.508000001311,3581.729000000283,0.0}
Trams144;14;4;39193;7:35;{2808.1955000013113,1135.889900000766,0.0}
Trams147;14;9;39195;7:35;{3084.0353342962862,1747.4296273253601,0.0}
Trams149;14;22;39195;7:35;{4722.0763000026345,2426.624300001189,0.0}
Trams146;14;10;39196;7:35;{2839.1857000030577,1180.8036000002176,0.0}
Trams182;18;15;39201;7:36;{4084.1569000035524,2161.088000001386,0.0}
Trams145;14;7;39203;7:36;{2597.49450000003,904.9190000016242,0.0}
Trams149;14;24;39204;7:37;{5123.508700001985,2583.745899999514,0.0}
Trams1410;14;21;39208;7:37;{6864.837443928478,3341.6995773341046,0.0}
Trams144;14;8;39211;7:38;{2894.896500002593,514.0241999980062,0.0}
Trams145;14;8;39211;7:38;{2839.1857000030577,1180.8036000002176,0.0}
Trams181;18;10;39213;7:38;{1740.6504000015557,1186.7970000002533,0.0}
Trams181;18;8;39214;7:38;{1692.722305299079,1166.6255241828771,0.0}
Trams182;18;17;39215;7:38;{4722.0763000026345,2426.624300001189,0.0}
Trams147;14;11;39216;7:39;{4084.1569000035524,2161.088000001386,0.0}
Trams1410;14;19;39218;7:39;{7267.007879060962,3598.2324644667874,0.0}
Trams143;14;3;39223;7:40;{7477.508000001311,3581.729000000283,0.0}
Trams144;14;14;39223;7:40;{2597.49450000003,904.9190000016242,0.0}
Trams1410;14;1;39223;7:40;{7477.508000001311,3581.729000000283,0.0}
Trams182;18;21;39224;7:40;{5123.508700001985,2583.745899999514,0.0}
Trams181;18;7;39225;7:40;{1208.916700001806,962.1525999996811,0.0}
Trams147;14;12;39230;7:41;{4722.0763000026345,2426.624300001189,0.0}
Trams144;14;16;39231;7:41;{2839.1857000030577,1180.8036000002176,0.0}
Trams141;14;7;39234;7:42;{4672.309900000691,2395.577299999073,0.0}
Trams182;18;24;39236;7:42;{5689.812200002372,2815.7713999990374,0.0}
Trams183;18;8;39236;7:42;{5634.466500002891,2784.006800001487,0.0}
Trams181;18;8;39244;7:43;{1241.924200002104,980.4126999992877,0.0}
Trams144;14;15;39245;7:43;{3084.0353342962862,1747.4296273253601,0.0}
Trams146;14;14;39245;7:43;{4722.0763000026345,2426.624300001189,0.0}
Trams145;14;9;39246;7:44;{4084.1569000035524,2161.088000001386,0.0}
Trams148;14;15;39247;7:44;{6221.943900000304,2968.579499999061,0.0}
Trams183;18;10;39248;7:44;{5058.904000002891,2546.714799998328,0.0}
Trams141;14;6;39248;7:44;{4031.8555000014603,2128.9623999986798,0.0}
Trams182;18;23;39255;7:45;{6593.146138654794,3149.575753243163,0.0}
Trams181;18;13;39256;7:45;{1782.5218000002205,1208.6106000002474,0.0}
Trams183;18;11;39256;7:45;{4672.309900000691,2395.577299999073,0.0}
Trams149;14;3;39257;7:45;{7477.508000001311,3581.729000000283,0.0}
Trams149;14;2;39258;7:46;{7477.508000001311,3581.729000000283,0.0}
Trams145;14;10;39260;7:46;{4722.0763000026345,2426.624300001189,0.0}
Trams182;18;22;39262;7:46;{6864.837443928478,3341.6995773341046,0.0}
Trams181;18;22;39264;7:47;{2149.2538000009954,1363.784799998626,0.0}
Trams183;18;12;39270;7:48;{4031.8555000014603,2128.9623999986798,0.0}
Trams181;18;24;39274;7:48;{2627.1466000005603,1561.507400000468,0.0}
Trams182;18;2;39277;7:49;{7477.508000001311,3581.729000000283,0.0}
Trams148;14;4;39277;7:49;{7477.508000001311,3581.729000000283,0.0}
Trams144;14;17;39280;7:49;{4722.0763000026345,2426.624300001189,0.0}
Trams145;14;13;39281;7:49;{5689.812200002372,2815.7713999990374,0.0}
Trams144;14;19;39289;7:51;{5123.508700001985,2583.745899999514,0.0}
Trams183;18;13;39292;7:51;{2992.747200001031,1703.0900999996811,0.0}
Trams147;14;3;39292;7:51;{7477.508000001311,3581.729000000283,0.0}
Trams183;18;14;39301;7:53;{2589.0274000018835,1538.5219000000507,0.0}
Trams141;14;20;39301;7:53;{2894.896500002593,514.0241999980062,0.0}
Trams144;14;20;39301;7:53;{5689.812200002372,2815.7713999990374,0.0}
Trams181;18;23;39305;7:53;{4084.1569000035524,2161.088000001386,0.0}
Trams146;14;3;39307;7:54;{7477.508000001311,3581.729000000283,0.0}
Trams146;14;2;39308;7:54;{7477.508000001311,3581.729000000283,0.0}
Trams183;18;15;39311;7:54;{2110.2352000027895,1344.0613000001758,0.0}
Trams144;14;22;39312;7:55;{6221.943900000304,2968.579499999061,0.0}
Trams141;14;24;39313;7:55;{2597.49450000003,904.9190000016242,0.0}
Trams149;14;4;39313;7:55;{5058.904000002891,2546.714799998328,0.0}
Trams181;18;24;39319;7:56;{4722.0763000026345,2426.624300001189,0.0}
Trams183;18;13;39319;7:56;{1740.6504000015557,1186.7970000002533,0.0}
Trams142;14;10;39319;7:56;{2894.896500002593,514.0241999980062,0.0}
Trams183;18;12;39320;7:56;{1692.722305299079,1166.6255241828771,0.0}
Trams182;18;3;39321;7:56;{5634.466500002891,2784.006800001487,0.0}
Trams145;14;3;39322;7:56;{7477.508000001311,3581.729000000283,0.0}
Trams142;14;19;39331;7:58;{2597.49450000003,904.9190000016242,0.0}
Trams182;18;6;39333;7:58;{5058.904000002891,2546.714799998328,0.0}
Trams149;14;3;39334;7:58;{4048.297289360261,2135.7927898531034,0.0}
Trams183;18;11;39338;7:59;{874.5067790792331,818.4381949221134,0.0}
Trams142;14;24;39339;7:59;{2839.1857000030577,1180.8036000002176,0.0}
Trams1411;14;20;39339;7:59;{2839.1857000030577,1180.8036000002176,0.0}
Trams183;18;8;39340;7:59;{845.340600002557,806.1041999999434,0.0}
Trams182;18;7;39341;7:59;{4672.309900000691,2395.577299999073,0.0}
Trams144;14;3;39342;8:0;{7477.508000001311,3581.729000000283,0.0}
Trams144;14;2;39343;8:0;{7477.508000001311,3581.729000000283,0.0}
Trams181;18;23;39352;8:1;{6271.932036142039,2982.903802087056,0.0}
Trams143;14;9;39354;8:2;{2894.896500002593,514.0241999980062,0.0}
Trams182;18;8;39355;8:2;{4031.8555000014603,2128.9623999986798,0.0}
Trams149;14;2;39358;8:2;{2952.0448504139104,1673.1693294131398,0.0}
Trams183;18;10;39362;8:3;{1782.5218000002205,1208.6106000002474,0.0}
Trams143;14;10;39366;8:4;{2597.49450000003,904.9190000016242,0.0}
Trams145;14;4;39366;8:4;{5634.466500002891,2784.006800001487,0.0}
Trams183;18;16;39370;8:4;{2149.2538000009954,1363.784799998626,0.0}
Trams143;14;13;39374;8:5;{2839.1857000030577,1180.8036000002176,0.0}
Trams1411;14;22;39374;8:5;{4084.1569000035524,2161.088000001386,0.0}
Trams182;18;7;39378;8:6;{2942.963136644313,1688.2069726773154,0.0}
Trams183;18;22;39380;8:6;{2627.1466000005603,1561.507400000468,0.0}
Trams181;18;4;39381;8:6;{7477.508000001311,3581.729000000283,0.0}
Trams182;18;6;39386;8:7;{2589.0274000018835,1538.5219000000507,0.0}
Trams149;14;5;39388;8:7;{2894.896500002593,514.0241999980062,0.0}
Trams1411;14;24;39388;8:7;{4722.0763000026345,2426.624300001189,0.0}
Trams183;18;21;39389;8:7;{3035.1652000024915,1729.7097000014037,0.0}
Trams1411;14;23;39396;8:9;{5108.905971347362,2577.745680309252,0.0}
Trams1411;14;24;39397;8:9;{5123.508700001985,2583.745899999514,0.0}
Trams145;14;3;39399;8:9;{4048.297289360261,2135.7927898531034,0.0}
Trams149;14;9;39400;8:9;{2597.49450000003,904.9190000016242,0.0}
Trams149;14;11;39408;8:11;{2839.1857000030577,1180.8036000002176,0.0}
Trams181;18;5;39413;8:11;{6188.119100000709,2954.7112999986857,0.0}
Trams141;14;23;39417;8:12;{6864.837443928478,3341.6995773341046,0.0}
Trams141;14;22;39418;8:12;{6883.719200000167,3354.242599999532,0.0}
Trams148;14;6;39420;8:13;{2597.49450000003,904.9190000016242,0.0}
Trams149;14;10;39422;8:13;{3084.0353342962862,1747.4296273253601,0.0}
Trams182;18;5;39423;8:13;{874.5067790792331,818.4381949221134,0.0}
Trams143;14;24;39423;8:13;{4722.0763000026345,2426.624300001189,0.0}
Trams1410;14;3;39423;8:13;{4722.0763000026345,2426.624300001189,0.0}
Trams181;18;7;39425;8:13;{5634.466500002891,2784.006800001487,0.0}
Trams182;18;2;39425;8:13;{845.340600002557,806.1041999999434,0.0}
Trams141;14;5;39432;8:15;{7477.508000001311,3581.729000000283,0.0}
Trams1410;14;21;39432;8:15;{5123.508700001985,2583.745899999514,0.0}
Trams147;14;7;39435;8:15;{2597.49450000003,904.9190000016242,0.0}
Trams181;18;9;39437;8:15;{5058.904000002891,2546.714799998328,0.0}
Trams146;14;3;39438;8:16;{2894.896500002593,514.0241999980062,0.0}
Trams147;14;8;39443;8:16;{2839.1857000030577,1180.8036000002176,0.0}
Trams1410;14;24;39444;8:17;{5689.812200002372,2815.7713999990374,0.0}
Trams181;18;11;39445;8:17;{4672.309900000691,2395.577299999073,0.0}
Trams1411;14;23;39445;8:17;{7267.007879060962,3598.2324644667874,0.0}
Trams183;18;24;39446;8:17;{5689.812200002372,2815.7713999990374,0.0}
Trams142;14;4;39450;8:18;{7477.508000001311,3581.729000000283,0.0}
Trams1411;14;1;39450;8:18;{7477.508000001311,3581.729000000283,0.0}
Trams142;14;2;39451;8:18;{7477.508000001311,3581.729000000283,0.0}
Trams182;18;8;39455;8:18;{2149.2538000009954,1363.784799998626,0.0}
Trams149;14;11;39457;8:19;{4722.0763000026345,2426.624300001189,0.0}
Trams143;14;23;39463;8:20;{6593.146138654794,3149.575753243163,0.0}
Trams182;18;10;39465;8:20;{2627.1466000005603,1561.507400000468,0.0}
Trams145;14;4;39465;8:20;{2597.49450000003,904.9190000016242,0.0}
Trams149;14;12;39466;8:20;{5123.508700001985,2583.745899999514,0.0}
Trams1410;14;23;39471;8:21;{6883.719200000167,3354.242599999532,0.0}
Trams144;14;5;39473;8:21;{2894.896500002593,514.0241999980062,0.0}
Trams145;14;6;39473;8:21;{2839.1857000030577,1180.8036000002176,0.0}
Trams147;14;9;39478;8:22;{4084.1569000035524,2161.088000001386,0.0}
Trams149;14;13;39478;8:22;{5689.812200002372,2815.7713999990374,0.0}
Trams143;14;24;39479;8:22;{7223.311400000006,3570.043500000611,0.0}
Trams181;18;10;39481;8:23;{2992.747200001031,1703.0900999996811,0.0}
Trams143;14;7;39485;8:23;{7477.508000001311,3581.729000000283,0.0}
Trams144;14;6;39485;8:23;{2597.49450000003,904.9190000016242,0.0}
Trams1410;14;3;39485;8:23;{7477.508000001311,3581.729000000283,0.0}
Trams143;14;4;39486;8:24;{7477.508000001311,3581.729000000283,0.0}
Trams148;14;7;39486;8:24;{5123.508700001985,2583.745899999514,0.0}
Trams1410;14;1;39486;8:24;{7477.508000001311,3581.729000000283,0.0}
Trams183;18;8;39487;8:24;{7477.508000001311,3581.729000000283,0.0}
Trams183;18;7;39488;8:24;{7477.508000001311,3581.729000000283,0.0}
Trams149;14;16;39489;8:24;{6221.943900000304,2968.579499999061,0.0}
Trams181;18;9;39490;8:24;{2589.0274000018835,1538.5219000000507,0.0}
Trams147;14;10;39492;8:25;{4722.0763000026345,2426.624300001189,0.0}
Trams144;14;7;39493;8:25;{2839.1857000030577,1180.8036000002176,0.0}
Trams148;14;8;39498;8:26;{5689.812200002372,2815.7713999990374,0.0}
Trams181;18;8;39500;8:26;{2110.2352000027895,1344.0613000001758,0.0}
Trams144;14;6;39507;8:27;{3084.0353342962862,1747.4296273253601,0.0}
Trams146;14;5;39507;8:27;{4722.0763000026345,2426.624300001189,0.0}
Trams145;14;7;39508;8:27;{4084.1569000035524,2161.088000001386,0.0}
Trams181;18;7;39509;8:27;{1692.722305299079,1166.6255241828771,0.0}
Trams148;14;7;39509;8:27;{6221.943900000304,2968.579499999061,0.0}
Trams146;14;7;39516;8:29;{5123.508700001985,2583.745899999514,0.0}
Trams183;18;8;39519;8:29;{6188.119100000709,2954.7112999986857,0.0}
Trams149;14;2;39519;8:29;{7477.508000001311,3581.729000000283,0.0}
Trams149;14;1;39520;8:29;{7477.508000001311,3581.729000000283,0.0}
Trams145;14;8;39522;8:30;{4722.0763000026345,2426.624300001189,0.0}
Trams148;14;5;39525;8:30;{6883.719200000167,3354.242599999532,0.0}
Trams146;14;8;39528;8:31;{5689.812200002372,2815.7713999990374,0.0}
Trams181;18;5;39529;8:31;{845.340600002557,806.1041999999434,0.0}
Trams145;14;10;39531;8:31;{5123.508700001985,2583.745899999514,0.0}
Trams182;18;9;39532;8:31;{5739.764803540053,2830.2159521656795,0.0}
Trams148;14;4;39534;8:32;{7267.007879060962,3598.2324644667874,0.0}
Trams181;18;6;39539;8:32;{1241.924200002104,980.4126999992877,0.0}
Trams146;14;9;39539;8:32;{6221.943900000304,2968.579499999061,0.0}
Trams148;14;1;39539;8:32;{7477.508000001311,3581.729000000283,0.0}
Trams182;18;10;39542;8:33;{6221.943900000304,2968.579499999061,0.0}
Trams183;18;10;39543;8:33;{5058.904000002891,2546.714799998328,0.0}
Trams145;14;11;39543;8:33;{5689.812200002372,2815.7713999990374,0.0}
Trams147;14;11;39548;8:34;{7223.311400000006,3570.043500000611,0.0}
Trams181;18;9;39551;8:34;{1782.5218000002205,1208.6106000002474,0.0}
Trams144;14;7;39551;8:34;{5123.508700001985,2583.745899999514,0.0}
Trams147;14;3;39554;8:35;{7477.508000001311,3581.729000000283,0.0}
Trams181;18;18;39559;8:36;{2149.2538000009954,1363.784799998626,0.0}
Trams141;14;9;39563;8:36;{2894.896500002593,514.0241999980062,0.0}
Trams144;14;9;39563;8:36;{5689.812200002372,2815.7713999990374,0.0}
Trams183;18;11;39565;8:37;{4031.8555000014603,2128.9623999986798,0.0}
Trams182;18;9;39566;8:37;{7223.311400000006,3570.043500000611,0.0}
Trams182;18;8;39567;8:37;{7267.007879060962,3598.2324644667874,0.0}
Trams181;18;19;39569;8:37;{2627.1466000005603,1561.507400000468,0.0}
Trams146;14;2;39569;8:37;{7477.508000001311,3581.729000000283,0.0}
Trams146;14;1;39570;8:38;{7477.508000001311,3581.729000000283,0.0}
Trams182;18;2;39572;8:38;{7477.508000001311,3581.729000000283,0.0}
Trams144;14;10;39574;8:38;{6221.943900000304,2968.579499999061,0.0}
Trams141;14;18;39575;8:38;{2597.49450000003,904.9190000016242,0.0}
Trams141;14;24;39583;8:40;{2839.1857000030577,1180.8036000002176,0.0}
Trams148;14;2;39583;8:40;{5634.466500002891,2784.006800001487,0.0}
Trams145;14;5;39584;8:40;{7477.508000001311,3581.729000000283,0.0}
Trams145;14;3;39585;8:40;{7477.508000001311,3581.729000000283,0.0}
Trams144;14;9;39590;8:41;{6883.719200000167,3354.242599999532,0.0}
Trams142;14;4;39593;8:41;{2597.49450000003,904.9190000016242,0.0}
Trams141;14;22;39597;8:42;{3084.0353342962862,1747.4296273253601,0.0}
Trams181;18;20;39600;8:43;{4084.1569000035524,2161.088000001386,0.0}
Trams142;14;9;39601;8:43;{2839.1857000030577,1180.8036000002176,0.0}
Trams144;14;1;39604;8:43;{7477.508000001311,3581.729000000283,0.0}
Trams181;18;23;39614;8:45;{4722.0763000026345,2426.624300001189,0.0}
Trams183;18;12;39614;8:45;{1740.6504000015557,1186.7970000002533,0.0}
Trams142;14;10;39614;8:45;{3035.1652000024915,1729.7097000014037,0.0}
Trams182;18;4;39616;8:45;{5634.466500002891,2784.006800001487,0.0}
Trams143;14;6;39616;8:45;{2894.896500002593,514.0241999980062,0.0}
Trams181;18;24;39623;8:46;{5123.508700001985,2583.745899999514,0.0}
Trams146;14;2;39625;8:47;{5058.904000002891,2546.714799998328,0.0}
Trams182;18;5;39628;8:47;{5058.904000002891,2546.714799998328,0.0}
Trams143;14;8;39628;8:47;{2597.49450000003,904.9190000016242,0.0}
Trams183;18;11;39633;8:48;{874.5067790792331,818.4381949221134,0.0}
Trams183;18;8;39635;8:48;{845.340600002557,806.1041999999434,0.0}
Trams182;18;7;39636;8:49;{4672.309900000691,2395.577299999073,0.0}
Trams143;14;9;39636;8:49;{2839.1857000030577,1180.8036000002176,0.0}
Trams144;14;2;39636;8:49;{6188.119100000709,2954.7112999986857,0.0}
Trams141;14;24;39641;8:49;{5123.508700001985,2583.745899999514,0.0}
Trams142;14;11;39650;8:51;{4722.0763000026345,2426.624300001189,0.0}
Trams149;14;4;39650;8:51;{2894.896500002593,514.0241999980062,0.0}
Trams148;14;1;39653;8:51;{2774.94460455129,1095.9101807449765,0.0}
Trams181;18;23;39654;8:52;{6593.146138654794,3149.575753243163,0.0}
Trams141;14;23;39654;8:52;{5739.764803540053,2830.2159521656795,0.0}
Trams181;18;24;39655;8:52;{6609.992500003427,3161.7836000006646,0.0}
Trams183;18;10;39657;8:52;{1782.5218000002205,1208.6106000002474,0.0}
Trams142;14;12;39659;8:52;{5123.508700001985,2583.745899999514,0.0}
Trams149;14;7;39662;8:53;{2597.49450000003,904.9190000016242,0.0}
Trams141;14;24;39664;8:53;{6221.943900000304,2968.579499999061,0.0}
Trams183;18;17;39665;8:53;{2149.2538000009954,1363.784799998626,0.0}
Trams147;14;4;39667;8:54;{2808.1955000013113,1135.889900000766,0.0}
Trams146;14;1;39669;8:54;{2992.747200001031,1703.0900999996811,0.0}
Trams149;14;10;39670;8:54;{2839.1857000030577,1180.8036000002176,0.0}
Trams142;14;16;39671;8:54;{5689.812200002372,2815.7713999990374,0.0}
Trams143;14;11;39671;8:54;{4084.1569000035524,2161.088000001386,0.0}
Trams182;18;8;39672;8:55;{2992.747200001031,1703.0900999996811,0.0}
Trams141;14;23;39672;8:55;{6593.146138654794,3149.575753243163,0.0}
Trams183;18;20;39675;8:55;{2627.1466000005603,1561.507400000468,0.0}
Trams181;18;5;39676;8:55;{7477.508000001311,3581.729000000283,0.0}
Trams182;18;7;39681;8:56;{2589.0274000018835,1538.5219000000507,0.0}
Trams144;14;1;39681;8:56;{4048.297289360261,2135.7927898531034,0.0}
Trams148;14;2;39682;8:56;{2597.49450000003,904.9190000016242,0.0}
Trams183;18;19;39684;8:57;{3035.1652000024915,1729.7097000014037,0.0}
Trams143;14;15;39685;8:57;{4722.0763000026345,2426.624300001189,0.0}
Trams141;14;22;39689;8:57;{7267.007879060962,3598.2324644667874,0.0}
Trams148;14;5;39690;8:58;{2839.1857000030577,1180.8036000002176,0.0}
Trams182;18;5;39691;8:58;{2110.2352000027895,1344.0613000001758,0.0}
Trams141;14;5;39694;8:58;{7477.508000001311,3581.729000000283,0.0}
Trams143;14;17;39694;8:58;{5123.508700001985,2583.745899999514,0.0}
Trams141;14;4;39695;8:58;{7477.508000001311,3581.729000000283,0.0}
Trams147;14;5;39697;8:59;{2597.49450000003,904.9190000016242,0.0}
Trams182;18;6;39699;8:59;{1740.6504000015557,1186.7970000002533,0.0}
Trams146;14;2;39700;8:59;{2894.896500002593,514.0241999980062,0.0}
Trams149;14;9;39705;9:0;{4084.1569000035524,2161.088000001386,0.0}
Trams183;18;18;39706;9:0;{4084.1569000035524,2161.088000001386,0.0}
Trams143;14;18;39706;9:0;{5689.812200002372,2815.7713999990374,0.0}
Trams142;14;15;39707;9:0;{7267.007879060962,3598.2324644667874,0.0}
Trams143;14;17;39707;9:0;{5739.764803540053,2830.2159521656795,0.0}
Trams182;18;5;39711;9:1;{1208.916700001806,962.1525999996811,0.0}
Trams142;14;4;39712;9:1;{7477.508000001311,3581.729000000283,0.0}
Trams142;14;2;39713;9:1;{7477.508000001311,3581.729000000283,0.0}
Trams143;14;18;39717;9:2;{6221.943900000304,2968.579499999061,0.0}
Trams149;14;8;39718;9:2;{4707.823850244834,2420.7529164061234,0.0}
Trams149;14;9;39719;9:2;{4722.0763000026345,2426.624300001189,0.0}
Trams182;18;3;39720;9:3;{845.340600002557,806.1041999999434,0.0}
Trams148;14;4;39726;9:4;{4132.967545312427,2178.980077572535,0.0}
Trams149;14;10;39728;9:4;{5123.508700001985,2583.745899999514,0.0}
Trams181;18;6;39732;9:5;{5058.904000002891,2546.714799998328,0.0}
Trams141;14;5;39738;9:6;{5634.466500002891,2784.006800001487,0.0}
Trams148;14;3;39739;9:6;{4722.0763000026345,2426.624300001189,0.0}
Trams143;14;4;39747;9:7;{7477.508000001311,3581.729000000283,0.0}
Trams182;18;4;39750;9:8;{2149.2538000009954,1363.784799998626,0.0}
Trams183;18;17;39753;9:8;{6271.932036142039,2982.903802087056,0.0}
Trams183;18;16;39761;9:9;{6609.992500003427,3161.7836000006646,0.0}
Trams148;14;2;39771;9:11;{6221.943900000304,2968.579499999061,0.0}
Trams183;18;15;39776;9:12;{7223.311400000006,3570.043500000611,0.0}
Trams149;14;0;39781;9:13;{7477.508000001311,3581.729000000283,0.0}
Trams183;18;6;39782;9:13;{7477.508000001311,3581.729000000283,0.0}
Trams181;18;5;39795;9:15;{2110.2352000027895,1344.0613000001758,0.0}
Trams148;14;0;39801;9:16;{7477.508000001311,3581.729000000283,0.0}
Trams141;14;4;39815;9:18;{2567.6414284064917,825.1840510346515,0.0}
Trams147;14;4;39816;9:19;{7477.508000001311,3581.729000000283,0.0}
Trams146;14;1;39831;9:21;{7477.508000001311,3581.729000000283,0.0}
Trams182;18;3;39867;9:27;{7477.508000001311,3581.729000000283,0.0}
Trams144;14;2;42225;16:0;{7477.508000001311,3581.729000000283,0.0}
Trams143;14;6;42236;16:2;{2894.896500002593,514.0241999980062,0.0}
Trams143;14;5;42256;16:5;{2839.1857000030577,1180.8036000002176,0.0}
Trams143;14;6;42269;16:7;{3035.1652000024915,1729.7097000014037,0.0}
Trams144;14;3;42288;16:11;{4672.309900000691,2395.577299999073,0.0}
Trams183;18;9;42290;16:11;{845.340600002557,806.1041999999434,0.0}
Trams182;18;4;42291;16:11;{4672.309900000691,2395.577299999073,0.0}
Trams144;14;4;42302;16:13;{4031.8555000014603,2128.9623999986798,0.0}
Trams183;18;11;42312;16:15;{1782.5218000002205,1208.6106000002474,0.0}
Trams143;14;5;42313;16:15;{5108.905971347362,2577.745680309252,0.0}
Trams143;14;4;42314;16:15;{5123.508700001985,2583.745899999514,0.0}
Trams141;14;24;42315;16:15;{7477.508000001311,3581.729000000283,0.0}
Trams183;18;12;42320;16:16;{2149.2538000009954,1363.784799998626,0.0}
Trams144;14;5;42324;16:17;{2992.747200001031,1703.0900999996811,0.0}
Trams182;18;5;42327;16:17;{2992.747200001031,1703.0900999996811,0.0}
Trams183;18;11;42330;16:18;{2627.1466000005603,1561.507400000468,0.0}
Trams183;18;10;42331;16:18;{2675.4015184145933,1580.8842637522473,0.0}
Trams181;18;24;42332;16:18;{7477.508000001311,3581.729000000283,0.0}
Trams142;14;17;42333;16:18;{7477.508000001311,3581.729000000283,0.0}
Trams144;14;4;42337;16:19;{2808.1955000013113,1135.889900000766,0.0}
Trams142;14;18;42341;16:19;{7172.43200000003,3532.2607999984175,0.0}
Trams144;14;3;42344;16:20;{2569.3393000029027,869.8653000015765,0.0}
Trams144;14;2;42345;16:20;{2567.6414284064917,825.1840510346515,0.0}
Trams182;18;4;42346;16:20;{2110.2352000027895,1344.0613000001758,0.0}
Trams182;18;3;42347;16:20;{2064.0685709043055,1320.5282183098925,0.0}
Trams142;14;20;42349;16:21;{6831.853600002825,3315.144899999723,0.0}
Trams144;14;1;42355;16:22;{2894.896500002593,514.0241999980062,0.0}
Trams141;14;23;42357;16:22;{5641.738919684285,2786.998382666919,0.0}
Trams141;14;22;42358;16:22;{5634.466500002891,2784.006800001487,0.0}
Trams143;14;23;42368;16:24;{7477.508000001311,3581.729000000283,0.0}
Trams141;14;19;42370;16:24;{5058.904000002891,2546.714799998328,0.0}
Trams181;18;23;42374;16:25;{5641.738919684285,2786.998382666919,0.0}
Trams181;18;21;42375;16:25;{5634.466500002891,2784.006800001487,0.0}
Trams182;18;7;42375;16:25;{845.340600002557,806.1041999999434,0.0}
Trams141;14;18;42379;16:26;{4624.179771982149,2375.8925514936154,0.0}
Trams183;18;9;42383;16:26;{5108.905971347362,2577.745680309252,0.0}
Trams183;18;8;42384;16:27;{5123.508700001985,2583.745899999514,0.0}
Trams181;18;19;42388;16:27;{5010.473492013262,2527.781076226536,0.0}
Trams142;14;19;42388;16:27;{5058.904000002891,2546.714799998328,0.0}
Trams181;18;15;42395;16:28;{4672.309900000691,2395.577299999073,0.0}
Trams181;18;13;42396;16:29;{4624.179771982149,2375.8925514936154,0.0}
Trams183;18;6;42396;16:29;{5689.812200002372,2815.7713999990374,0.0}
Trams142;14;18;42396;16:29;{4672.309900000691,2395.577299999073,0.0}
Trams149;14;9;42402;16:30;{7477.508000001311,3581.729000000283,0.0}
Trams144;14;2;42410;16:31;{4084.1569000035524,2161.088000001386,0.0}
Trams143;14;21;42411;16:31;{5634.466500002891,2784.006800001487,0.0}
Trams182;18;6;42416;16:32;{2675.4015184145933,1580.8842637522473,0.0}
Trams149;14;10;42418;16:32;{6831.853600002825,3315.144899999723,0.0}
Trams148;14;5;42422;16:33;{7477.508000001311,3581.729000000283,0.0}
Trams143;14;19;42423;16:33;{5058.904000002891,2546.714799998328,0.0}
Trams143;14;17;42424;16:33;{5010.473492013262,2527.781076226536,0.0}
Trams144;14;1;42424;16:33;{4722.0763000026345,2426.624300001189,0.0}
Trams141;14;11;42427;16:34;{2808.1955000013113,1135.889900000766,0.0}
Trams181;18;14;42431;16:34;{2992.747200001031,1703.0900999996811,0.0}
Trams143;14;16;42431;16:34;{4672.309900000691,2395.577299999073,0.0}
Trams143;14;15;42432;16:35;{4624.179771982149,2375.8925514936154,0.0}
Trams141;14;10;42434;16:35;{2569.3393000029027,869.8653000015765,0.0}
Trams149;14;8;42434;16:35;{6138.21238208538,2940.1058384544613,0.0}
Trams141;14;6;42435;16:35;{2567.6414284064917,825.1840510346515,0.0}
Trams147;14;9;42437;16:35;{7477.508000001311,3581.729000000283,0.0}
Trams183;18;21;42438;16:36;{7477.508000001311,3581.729000000283,0.0}
Trams147;14;11;42438;16:36;{7446.12100000307,3545.9720000009984,0.0}
Trams181;18;12;42440;16:36;{2589.0274000018835,1538.5219000000507,0.0}
Trams142;14;17;42445;16:37;{2808.1955000013113,1135.889900000766,0.0}
Trams149;14;9;42445;16:37;{5634.466500002891,2784.006800001487,0.0}
Trams182;18;7;42446;16:37;{4084.1569000035524,2161.088000001386,0.0}
Trams183;18;22;42446;16:37;{7172.43200000003,3532.2607999984175,0.0}
Trams142;14;13;42446;16:37;{2774.94460455129,1095.9101807449765,0.0}
Trams181;18;10;42450;16:38;{2110.2352000027895,1344.0613000001758,0.0}
Trams181;18;7;42451;16:38;{2064.0685709043055,1320.5282183098925,0.0}
Trams142;14;10;42452;16:38;{2569.3393000029027,869.8653000015765,0.0}
Trams146;14;8;42452;16:38;{7477.508000001311,3581.729000000283,0.0}
Trams142;14;7;42453;16:38;{2567.6414284064917,825.1840510346515,0.0}
Trams148;14;6;42453;16:38;{6188.119100000709,2954.7112999986857,0.0}
Trams183;18;23;42454;16:38;{6831.853600002825,3315.144899999723,0.0}
Trams181;18;4;42458;16:39;{1740.6504000015557,1186.7970000002533,0.0}
Trams142;14;3;42463;16:40;{2894.896500002593,514.0241999980062,0.0}
Trams149;14;8;42465;16:40;{4672.309900000691,2395.577299999073,0.0}
Trams145;14;11;42467;16:40;{7477.508000001311,3581.729000000283,0.0}
Trams145;14;12;42468;16:41;{7446.12100000307,3545.9720000009984,0.0}
Trams182;18;6;42469;16:41;{5123.508700001985,2583.745899999514,0.0}
Trams141;14;8;42478;16:42;{3035.1652000024915,1729.7097000014037,0.0}
Trams181;18;7;42479;16:42;{845.340600002557,806.1041999999434,0.0}
Trams147;14;10;42479;16:42;{5641.738919684285,2786.998382666919,0.0}
Trams149;14;9;42479;16:42;{4031.8555000014603,2128.9623999986798,0.0}
Trams143;14;14;42480;16:43;{2808.1955000013113,1135.889900000766,0.0}
Trams143;14;13;42481;16:43;{2774.94460455129,1095.9101807449765,0.0}
Trams182;18;4;42482;16:43;{5739.764803540053,2830.2159521656795,0.0}
Trams146;14;6;42484;16:43;{6138.21238208538,2940.1058384544613,0.0}
Trams144;14;9;42487;16:44;{7477.508000001311,3581.729000000283,0.0}
Trams143;14;11;42488;16:44;{2567.6414284064917,825.1840510346515,0.0}
Trams147;14;11;42492;16:45;{5058.904000002891,2546.714799998328,0.0}
Trams183;18;22;42493;16:45;{5058.904000002891,2546.714799998328,0.0}
Trams183;18;21;42494;16:45;{5010.473492013262,2527.781076226536,0.0}
Trams142;14;4;42496;16:45;{3035.1652000024915,1729.7097000014037,0.0}
Trams143;14;4;42498;16:46;{2894.896500002593,514.0241999980062,0.0}
Trams145;14;13;42498;16:46;{6188.119100000709,2954.7112999986857,0.0}
Trams148;14;4;42499;16:46;{4031.8555000014603,2128.9623999986798,0.0}
Trams183;18;20;42502;16:46;{4624.179771982149,2375.8925514936154,0.0}
Trams146;14;4;42507;16:47;{5058.904000002891,2546.714799998328,0.0}
Trams145;14;12;42509;16:47;{5641.738919684285,2786.998382666919,0.0}
Trams145;14;11;42510;16:48;{5634.466500002891,2784.006800001487,0.0}
Trams149;14;7;42514;16:48;{2808.1955000013113,1135.889900000766,0.0}
Trams146;14;3;42515;16:48;{4672.309900000691,2395.577299999073,0.0}
Trams142;14;3;42518;16:49;{4084.1569000035524,2161.088000001386,0.0}
Trams149;14;4;42521;16:49;{2569.3393000029027,869.8653000015765,0.0}
Trams141;14;7;42522;16:50;{5108.905971347362,2577.745680309252,0.0}
Trams182;18;18;42523;16:50;{7477.508000001311,3581.729000000283,0.0}
Trams144;14;8;42529;16:51;{5641.738919684285,2786.998382666919,0.0}
Trams182;18;19;42531;16:51;{7172.43200000003,3532.2607999984175,0.0}
Trams149;14;5;42531;16:51;{2894.896500002593,514.0241999980062,0.0}
Trams149;14;2;42532;16:51;{2894.896500002593,514.0241999980062,0.0}
Trams148;14;2;42534;16:52;{2808.1955000013113,1135.889900000766,0.0}
Trams148;14;1;42535;16:52;{2774.94460455129,1095.9101807449765,0.0}
Trams141;14;6;42536;16:52;{5739.764803540053,2830.2159521656795,0.0}
Trams182;18;20;42539;16:52;{6831.853600002825,3315.144899999723,0.0}
Trams148;14;0;42541;16:53;{2569.3393000029027,869.8653000015765,0.0}
Trams183;18;19;42546;16:54;{2589.0274000018835,1538.5219000000507,0.0}
Trams147;14;10;42549;16:54;{2808.1955000013113,1135.889900000766,0.0}
Trams144;14;6;42550;16:54;{4672.309900000691,2395.577299999073,0.0}
Trams144;14;5;42551;16:54;{4624.179771982149,2375.8925514936154,0.0}
Trams182;18;18;42555;16:55;{6138.21238208538,2940.1058384544613,0.0}
Trams183;18;18;42556;16:55;{2110.2352000027895,1344.0613000001758,0.0}
Trams147;14;7;42556;16:55;{2569.3393000029027,869.8653000015765,0.0}
Trams183;18;11;42557;16:55;{2064.0685709043055,1320.5282183098925,0.0}
Trams147;14;5;42557;16:55;{2567.6414284064917,825.1840510346515,0.0}
Trams183;18;5;42564;16:57;{1740.6504000015557,1186.7970000002533,0.0}
Trams144;14;7;42564;16:57;{4031.8555000014603,2128.9623999986798,0.0}
Trams146;14;2;42564;16:57;{2808.1955000013113,1135.889900000766,0.0}
Trams182;18;17;42565;16:57;{5641.738919684285,2786.998382666919,0.0}
Trams149;14;3;42565;16:57;{3035.1652000024915,1729.7097000014037,0.0}
Trams147;14;3;42567;16:57;{2894.896500002593,514.0241999980062,0.0}
Trams146;14;1;42571;16:58;{2569.3393000029027,869.8653000015765,0.0}
Trams181;18;6;42572;16:58;{5108.905971347362,2577.745680309252,0.0}
Trams143;14;3;42576;16:59;{5123.508700001985,2583.745899999514,0.0}
Trams141;14;24;42577;16:59;{7477.508000001311,3581.729000000283,0.0}
Trams182;18;18;42578;16:59;{5058.904000002891,2546.714799998328,0.0}
Trams182;18;14;42579;16:59;{5010.473492013262,2527.781076226536,0.0}
Trams145;14;9;42579;16:59;{2808.1955000013113,1135.889900000766,0.0}
Trams145;14;7;42580;16:59;{2774.94460455129,1095.9101807449765,0.0}
Trams181;18;5;42585;17:0;{5689.812200002372,2815.7713999990374,0.0}
Trams181;18;4;42586;17:0;{5739.764803540053,2830.2159521656795,0.0}
Trams182;18;12;42586;17:0;{4672.309900000691,2395.577299999073,0.0}
Trams182;18;11;42587;17:0;{4624.179771982149,2375.8925514936154,0.0}
Trams145;14;6;42587;17:0;{2567.6414284064917,825.1840510346515,0.0}
Trams142;14;21;42595;17:2;{7477.508000001311,3581.729000000283,0.0}
Trams145;14;3;42597;17:2;{2894.896500002593,514.0241999980062,0.0}
Trams142;14;22;42603;17:3;{7172.43200000003,3532.2607999984175,0.0}
Trams144;14;5;42607;17:4;{2567.6414284064917,825.1840510346515,0.0}
Trams149;14;2;42609;17:4;{5108.905971347362,2577.745680309252,0.0}
Trams142;14;24;42611;17:4;{6831.853600002825,3315.144899999723,0.0}
Trams1411;14;2;42611;17:4;{6831.853600002825,3315.144899999723,0.0}
Trams144;14;2;42617;17:5;{2894.896500002593,514.0241999980062,0.0}
Trams181;18;21;42627;17:7;{7477.508000001311,3581.729000000283,0.0}
Trams142;14;22;42627;17:7;{6138.21238208538,2940.1058384544613,0.0}
Trams143;14;18;42630;17:8;{7477.508000001311,3581.729000000283,0.0}
Trams145;14;5;42630;17:8;{3035.1652000024915,1729.7097000014037,0.0}
Trams182;18;8;42631;17:8;{2589.0274000018835,1538.5219000000507,0.0}
Trams141;14;22;42633;17:8;{5010.473492013262,2527.781076226536,0.0}
Trams142;14;21;42637;17:9;{5641.738919684285,2786.998382666919,0.0}
Trams142;14;22;42638;17:9;{5634.466500002891,2784.006800001487,0.0}
Trams143;14;19;42638;17:9;{7172.43200000003,3532.2607999984175,0.0}
Trams141;14;19;42640;17:9;{4672.309900000691,2395.577299999073,0.0}
Trams182;18;10;42641;17:9;{2110.2352000027895,1344.0613000001758,0.0}
Trams182;18;8;42642;17:10;{2064.0685709043055,1320.5282183098925,0.0}
Trams181;18;22;42643;17:10;{6831.853600002825,3315.144899999723,0.0}
Trams182;18;5;42649;17:11;{1740.6504000015557,1186.7970000002533,0.0}
Trams142;14;23;42650;17:11;{5058.904000002891,2546.714799998328,0.0}
Trams142;14;21;42651;17:11;{5010.473492013262,2527.781076226536,0.0}
Trams1411;14;1;42651;17:11;{5010.473492013262,2527.781076226536,0.0}
Trams145;14;4;42652;17:11;{4084.1569000035524,2161.088000001386,0.0}
Trams141;14;20;42654;17:12;{4031.8555000014603,2128.9623999986798,0.0}
Trams142;14;16;42658;17:12;{4672.309900000691,2395.577299999073,0.0}
Trams181;18;21;42659;17:12;{6138.21238208538,2940.1058384544613,0.0}
Trams143;14;20;42661;17:13;{6188.119100000709,2954.7112999986857,0.0}
Trams149;14;24;42664;17:13;{7477.508000001311,3581.729000000283,0.0}
Trams181;18;20;42670;17:14;{5634.466500002891,2784.006800001487,0.0}
Trams182;18;7;42670;17:14;{845.340600002557,806.1041999999434,0.0}
Trams183;18;4;42670;17:14;{4722.0763000026345,2426.624300001189,0.0}
Trams142;14;17;42672;17:15;{4031.8555000014603,2128.9623999986798,0.0}
Trams181;18;19;42682;17:16;{5058.904000002891,2546.714799998328,0.0}
Trams181;18;17;42683;17:16;{5010.473492013262,2527.781076226536,0.0}
Trams148;14;18;42684;17:17;{7477.508000001311,3581.729000000283,0.0}
Trams144;14;1;42686;17:17;{4722.0763000026345,2426.624300001189,0.0}
Trams145;14;3;42688;17:17;{5739.764803540053,2830.2159521656795,0.0}
Trams141;14;19;42689;17:17;{2808.1955000013113,1135.889900000766,0.0}
Trams181;18;16;42690;17:18;{4672.309900000691,2395.577299999073,0.0}
Trams141;14;16;42690;17:18;{2774.94460455129,1095.9101807449765,0.0}
Trams181;18;14;42691;17:18;{4624.179771982149,2375.8925514936154,0.0}
Trams182;18;8;42692;17:18;{1782.5218000002205,1208.6106000002474,0.0}
Trams148;14;19;42692;17:18;{7172.43200000003,3532.2607999984175,0.0}
Trams143;14;17;42693;17:18;{4672.309900000691,2395.577299999073,0.0}
Trams142;14;16;42694;17:18;{2992.747200001031,1703.0900999996811,0.0}
Trams141;14;11;42696;17:19;{2569.3393000029027,869.8653000015765,0.0}
Trams149;14;23;42696;17:19;{6138.21238208538,2940.1058384544613,0.0}
Trams141;14;7;42697;17:19;{2567.6414284064917,825.1840510346515,0.0}
Trams147;14;19;42699;17:19;{7477.508000001311,3581.729000000283,0.0}
Trams182;18;7;42700;17:19;{2149.2538000009954,1363.784799998626,0.0}
Trams181;18;15;42704;17:20;{4031.8555000014603,2128.9623999986798,0.0}
Trams141;14;8;42706;17:20;{2894.896500002593,514.0241999980062,0.0}
Trams141;14;7;42707;17:20;{2894.896500002593,514.0241999980062,0.0}
Trams142;14;14;42707;17:20;{2808.1955000013113,1135.889900000766,0.0}
Trams149;14;21;42707;17:20;{5634.466500002891,2784.006800001487,0.0}
Trams141;14;8;42708;17:21;{2892.683600001037,511.3241000007838,0.0}
Trams142;14;12;42708;17:21;{2774.94460455129,1095.9101807449765,0.0}
Trams142;14;11;42714;17:22;{2569.3393000029027,869.8653000015765,0.0}
Trams146;14;15;42714;17:22;{7477.508000001311,3581.729000000283,0.0}
Trams142;14;10;42715;17:22;{2567.6414284064917,825.1840510346515,0.0}
Trams182;18;8;42719;17:22;{3035.1652000024915,1729.7097000014037,0.0}
Trams141;14;9;42719;17:22;{2597.49450000003,904.9190000016242,0.0}
Trams149;14;20;42719;17:22;{5058.904000002891,2546.714799998328,0.0}
Trams142;14;11;42724;17:23;{2894.896500002593,514.0241999980062,0.0}
Trams142;14;4;42725;17:23;{2894.896500002593,514.0241999980062,0.0}
Trams148;14;18;42726;17:24;{5641.738919684285,2786.998382666919,0.0}
Trams141;14;10;42727;17:24;{2839.1857000030577,1180.8036000002176,0.0}
Trams149;14;16;42727;17:24;{4672.309900000691,2395.577299999073,0.0}
Trams149;14;15;42728;17:24;{4624.179771982149,2375.8925514936154,0.0}
Trams145;14;10;42729;17:24;{7477.508000001311,3581.729000000283,0.0}
Trams147;14;18;42731;17:24;{6138.21238208538,2940.1058384544613,0.0}
Trams183;18;19;42733;17:25;{7477.508000001311,3581.729000000283,0.0}
Trams181;18;11;42735;17:25;{2589.0274000018835,1538.5219000000507,0.0}
Trams148;14;16;42739;17:26;{5058.904000002891,2546.714799998328,0.0}
Trams148;14;14;42740;17:26;{5010.473492013262,2527.781076226536,0.0}
Trams183;18;20;42741;17:26;{7172.43200000003,3532.2607999984175,0.0}
Trams147;14;15;42741;17:26;{5641.738919684285,2786.998382666919,0.0}
Trams149;14;13;42741;17:26;{4031.8555000014603,2128.9623999986798,0.0}
Trams143;14;14;42742;17:26;{2808.1955000013113,1135.889900000766,0.0}
Trams147;14;14;42742;17:26;{5634.466500002891,2784.006800001487,0.0}
Trams143;14;11;42743;17:26;{2774.94460455129,1095.9101807449765,0.0}
Trams181;18;9;42745;17:27;{2110.2352000027895,1344.0613000001758,0.0}
Trams145;14;11;42745;17:27;{6831.853600002825,3315.144899999723,0.0}
Trams181;18;5;42746;17:27;{2064.0685709043055,1320.5282183098925,0.0}
Trams146;14;14;42746;17:27;{6138.21238208538,2940.1058384544613,0.0}
Trams148;14;10;42747;17:27;{4672.309900000691,2395.577299999073,0.0}
Trams148;14;9;42748;17:27;{4624.179771982149,2375.8925514936154,0.0}
Trams183;18;21;42749;17:27;{6831.853600002825,3315.144899999723,0.0}
Trams143;14;9;42749;17:27;{2569.3393000029027,869.8653000015765,0.0}
Trams144;14;15;42749;17:27;{7477.508000001311,3581.729000000283,0.0}
Trams143;14;8;42750;17:28;{2567.6414284064917,825.1840510346515,0.0}
Trams144;14;18;42750;17:28;{7446.12100000307,3545.9720000009984,0.0}
Trams181;18;4;42753;17:28;{1740.6504000015557,1186.7970000002533,0.0}
Trams182;18;7;42755;17:28;{4722.0763000026345,2426.624300001189,0.0}
Trams183;18;22;42756;17:29;{6563.806600000709,3123.2601999994367,0.0}
Trams146;14;13;42756;17:29;{5641.738919684285,2786.998382666919,0.0}
Trams146;14;14;42757;17:29;{5634.466500002891,2784.006800001487,0.0}
Trams143;14;10;42759;17:29;{2894.896500002593,514.0241999980062,0.0}
Trams143;14;5;42760;17:29;{2894.896500002593,514.0241999980062,0.0}
Trams147;14;11;42762;17:30;{4672.309900000691,2395.577299999073,0.0}
Trams147;14;9;42763;17:30;{4624.179771982149,2375.8925514936154,0.0}
Trams149;14;15;42763;17:30;{2992.747200001031,1703.0900999996811,0.0}
Trams144;14;19;42765;17:30;{6831.853600002825,3315.144899999723,0.0}
Trams146;14;13;42769;17:31;{5058.904000002891,2546.714799998328,0.0}
Trams146;14;12;42770;17:31;{5010.473492013262,2527.781076226536,0.0}
Trams145;14;10;42772;17:31;{5634.466500002891,2784.006800001487,0.0}
Trams181;18;5;42774;17:32;{845.340600002557,806.1041999999434,0.0}
Trams141;14;9;42775;17:32;{4707.823850244834,2420.7529164061234,0.0}
Trams182;18;6;42776;17:32;{5689.812200002372,2815.7713999990374,0.0}
Trams183;18;23;42776;17:32;{5634.466500002891,2784.006800001487,0.0}
Trams141;14;8;42776;17:32;{4722.0763000026345,2426.624300001189,0.0}
Trams149;14;11;42776;17:32;{2808.1955000013113,1135.889900000766,0.0}
Trams146;14;9;42777;17:32;{4672.309900000691,2395.577299999073,0.0}
Trams142;14;5;42780;17:33;{4084.1569000035524,2161.088000001386,0.0}
Trams143;14;6;42780;17:33;{2839.1857000030577,1180.8036000002176,0.0}
Trams148;14;8;42783;17:33;{2992.747200001031,1703.0900999996811,0.0}
Trams149;14;10;42783;17:33;{2569.3393000029027,869.8653000015765,0.0}
Trams181;18;6;42784;17:33;{1241.924200002104,980.4126999992877,0.0}
Trams141;14;7;42784;17:33;{5108.905971347362,2577.745680309252,0.0}
Trams145;14;9;42784;17:33;{5058.904000002891,2546.714799998328,0.0}
Trams149;14;5;42784;17:33;{2567.6414284064917,825.1840510346515,0.0}
Trams182;18;5;42787;17:34;{6221.943900000304,2968.579499999061,0.0}
Trams183;18;21;42789;17:34;{5010.473492013262,2527.781076226536,0.0}
Trams144;14;18;42792;17:35;{5634.466500002891,2784.006800001487,0.0}
Trams142;14;4;42794;17:35;{4722.0763000026345,2426.624300001189,0.0}
Trams143;14;5;42794;17:35;{3084.0353342962862,1747.4296273253601,0.0}
Trams149;14;2;42794;17:35;{2894.896500002593,514.0241999980062,0.0}
Trams181;18;8;42796;17:35;{1782.5218000002205,1208.6106000002474,0.0}
Trams148;14;6;42796;17:35;{2808.1955000013113,1135.889900000766,0.0}
Trams141;14;6;42797;17:35;{5689.812200002372,2815.7713999990374,0.0}
Trams148;14;4;42803;17:36;{2569.3393000029027,869.8653000015765,0.0}
Trams144;14;19;42804;17:37;{5058.904000002891,2546.714799998328,0.0}
Trams148;14;3;42804;17:37;{2567.6414284064917,825.1840510346515,0.0}
Trams144;14;17;42805;17:37;{5010.473492013262,2527.781076226536,0.0}
Trams183;18;22;42810;17:38;{4031.8555000014603,2128.9623999986798,0.0}
Trams147;14;7;42811;17:38;{2808.1955000013113,1135.889900000766,0.0}
Trams144;14;15;42812;17:38;{4672.309900000691,2395.577299999073,0.0}
Trams147;14;6;42812;17:38;{2774.94460455129,1095.9101807449765,0.0}
Trams144;14;13;42813;17:38;{4624.179771982149,2375.8925514936154,0.0}
Trams146;14;10;42813;17:38;{2992.747200001031,1703.0900999996811,0.0}
Trams148;14;0;42814;17:38;{2894.896500002593,514.0241999980062,0.0}
Trams182;18;24;42818;17:39;{7477.508000001311,3581.729000000283,0.0}
Trams147;14;5;42818;17:39;{2569.3393000029027,869.8653000015765,0.0}
Trams147;14;4;42819;17:39;{2567.6414284064917,825.1840510346515,0.0}
Trams146;14;9;42827;17:40;{2774.94460455129,1095.9101807449765,0.0}
Trams147;14;3;42829;17:41;{2894.896500002593,514.0241999980062,0.0}
Trams146;14;7;42833;17:41;{2569.3393000029027,869.8653000015765,0.0}
Trams146;14;5;42834;17:42;{2567.6414284064917,825.1840510346515,0.0}
Trams141;14;24;42839;17:42;{7477.508000001311,3581.729000000283,0.0}
Trams183;18;19;42841;17:43;{2589.0274000018835,1538.5219000000507,0.0}
Trams146;14;2;42844;17:43;{2894.896500002593,514.0241999980062,0.0}
Trams144;14;12;42848;17:44;{2992.747200001031,1703.0900999996811,0.0}
Trams145;14;5;42848;17:44;{2569.3393000029027,869.8653000015765,0.0}
Trams145;14;4;42849;17:44;{2567.6414284064917,825.1840510346515,0.0}
Trams182;18;23;42850;17:44;{6138.21238208538,2940.1058384544613,0.0}
Trams183;18;16;42851;17:44;{2110.2352000027895,1344.0613000001758,0.0}
Trams183;18;9;42852;17:45;{2064.0685709043055,1320.5282183098925,0.0}
Trams142;14;24;42857;17:45;{7477.508000001311,3581.729000000283,0.0}
Trams1411;14;22;42857;17:45;{7477.508000001311,3581.729000000283,0.0}
Trams1411;14;24;42858;17:46;{7446.12100000307,3545.9720000009984,0.0}
Trams183;18;5;42859;17:46;{1740.6504000015557,1186.7970000002533,0.0}
Trams145;14;3;42859;17:46;{2894.896500002593,514.0241999980062,0.0}
Trams182;18;22;42860;17:46;{5641.738919684285,2786.998382666919,0.0}
Trams182;18;19;42861;17:46;{5634.466500002891,2784.006800001487,0.0}
Trams144;14;11;42862;17:46;{2774.94460455129,1095.9101807449765,0.0}
Trams181;18;6;42867;17:47;{5108.905971347362,2577.745680309252,0.0}
Trams144;14;9;42868;17:47;{2569.3393000029027,869.8653000015765,0.0}
Trams144;14;6;42869;17:47;{2567.6414284064917,825.1840510346515,0.0}
Trams141;14;23;42871;17:48;{6138.21238208538,2940.1058384544613,0.0}
Trams182;18;16;42873;17:48;{5058.904000002891,2546.714799998328,0.0}
Trams144;14;2;42879;17:49;{2894.896500002593,514.0241999980062,0.0}
Trams183;18;11;42880;17:49;{845.340600002557,806.1041999999434,0.0}
Trams181;18;4;42881;17:49;{5739.764803540053,2830.2159521656795,0.0}
Trams183;18;12;42882;17:50;{902.5305000022054,834.7037000004202,0.0}
Trams147;14;4;42884;17:50;{4084.1569000035524,2161.088000001386,0.0}
Trams143;14;24;42892;17:51;{7477.508000001311,3581.729000000283,0.0}
Trams1410;14;10;42892;17:51;{7477.508000001311,3581.729000000283,0.0}
Trams141;14;22;42894;17:52;{5058.904000002891,2546.714799998328,0.0}
Trams182;18;14;42895;17:52;{4031.8555000014603,2128.9623999986798,0.0}
Trams142;14;22;42900;17:53;{5634.466500002891,2784.006800001487,0.0}
Trams1411;14;23;42900;17:53;{5634.466500002891,2784.006800001487,0.0}
Trams183;18;14;42902;17:53;{1782.5218000002205,1208.6106000002474,0.0}
Trams147;14;3;42907;17:54;{5123.508700001985,2583.745899999514,0.0}
Trams1410;14;12;42908;17:54;{6831.853600002825,3315.144899999723,0.0}
Trams142;14;23;42912;17:55;{5058.904000002891,2546.714799998328,0.0}
Trams144;14;3;42912;17:55;{3035.1652000024915,1729.7097000014037,0.0}
Trams1411;14;22;42912;17:55;{5058.904000002891,2546.714799998328,0.0}
Trams1411;14;18;42913;17:55;{5010.473492013262,2527.781076226536,0.0}
Trams141;14;23;42916;17:55;{4031.8555000014603,2128.9623999986798,0.0}
Trams182;18;15;42917;17:55;{2992.747200001031,1703.0900999996811,0.0}
Trams1411;14;9;42920;17:56;{4672.309900000691,2395.577299999073,0.0}
Trams1411;14;7;42921;17:56;{4624.179771982149,2375.8925514936154,0.0}
Trams181;18;24;42922;17:56;{7477.508000001311,3581.729000000283,0.0}
Trams1410;14;13;42923;17:56;{6188.119100000709,2954.7112999986857,0.0}
Trams182;18;13;42926;17:57;{2589.0274000018835,1538.5219000000507,0.0}
Trams149;14;24;42926;17:57;{7477.508000001311,3581.729000000283,0.0}
Trams183;18;13;42929;17:57;{3035.1652000024915,1729.7097000014037,0.0}
Trams142;14;22;42934;17:58;{4031.8555000014603,2128.9623999986798,0.0}
Trams143;14;22;42934;17:58;{5641.738919684285,2786.998382666919,0.0}
Trams182;18;11;42936;17:59;{2110.2352000027895,1344.0613000001758,0.0}
Trams182;18;9;42937;17:59;{2064.0685709043055,1320.5282183098925,0.0}
Trams148;14;24;42946;18:0;{7477.508000001311,3581.729000000283,0.0}
Trams1410;14;12;42948;18:1;{5010.473492013262,2527.781076226536,0.0}
Trams145;14;2;42949;18:1;{5689.812200002372,2815.7713999990374,0.0}
Trams183;18;11;42951;18:1;{4084.1569000035524,2161.088000001386,0.0}
Trams141;14;15;42951;18:1;{2808.1955000013113,1135.889900000766,0.0}
Trams141;14;12;42952;18:1;{2774.94460455129,1095.9101807449765,0.0}
Trams181;18;22;42954;18:2;{6138.21238208538,2940.1058384544613,0.0}
Trams182;18;8;42955;18:2;{1213.7785956119094,964.194963392883,0.0}
Trams1410;14;10;42955;18:2;{4672.309900000691,2395.577299999073,0.0}
Trams143;14;21;42956;18:2;{4624.179771982149,2375.8925514936154,0.0}
Trams1410;14;8;42956;18:2;{4624.179771982149,2375.8925514936154,0.0}
Trams144;14;2;42957;18:2;{5123.508700001985,2583.745899999514,0.0}
Trams141;14;8;42958;18:2;{2569.3393000029027,869.8653000015765,0.0}
Trams147;14;23;42961;18:3;{7477.508000001311,3581.729000000283,0.0}
Trams181;18;21;42964;18:3;{5641.738919684285,2786.998382666919,0.0}
Trams181;18;20;42965;18:3;{5634.466500002891,2784.006800001487,0.0}
Trams182;18;10;42965;18:3;{845.340600002557,806.1041999999434,0.0}
Trams183;18;9;42965;18:3;{4722.0763000026345,2426.624300001189,0.0}
Trams141;14;9;42969;18:4;{2894.896500002593,514.0241999980062,0.0}
Trams143;14;20;42969;18:4;{4031.8555000014603,2128.9623999986798,0.0}
Trams142;14;20;42970;18:4;{2774.94460455129,1095.9101807449765,0.0}
Trams183;18;7;42973;18:5;{5108.905971347362,2577.745680309252,0.0}
Trams142;14;18;42976;18:5;{2569.3393000029027,869.8653000015765,0.0}
Trams146;14;8;42976;18:5;{7477.508000001311,3581.729000000283,0.0}
Trams181;18;16;42977;18:5;{5058.904000002891,2546.714799998328,0.0}
Trams142;14;16;42977;18:5;{2567.6414284064917,825.1840510346515,0.0}
Trams1411;14;6;42977;18:5;{2567.6414284064917,825.1840510346515,0.0}
Trams148;14;23;42978;18:6;{6138.21238208538,2940.1058384544613,0.0}
Trams149;14;22;42981;18:6;{5058.904000002891,2546.714799998328,0.0}
Trams147;14;24;42984;18:7;{6563.806600000709,3123.2601999994367,0.0}
Trams182;18;11;42987;18:7;{1782.5218000002205,1208.6106000002474,0.0}
Trams183;18;4;42987;18:7;{5739.764803540053,2830.2159521656795,0.0}
Trams142;14;7;42987;18:7;{2894.896500002593,514.0241999980062,0.0}
Trams1411;14;1;42987;18:7;{2894.896500002593,514.0241999980062,0.0}
Trams148;14;21;42988;18:7;{5641.738919684285,2786.998382666919,0.0}
Trams145;14;8;42991;18:8;{7477.508000001311,3581.729000000283,0.0}
Trams182;18;10;42996;18:9;{2197.307743831217,1383.6548398164498,0.0}
Trams181;18;15;42999;18:9;{4031.8555000014603,2128.9623999986798,0.0}
Trams148;14;20;43001;18:9;{5058.904000002891,2546.714799998328,0.0}
Trams141;14;10;43002;18:10;{3035.1652000024915,1729.7097000014037,0.0}
Trams148;14;13;43002;18:10;{5010.473492013262,2527.781076226536,0.0}
Trams143;14;16;43004;18:10;{2808.1955000013113,1135.889900000766,0.0}
Trams147;14;23;43004;18:10;{5634.466500002891,2784.006800001487,0.0}
Trams182;18;11;43005;18:10;{2627.1466000005603,1561.507400000468,0.0}
Trams143;14;12;43005;18:10;{2774.94460455129,1095.9101807449765,0.0}
Trams148;14;9;43009;18:11;{4672.309900000691,2395.577299999073,0.0}
Trams148;14;8;43010;18:11;{4624.179771982149,2375.8925514936154,0.0}
Trams143;14;9;43011;18:11;{2569.3393000029027,869.8653000015765,0.0}
Trams144;14;6;43011;18:11;{7477.508000001311,3581.729000000283,0.0}
Trams143;14;8;43012;18:11;{2567.6414284064917,825.1840510346515,0.0}
Trams1410;14;7;43012;18:11;{2567.6414284064917,825.1840510346515,0.0}
Trams182;18;12;43014;18:12;{3035.1652000024915,1729.7097000014037,0.0}
Trams147;14;22;43016;18:12;{5058.904000002891,2546.714799998328,0.0}
Trams147;14;21;43017;18:12;{5010.473492013262,2527.781076226536,0.0}
Trams143;14;10;43021;18:13;{2894.896500002593,514.0241999980062,0.0}
Trams143;14;8;43022;18:13;{2894.896500002593,514.0241999980062,0.0}
Trams1410;14;1;43022;18:13;{2894.896500002593,514.0241999980062,0.0}
Trams148;14;7;43023;18:13;{4031.8555000014603,2128.9623999986798,0.0}
Trams141;14;11;43024;18:13;{4084.1569000035524,2161.088000001386,0.0}
Trams147;14;17;43024;18:13;{4672.309900000691,2395.577299999073,0.0}
Trams149;14;23;43025;18:13;{2992.747200001031,1703.0900999996811,0.0}
Trams144;14;7;43027;18:14;{6831.853600002825,3315.144899999723,0.0}
Trams183;18;24;43028;18:14;{7477.508000001311,3581.729000000283,0.0}
Trams181;18;11;43030;18:14;{2589.0274000018835,1538.5219000000507,0.0}
Trams147;14;16;43038;18:16;{4031.8555000014603,2128.9623999986798,0.0}
Trams149;14;20;43038;18:16;{2808.1955000013113,1135.889900000766,0.0}
Trams146;14;6;43039;18:16;{4672.309900000691,2395.577299999073,0.0}
Trams149;14;15;43039;18:16;{2774.94460455129,1095.9101807449765,0.0}
Trams181;18;8;43040;18:16;{2110.2352000027895,1344.0613000001758,0.0}
Trams146;14;5;43040;18:16;{4624.179771982149,2375.8925514936154,0.0}
Trams149;14;12;43045;18:17;{2569.3393000029027,869.8653000015765,0.0}
Trams141;14;10;43046;18:17;{5108.905971347362,2577.745680309252,0.0}
Trams145;14;7;43046;18:17;{5058.904000002891,2546.714799998328,0.0}
Trams149;14;8;43046;18:17;{2567.6414284064917,825.1840510346515,0.0}
Trams182;18;11;43050;18:18;{4722.0763000026345,2426.624300001189,0.0}
Trams145;14;6;43054;18:18;{4672.309900000691,2395.577299999073,0.0}
Trams149;14;2;43056;18:19;{2894.896500002593,514.0241999980062,0.0}
Trams182;18;10;43058;18:19;{5108.905971347362,2577.745680309252,0.0}
Trams148;14;4;43058;18:19;{2808.1955000013113,1135.889900000766,0.0}
Trams182;18;9;43059;18:19;{5123.508700001985,2583.745899999514,0.0}
Trams148;14;1;43059;18:19;{2774.94460455129,1095.9101807449765,0.0}
Trams183;18;23;43060;18:19;{6138.21238208538,2940.1058384544613,0.0}
Trams141;14;9;43060;18:19;{5739.764803540053,2830.2159521656795,0.0}
Trams144;14;6;43066;18:20;{5058.904000002891,2546.714799998328,0.0}
Trams181;18;9;43069;18:21;{845.340600002557,806.1041999999434,0.0}
Trams182;18;8;43072;18:21;{5739.764803540053,2830.2159521656795,0.0}
Trams147;14;15;43074;18:22;{2774.94460455129,1095.9101807449765,0.0}
Trams144;14;5;43075;18:22;{4624.179771982149,2375.8925514936154,0.0}
Trams148;14;0;43076;18:22;{2894.896500002593,514.0241999980062,0.0}
Trams147;14;14;43080;18:23;{2569.3393000029027,869.8653000015765,0.0}
Trams182;18;7;43082;18:23;{6221.943900000304,2968.579499999061,0.0}
Trams183;18;22;43083;18:23;{5058.904000002891,2546.714799998328,0.0}
Trams183;18;21;43084;18:23;{5010.473492013262,2527.781076226536,0.0}
Trams146;14;4;43088;18:24;{2808.1955000013113,1135.889900000766,0.0}
Trams145;14;7;43090;18:24;{2992.747200001031,1703.0900999996811,0.0}
Trams147;14;3;43091;18:24;{2894.896500002593,514.0241999980062,0.0}
Trams146;14;3;43095;18:25;{2569.3393000029027,869.8653000015765,0.0}
Trams181;18;10;43099;18:26;{2149.2538000009954,1363.784799998626,0.0}
Trams141;14;24;43101;18:26;{7477.508000001311,3581.729000000283,0.0}
Trams145;14;6;43103;18:26;{2808.1955000013113,1135.889900000766,0.0}
Trams146;14;2;43106;18:27;{2894.896500002593,514.0241999980062,0.0}
Trams144;14;6;43110;18:28;{2992.747200001031,1703.0900999996811,0.0}
Trams145;14;5;43110;18:28;{2569.3393000029027,869.8653000015765,0.0}
Trams145;14;4;43111;18:28;{2567.6414284064917,825.1840510346515,0.0}
Trams182;18;24;43113;18:28;{7477.508000001311,3581.729000000283,0.0}
Trams142;14;24;43119;18:29;{7477.508000001311,3581.729000000283,0.0}
Trams1411;14;2;43119;18:29;{7477.508000001311,3581.729000000283,0.0}
Trams145;14;2;43121;18:29;{2894.896500002593,514.0241999980062,0.0}
Trams144;14;5;43123;18:30;{2808.1955000013113,1135.889900000766,0.0}
Trams144;14;4;43130;18:31;{2569.3393000029027,869.8653000015765,0.0}
Trams144;14;3;43131;18:31;{2567.6414284064917,825.1840510346515,0.0}
Trams141;14;22;43133;18:31;{6138.21238208538,2940.1058384544613,0.0}
Trams1411;14;4;43135;18:32;{6831.853600002825,3315.144899999723,0.0}
Trams183;18;17;43136;18:32;{2589.0274000018835,1538.5219000000507,0.0}
Trams181;18;9;43140;18:33;{4084.1569000035524,2161.088000001386,0.0}
Trams144;14;2;43141;18:33;{2894.896500002593,514.0241999980062,0.0}
Trams183;18;14;43146;18:34;{2110.2352000027895,1344.0613000001758,0.0}
Trams183;18;6;43147;18:34;{2064.0685709043055,1320.5282183098925,0.0}
Trams1411;14;6;43150;18:34;{6188.119100000709,2954.7112999986857,0.0}
Trams181;18;8;43154;18:35;{4722.0763000026345,2426.624300001189,0.0}
Trams183;18;3;43154;18:35;{1740.6504000015557,1186.7970000002533,0.0}
Trams143;14;23;43154;18:35;{7477.508000001311,3581.729000000283,0.0}
Trams182;18;23;43155;18:35;{5641.738919684285,2786.998382666919,0.0}
Trams182;18;24;43156;18:35;{5634.466500002891,2784.006800001487,0.0}
Trams141;14;21;43156;18:35;{5058.904000002891,2546.714799998328,0.0}
Trams181;18;7;43162;18:36;{5108.905971347362,2577.745680309252,0.0}
Trams141;14;22;43164;18:37;{4672.309900000691,2395.577299999073,0.0}
Trams182;18;22;43169;18:37;{5010.473492013262,2527.781076226536,0.0}
Trams143;14;24;43170;18:38;{6831.853600002825,3315.144899999723,0.0}
Trams183;18;6;43175;18:38;{845.340600002557,806.1041999999434,0.0}
Trams142;14;23;43175;18:38;{5010.473492013262,2527.781076226536,0.0}
Trams1411;14;5;43175;18:38;{5010.473492013262,2527.781076226536,0.0}
Trams181;18;6;43176;18:39;{5739.764803540053,2830.2159521656795,0.0}
Trams182;18;18;43176;18:39;{4672.309900000691,2395.577299999073,0.0}
Trams141;14;21;43177;18:39;{4048.297289360261,2135.7927898531034,0.0}
Trams1410;14;2;43177;18:39;{6563.806600000709,3123.2601999994367,0.0}
Trams141;14;20;43178;18:39;{4031.8555000014603,2128.9623999986798,0.0}
Trams147;14;2;43182;18:40;{5739.764803540053,2830.2159521656795,0.0}
Trams142;14;22;43183;18:40;{4624.179771982149,2375.8925514936154,0.0}
Trams181;18;5;43186;18:40;{6221.943900000304,2968.579499999061,0.0}
Trams143;14;22;43186;18:40;{6138.21238208538,2940.1058384544613,0.0}
Trams149;14;13;43188;18:41;{7477.508000001311,3581.729000000283,0.0}
Trams143;14;20;43196;18:42;{5641.738919684285,2786.998382666919,0.0}
Trams149;14;14;43196;18:42;{7172.43200000003,3532.2607999984175,0.0}
Trams183;18;5;43197;18:42;{1782.5218000002205,1208.6106000002474,0.0}
Trams143;14;18;43197;18:42;{5634.466500002891,2784.006800001487,0.0}
Trams141;14;21;43200;18:43;{2992.747200001031,1703.0900999996811,0.0}
Trams183;18;6;43205;18:43;{2149.2538000009954,1363.784799998626,0.0}
Trams148;14;7;43208;18:44;{7477.508000001311,3581.729000000283,0.0}
Trams143;14;17;43209;18:44;{5058.904000002891,2546.714799998328,0.0}
Trams143;14;14;43210;18:44;{5010.473492013262,2527.781076226536,0.0}
Trams141;14;17;43213;18:45;{2808.1955000013113,1135.889900000766,0.0}
Trams141;14;15;43214;18:45;{2774.94460455129,1095.9101807449765,0.0}
Trams181;18;22;43217;18:45;{7477.508000001311,3581.729000000283,0.0}
Trams181;18;24;43218;18:46;{7446.12100000307,3545.9720000009984,0.0}
Trams142;14;21;43218;18:46;{2992.747200001031,1703.0900999996811,0.0}
Trams141;14;14;43220;18:46;{2569.3393000029027,869.8653000015765,0.0}
Trams149;14;13;43220;18:46;{6138.21238208538,2940.1058384544613,0.0}
Trams182;18;17;43221;18:46;{2589.0274000018835,1538.5219000000507,0.0}
Trams141;14;10;43221;18:46;{2567.6414284064917,825.1840510346515,0.0}
Trams147;14;3;43223;18:46;{7477.508000001311,3581.729000000283,0.0}
Trams183;18;7;43224;18:47;{3035.1652000024915,1729.7097000014037,0.0}
Trams147;14;4;43224;18:47;{7446.12100000307,3545.9720000009984,0.0}
Trams182;18;14;43231;18:48;{2110.2352000027895,1344.0613000001758,0.0}
Trams141;14;9;43231;18:48;{2894.896500002593,514.0241999980062,0.0}
Trams142;14;20;43231;18:48;{2808.1955000013113,1135.889900000766,0.0}
Trams149;14;12;43231;18:48;{5634.466500002891,2784.006800001487,0.0}
Trams1411;14;4;43231;18:48;{2808.1955000013113,1135.889900000766,0.0}
Trams182;18;11;43232;18:48;{2064.0685709043055,1320.5282183098925,0.0}
Trams142;14;18;43238;18:49;{2569.3393000029027,869.8653000015765,0.0}
Trams146;14;6;43238;18:49;{7477.508000001311,3581.729000000283,0.0}
Trams182;18;10;43239;18:49;{1740.6504000015557,1186.7970000002533,0.0}
Trams142;14;12;43239;18:49;{2567.6414284064917,825.1840510346515,0.0}
Trams149;14;10;43244;18:50;{5010.473492013262,2527.781076226536,0.0}
Trams142;14;7;43249;18:51;{2894.896500002593,514.0241999980062,0.0}
Trams1411;14;1;43249;18:51;{2894.896500002593,514.0241999980062,0.0}
Trams182;18;9;43250;18:51;{1213.7785956119094,964.194963392883,0.0}
Trams149;14;11;43251;18:51;{4672.309900000691,2395.577299999073,0.0}
Trams149;14;10;43252;18:51;{4624.179771982149,2375.8925514936154,0.0}
Trams145;14;8;43253;18:51;{7477.508000001311,3581.729000000283,0.0}
Trams145;14;11;43254;18:52;{7446.12100000307,3545.9720000009984,0.0}
Trams182;18;10;43260;18:53;{845.340600002557,806.1041999999434,0.0}
Trams183;18;8;43260;18:53;{4722.0763000026345,2426.624300001189,0.0}
Trams142;14;8;43261;18:53;{2597.49450000003,904.9190000016242,0.0}
Trams149;14;11;43265;18:53;{4031.8555000014603,2128.9623999986798,0.0}
Trams143;14;12;43266;18:54;{2808.1955000013113,1135.889900000766,0.0}
Trams1410;14;1;43267;18:54;{2774.94460455129,1095.9101807449765,0.0}
Trams183;18;7;43268;18:54;{5108.905971347362,2577.745680309252,0.0}
Trams183;18;6;43269;18:54;{5123.508700001985,2583.745899999514,0.0}
Trams182;18;11;43270;18:54;{1241.924200002104,980.4126999992877,0.0}
Trams146;14;5;43270;18:54;{6138.21238208538,2940.1058384544613,0.0}
Trams148;14;5;43271;18:54;{4672.309900000691,2395.577299999073,0.0}
Trams144;14;11;43273;18:55;{7477.508000001311,3581.729000000283,0.0}
Trams143;14;11;43274;18:55;{2567.6414284064917,825.1840510346515,0.0}
Trams181;18;23;43280;18:56;{4672.309900000691,2395.577299999073,0.0}
Trams183;18;5;43281;18:56;{5689.812200002372,2815.7713999990374,0.0}
Trams144;14;13;43281;18:56;{7172.43200000003,3532.2607999984175,0.0}
Trams182;18;10;43282;18:56;{1782.5218000002205,1208.6106000002474,0.0}
Trams183;18;4;43282;18:56;{5739.764803540053,2830.2159521656795,0.0}
Trams143;14;13;43283;18:56;{2894.896500002593,514.0241999980062,0.0}
Trams143;14;12;43284;18:57;{2894.896500002593,514.0241999980062,0.0}
Trams145;14;12;43284;18:57;{6188.119100000709,2954.7112999986857,0.0}
Trams148;14;6;43285;18:57;{4031.8555000014603,2128.9623999986798,0.0}
Trams147;14;3;43287;18:57;{4624.179771982149,2375.8925514936154,0.0}
Trams182;18;12;43290;18:58;{2149.2538000009954,1363.784799998626,0.0}
Trams183;18;3;43292;18:58;{6221.943900000304,2968.579499999061,0.0}
Trams146;14;4;43293;18:58;{5058.904000002891,2546.714799998328,0.0}
Trams181;18;24;43294;18:58;{4031.8555000014603,2128.9623999986798,0.0}
Trams145;14;11;43295;18:58;{5641.738919684285,2786.998382666919,0.0}
Trams182;18;13;43300;18:59;{2627.1466000005603,1561.507400000468,0.0}
Trams149;14;10;43300;18:59;{2808.1955000013113,1135.889900000766,0.0}
Trams149;14;8;43301;18:59;{2774.94460455129,1095.9101807449765,0.0}
Trams146;14;3;43302;19:0;{4624.179771982149,2375.8925514936154,0.0}
Trams144;14;12;43305;19:0;{6138.21238208538,2940.1058384544613,0.0}
Trams149;14;6;43307;19:0;{2569.3393000029027,869.8653000015765,0.0}
Trams149;14;4;43308;19:1;{2567.6414284064917,825.1840510346515,0.0}
Trams182;18;12;43309;19:1;{3035.1652000024915,1729.7097000014037,0.0}
Trams144;14;10;43315;19:2;{5641.738919684285,2786.998382666919,0.0}
Trams145;14;10;43316;19:2;{4672.309900000691,2395.577299999073,0.0}
Trams149;14;5;43317;19:2;{2894.896500002593,514.0241999980062,0.0}
Trams149;14;4;43318;19:2;{2894.896500002593,514.0241999980062,0.0}
Trams148;14;4;43320;19:3;{2808.1955000013113,1135.889900000766,0.0}
Trams141;14;10;43321;19:3;{5689.812200002372,2815.7713999990374,0.0}
Trams148;14;3;43321;19:3;{2774.94460455129,1095.9101807449765,0.0}
Trams183;18;9;43323;19:3;{7477.508000001311,3581.729000000283,0.0}
Trams181;18;22;43325;19:3;{2589.0274000018835,1538.5219000000507,0.0}
Trams148;14;2;43327;19:4;{2569.3393000029027,869.8653000015765,0.0}
Trams144;14;8;43329;19:4;{5010.473492013262,2527.781076226536,0.0}
Trams145;14;8;43330;19:4;{4031.8555000014603,2128.9623999986798,0.0}
Trams183;18;11;43331;19:4;{7172.43200000003,3532.2607999984175,0.0}
Trams181;18;18;43335;19:5;{2110.2352000027895,1344.0613000001758,0.0}
Trams181;18;12;43336;19:5;{2064.0685709043055,1320.5282183098925,0.0}
Trams144;14;6;43336;19:5;{4672.309900000691,2395.577299999073,0.0}
Trams148;14;0;43338;19:6;{2894.896500002593,514.0241999980062,0.0}
Trams142;14;7;43339;19:6;{5689.812200002372,2815.7713999990374,0.0}
Trams181;18;5;43343;19:6;{1740.6504000015557,1186.7970000002533,0.0}
Trams147;14;2;43343;19:6;{2567.6414284064917,825.1840510346515,0.0}
Trams182;18;10;43345;19:7;{4722.0763000026345,2426.624300001189,0.0}
Trams183;18;12;43346;19:7;{6563.806600000709,3123.2601999994367,0.0}
Trams182;18;9;43353;19:8;{5108.905971347362,2577.745680309252,0.0}
Trams182;18;8;43354;19:8;{5123.508700001985,2583.745899999514,0.0}
Trams183;18;14;43354;19:8;{6188.119100000709,2954.7112999986857,0.0}
Trams183;18;13;43355;19:8;{6138.21238208538,2940.1058384544613,0.0}
Trams146;14;2;43358;19:9;{2567.6414284064917,825.1840510346515,0.0}
Trams141;14;14;43363;19:10;{7477.508000001311,3581.729000000283,0.0}
Trams183;18;12;43365;19:10;{5641.738919684285,2786.998382666919,0.0}
Trams145;14;6;43365;19:10;{2808.1955000013113,1135.889900000766,0.0}
Trams145;14;5;43366;19:10;{2774.94460455129,1095.9101807449765,0.0}
Trams182;18;7;43367;19:10;{5739.764803540053,2830.2159521656795,0.0}
Trams145;14;4;43373;19:11;{2567.6414284064917,825.1840510346515,0.0}
Trams183;18;11;43378;19:12;{5058.904000002891,2546.714799998328,0.0}
Trams145;14;2;43383;19:13;{2894.896500002593,514.0241999980062,0.0}
Trams183;18;10;43386;19:14;{4672.309900000691,2395.577299999073,0.0}
Trams144;14;5;43386;19:14;{2774.94460455129,1095.9101807449765,0.0}
Trams144;14;4;43403;19:16;{2894.896500002593,514.0241999980062,0.0}
Trams183;18;11;43422;19:20;{2992.747200001031,1703.0900999996811,0.0}
Trams183;18;9;43431;19:21;{2589.0274000018835,1538.5219000000507,0.0}
Trams183;18;8;43441;19:23;{2110.2352000027895,1344.0613000001758,0.0}
Trams183;18;4;43442;19:23;{2064.0685709043055,1320.5282183098925,0.0}
Trams183;18;3;43449;19:24;{1740.6504000015557,1186.7970000002533,0.0}
Trams141;14;13;43475;19:28;{2808.1955000013113,1135.889900000766,0.0}
Trams141;14;12;43482;19:30;{2569.3393000029027,869.8653000015765,0.0}
Trams141;14;11;43483;19:30;{2567.6414284064917,825.1840510346515,0.0}
Trams141;14;12;43492;19:31;{2894.896500002593,514.0241999980062,0.0}
Trams141;14;11;43493;19:31;{2894.896500002593,514.0241999980062,0.0}
Trams145;14;3;43578;19:46;{4672.309900000691,2395.577299999073,0.0}
Trams145;14;2;43592;19:48;{4031.8555000014603,2128.9623999986798,0.0}
