tramName;tramLine;nPassengers;cycleNo;time;location
Trams144;14;9;71168;6:1;{2839.1857000030577,1180.8036000002176,0.0}
Trams143;14;6;71175;6:2;{2894.896500002593,514.0241999980062,0.0}
Trams181;18;11;71179;6:3;{4722.0763000026345,2426.624300001189,0.0}
Trams146;14;10;71180;6:3;{5689.812200002372,2815.7713999990374,0.0}
Trams144;14;10;71181;6:3;{3035.1652000024915,1729.7097000014037,0.0}
Trams145;14;10;71186;6:4;{4722.0763000026345,2426.624300001189,0.0}
Trams143;14;7;71187;6:4;{2597.49450000003,904.9190000016242,0.0}
Trams146;14;11;71191;6:5;{6221.943900000304,2968.579499999061,0.0}
Trams143;14;9;71195;6:6;{2839.1857000030577,1180.8036000002176,0.0}
Trams145;14;12;71195;6:6;{5123.508700001985,2583.745899999514,0.0}
Trams185;18;9;71196;6:6;{2149.2538000009954,1363.784799998626,0.0}
Trams142;14;9;71197;6:6;{6188.119100000709,2954.7112999986857,0.0}
Trams181;18;12;71200;6:6;{5689.812200002372,2815.7713999990374,0.0}
Trams185;18;12;71206;6:7;{2627.1466000005603,1561.507400000468,0.0}
Trams181;18;13;71211;6:8;{6221.943900000304,2968.579499999061,0.0}
Trams144;14;12;71217;6:9;{4722.0763000026345,2426.624300001189,0.0}
Trams146;14;9;71221;6:10;{7477.508000001311,3581.729000000283,0.0}
Trams183;18;3;71226;6:11;{2589.0274000018835,1538.5219000000507,0.0}
Trams142;14;10;71229;6:11;{4672.309900000691,2395.577299999073,0.0}
Trams143;14;10;71230;6:11;{4084.1569000035524,2161.088000001386,0.0}
Trams185;18;13;71237;6:13;{4084.1569000035524,2161.088000001386,0.0}
Trams144;14;15;71238;6:13;{5689.812200002372,2815.7713999990374,0.0}
Trams181;18;8;71241;6:13;{7477.508000001311,3581.729000000283,0.0}
Trams184;18;9;71242;6:13;{1782.5218000002205,1208.6106000002474,0.0}
Trams142;14;9;71242;6:13;{4048.297289360261,2135.7927898531034,0.0}
Trams143;14;15;71244;6:14;{4722.0763000026345,2426.624300001189,0.0}
Trams145;14;9;71248;6:14;{7477.508000001311,3581.729000000283,0.0}
Trams145;14;8;71249;6:15;{7477.508000001311,3581.729000000283,0.0}
Trams182;18;6;71250;6:15;{4031.8555000014603,2128.9623999986798,0.0}
Trams184;18;10;71250;6:15;{2149.2538000009954,1363.784799998626,0.0}
Trams146;14;10;71253;6:15;{6188.119100000709,2954.7112999986857,0.0}
Trams184;18;11;71260;6:16;{2627.1466000005603,1561.507400000468,0.0}
Trams185;18;14;71260;6:16;{5123.508700001985,2583.745899999514,0.0}
Trams183;18;2;71265;6:17;{845.340600002557,806.1041999999434,0.0}
Trams141;14;12;71265;6:17;{2894.896500002593,514.0241999980062,0.0}
Trams142;14;8;71265;6:17;{2992.747200001031,1703.0900999996811,0.0}
Trams143;14;21;71265;6:17;{5689.812200002372,2815.7713999990374,0.0}
Trams144;14;14;71265;6:17;{6883.719200000167,3354.242599999532,0.0}
Trams142;14;7;71266;6:17;{2952.0448504139104,1673.1693294131398,0.0}
Trams185;18;15;71272;6:18;{5689.812200002372,2815.7713999990374,0.0}
Trams141;14;18;71277;6:19;{2597.49450000003,904.9190000016242,0.0}
Trams144;14;7;71279;6:20;{7477.508000001311,3581.729000000283,0.0}
Trams144;14;6;71280;6:20;{7477.508000001311,3581.729000000283,0.0}
Trams143;14;20;71284;6:20;{6593.146138654794,3149.575753243163,0.0}
Trams181;18;10;71285;6:21;{5634.466500002891,2784.006800001487,0.0}
Trams141;14;24;71285;6:21;{2839.1857000030577,1180.8036000002176,0.0}
Trams183;18;7;71287;6:21;{1782.5218000002205,1208.6106000002474,0.0}
Trams182;18;5;71291;6:22;{2110.2352000027895,1344.0613000001758,0.0}
Trams184;18;12;71291;6:22;{4084.1569000035524,2161.088000001386,0.0}
Trams143;14;19;71292;6:22;{6883.719200000167,3354.242599999532,0.0}
Trams183;18;9;71295;6:22;{2149.2538000009954,1363.784799998626,0.0}
Trams142;14;10;71296;6:22;{2894.896500002593,514.0241999980062,0.0}
Trams141;14;23;71298;6:23;{3035.1652000024915,1729.7097000014037,0.0}
Trams143;14;18;71300;6:23;{7223.311400000006,3570.043500000611,0.0}
Trams183;18;11;71305;6:24;{2627.1466000005603,1561.507400000468,0.0}
Trams184;18;15;71305;6:24;{4722.0763000026345,2426.624300001189,0.0}
Trams143;14;5;71306;6:24;{7477.508000001311,3581.729000000283,0.0}
Trams185;18;14;71308;6:24;{7267.007879060962,3598.2324644667874,0.0}
Trams142;14;11;71308;6:24;{2597.49450000003,904.9190000016242,0.0}
Trams185;18;7;71313;6:25;{7477.508000001311,3581.729000000283,0.0}
Trams184;18;17;71314;6:25;{5123.508700001985,2583.745899999514,0.0}
Trams142;14;13;71316;6:26;{2839.1857000030577,1180.8036000002176,0.0}
Trams141;14;22;71320;6:26;{4084.1569000035524,2161.088000001386,0.0}
Trams184;18;19;71326;6:27;{5689.812200002372,2815.7713999990374,0.0}
Trams184;18;18;71327;6:28;{5739.764803540053,2830.2159521656795,0.0}
Trams142;14;12;71330;6:28;{3084.0353342962862,1747.4296273253601,0.0}
Trams141;14;21;71333;6:29;{4707.823850244834,2420.7529164061234,0.0}
Trams141;14;22;71334;6:29;{4722.0763000026345,2426.624300001189,0.0}
Trams141;14;24;71343;6:30;{5123.508700001985,2583.745899999514,0.0}
Trams185;18;10;71345;6:31;{6188.119100000709,2954.7112999986857,0.0}
Trams182;18;7;71350;6:31;{2149.2538000009954,1363.784799998626,0.0}
Trams142;14;13;71351;6:32;{4084.1569000035524,2161.088000001386,0.0}
Trams146;14;11;71352;6:32;{2894.896500002593,514.0241999980062,0.0}
Trams141;14;23;71356;6:32;{5739.764803540053,2830.2159521656795,0.0}
Trams183;18;12;71359;6:33;{5123.508700001985,2583.745899999514,0.0}
Trams146;14;18;71364;6:34;{2597.49450000003,904.9190000016242,0.0}
Trams184;18;8;71367;6:34;{7477.508000001311,3581.729000000283,0.0}
Trams184;18;7;71368;6:34;{7477.508000001311,3581.729000000283,0.0}
Trams185;18;11;71369;6:35;{5058.904000002891,2546.714799998328,0.0}
Trams183;18;14;71371;6:35;{5689.812200002372,2815.7713999990374,0.0}
Trams185;18;13;71377;6:36;{4672.309900000691,2395.577299999073,0.0}
Trams181;18;9;71379;6:36;{1213.7785956119094,964.194963392883,0.0}
Trams145;14;9;71379;6:36;{2894.896500002593,514.0241999980062,0.0}
Trams181;18;10;71380;6:36;{1208.916700001806,962.1525999996811,0.0}
Trams141;14;21;71381;6:37;{6864.837443928478,3341.6995773341046,0.0}
Trams183;18;13;71382;6:37;{6221.943900000304,2968.579499999061,0.0}
Trams146;14;17;71385;6:37;{3035.1652000024915,1729.7097000014037,0.0}
Trams146;14;16;71386;6:37;{3084.0353342962862,1747.4296273253601,0.0}
Trams181;18;9;71389;6:38;{845.340600002557,806.1041999999434,0.0}
Trams182;18;8;71391;6:38;{4084.1569000035524,2161.088000001386,0.0}
Trams145;14;11;71391;6:38;{2597.49450000003,904.9190000016242,0.0}
Trams141;14;7;71396;6:39;{7477.508000001311,3581.729000000283,0.0}
Trams183;18;12;71397;6:39;{6864.837443928478,3341.6995773341046,0.0}
Trams141;14;6;71397;6:39;{7477.508000001311,3581.729000000283,0.0}
Trams141;14;5;71399;6:40;{7399.735580409566,3546.353579350148,0.0}
Trams145;14;12;71399;6:40;{2839.1857000030577,1180.8036000002176,0.0}
Trams182;18;10;71405;6:41;{4722.0763000026345,2426.624300001189,0.0}
Trams183;18;11;71406;6:41;{7223.311400000006,3570.043500000611,0.0}
Trams146;14;17;71407;6:41;{4084.1569000035524,2161.088000001386,0.0}
Trams144;14;8;71410;6:41;{2894.896500002593,514.0241999980062,0.0}
Trams181;18;14;71411;6:42;{1782.5218000002205,1208.6106000002474,0.0}
Trams144;14;12;71411;6:42;{2892.683600001037,511.3241000007838,0.0}
Trams183;18;2;71412;6:42;{7477.508000001311,3581.729000000283,0.0}
Trams145;14;13;71412;6:42;{3035.1652000024915,1729.7097000014037,0.0}
Trams185;18;12;71413;6:42;{2992.747200001031,1703.0900999996811,0.0}
Trams182;18;13;71414;6:42;{5123.508700001985,2583.745899999514,0.0}
Trams181;18;20;71419;6:43;{2149.2538000009954,1363.784799998626,0.0}
Trams146;14;18;71421;6:43;{4722.0763000026345,2426.624300001189,0.0}
Trams185;18;14;71422;6:43;{2589.0274000018835,1538.5219000000507,0.0}
Trams144;14;13;71422;6:43;{2597.49450000003,904.9190000016242,0.0}
Trams184;18;8;71423;6:44;{5058.904000002891,2546.714799998328,0.0}
Trams182;18;14;71426;6:44;{5689.812200002372,2815.7713999990374,0.0}
Trams142;14;7;71427;6:44;{7477.508000001311,3581.729000000283,0.0}
Trams142;14;6;71428;6:44;{7477.508000001311,3581.729000000283,0.0}
Trams181;18;22;71429;6:45;{2627.1466000005603,1561.507400000468,0.0}
Trams144;14;16;71430;6:45;{2839.1857000030577,1180.8036000002176,0.0}
Trams184;18;9;71431;6:45;{4672.309900000691,2395.577299999073,0.0}
Trams182;18;16;71437;6:46;{6221.943900000304,2968.579499999061,0.0}
Trams181;18;21;71438;6:46;{3035.1652000024915,1729.7097000014037,0.0}
Trams146;14;22;71442;6:47;{5689.812200002372,2815.7713999990374,0.0}
Trams145;14;18;71448;6:48;{4722.0763000026345,2426.624300001189,0.0}
Trams143;14;6;71449;6:48;{2597.49450000003,904.9190000016242,0.0}
Trams185;18;12;71451;6:48;{1213.7785956119094,964.194963392883,0.0}
Trams185;18;11;71452;6:48;{1208.916700001806,962.1525999996811,0.0}
Trams182;18;14;71453;6:49;{6883.719200000167,3354.242599999532,0.0}
Trams146;14;21;71454;6:49;{6271.932036142039,2982.903802087056,0.0}
Trams145;14;19;71457;6:49;{5123.508700001985,2583.745899999514,0.0}
Trams141;14;6;71460;6:50;{4672.309900000691,2395.577299999073,0.0}
Trams185;18;6;71461;6:50;{845.340600002557,806.1041999999434,0.0}
Trams182;18;6;71467;6:51;{7477.508000001311,3581.729000000283,0.0}
Trams182;18;5;71468;6:51;{7477.508000001311,3581.729000000283,0.0}
Trams145;14;20;71469;6:51;{5689.812200002372,2815.7713999990374,0.0}
Trams145;14;19;71470;6:51;{5739.764803540053,2830.2159521656795,0.0}
Trams181;18;23;71474;6:52;{4722.0763000026345,2426.624300001189,0.0}
Trams184;18;10;71476;6:52;{2589.0274000018835,1538.5219000000507,0.0}
Trams146;14;20;71478;6:53;{7267.007879060962,3598.2324644667874,0.0}
Trams185;18;8;71483;6:54;{1782.5218000002205,1208.6106000002474,0.0}
Trams146;14;8;71483;6:54;{7477.508000001311,3581.729000000283,0.0}
Trams185;18;15;71491;6:55;{2149.2538000009954,1363.784799998626,0.0}
Trams143;14;7;71492;6:55;{4084.1569000035524,2161.088000001386,0.0}
Trams181;18;24;71495;6:56;{5689.812200002372,2815.7713999990374,0.0}
Trams141;14;5;71496;6:56;{2992.747200001031,1703.0900999996811,0.0}
Trams185;18;20;71501;6:57;{2627.1466000005603,1561.507400000468,0.0}
Trams184;18;9;71505;6:57;{1213.7785956119094,964.194963392883,0.0}
Trams143;14;11;71506;6:57;{4722.0763000026345,2426.624300001189,0.0}
Trams145;14;9;71510;6:58;{7477.508000001311,3581.729000000283,0.0}
Trams144;14;15;71511;6:58;{6221.943900000304,2968.579499999061,0.0}
Trams145;14;8;71511;6:58;{7477.508000001311,3581.729000000283,0.0}
Trams144;14;14;71512;6:58;{6271.932036142039,2982.903802087056,0.0}
Trams184;18;8;71513;6:59;{874.5067790792331,818.4381949221134,0.0}
Trams181;18;23;71514;6:59;{6593.146138654794,3149.575753243163,0.0}
Trams184;18;7;71515;6:59;{845.340600002557,806.1041999999434,0.0}
Trams143;14;16;71515;6:59;{5123.508700001985,2583.745899999514,0.0}
Trams181;18;22;71521;7:0;{6864.837443928478,3341.6995773341046,0.0}
Trams182;18;7;71523;7:0;{5058.904000002891,2546.714799998328,0.0}
Trams141;14;13;71527;7:1;{2894.896500002593,514.0241999980062,0.0}
Trams143;14;18;71527;7:1;{5689.812200002372,2815.7713999990374,0.0}
Trams182;18;8;71531;7:2;{4672.309900000691,2395.577299999073,0.0}
Trams185;18;22;71532;7:2;{4084.1569000035524,2161.088000001386,0.0}
Trams144;14;13;71535;7:2;{7223.311400000006,3570.043500000611,0.0}
Trams181;18;11;71536;7:2;{7477.508000001311,3581.729000000283,0.0}
Trams181;18;10;71537;7:3;{7477.508000001311,3581.729000000283,0.0}
Trams184;18;12;71537;7:3;{1782.5218000002205,1208.6106000002474,0.0}
Trams143;14;19;71538;7:3;{6221.943900000304,2968.579499999061,0.0}
Trams141;14;20;71539;7:3;{2597.49450000003,904.9190000016242,0.0}
Trams144;14;6;71541;7:3;{7477.508000001311,3581.729000000283,0.0}
Trams182;18;7;71545;7:4;{4031.8555000014603,2128.9623999986798,0.0}
Trams184;18;19;71545;7:4;{2149.2538000009954,1363.784799998626,0.0}
Trams185;18;21;71545;7:4;{4707.823850244834,2420.7529164061234,0.0}
Trams185;18;24;71546;7:4;{4722.0763000026345,2426.624300001189,0.0}
Trams141;14;24;71547;7:4;{2839.1857000030577,1180.8036000002176,0.0}
Trams143;14;18;71553;7:5;{6864.837443928478,3341.6995773341046,0.0}
Trams142;14;7;71558;7:6;{2894.896500002593,514.0241999980062,0.0}
Trams184;18;18;71564;7:7;{3035.1652000024915,1729.7097000014037,0.0}
Trams181;18;12;71568;7:8;{6188.119100000709,2954.7112999986857,0.0}
Trams143;14;4;71568;7:8;{7477.508000001311,3581.729000000283,0.0}
Trams142;14;13;71570;7:8;{2597.49450000003,904.9190000016242,0.0}
Trams182;18;6;71576;7:9;{2589.0274000018835,1538.5219000000507,0.0}
Trams142;14;19;71578;7:9;{2839.1857000030577,1180.8036000002176,0.0}
Trams181;18;14;71580;7:10;{5634.466500002891,2784.006800001487,0.0}
Trams183;18;6;71582;7:10;{1782.5218000002205,1208.6106000002474,0.0}
Trams141;14;23;71582;7:10;{4084.1569000035524,2161.088000001386,0.0}
Trams141;14;22;71583;7:10;{4132.967545312427,2178.980077572535,0.0}
Trams183;18;11;71590;7:11;{2149.2538000009954,1363.784799998626,0.0}
Trams181;18;16;71592;7:12;{5058.904000002891,2546.714799998328,0.0}
Trams141;14;24;71596;7:12;{4722.0763000026345,2426.624300001189,0.0}
Trams181;18;17;71600;7:13;{4672.309900000691,2395.577299999073,0.0}
Trams183;18;15;71600;7:13;{2627.1466000005603,1561.507400000468,0.0}
Trams184;18;24;71600;7:13;{4722.0763000026345,2426.624300001189,0.0}
Trams185;18;8;71608;7:14;{7477.508000001311,3581.729000000283,0.0}
Trams185;18;6;71609;7:15;{7477.508000001311,3581.729000000283,0.0}
Trams142;14;18;71614;7:15;{4132.967545312427,2178.980077572535,0.0}
Trams146;14;16;71614;7:15;{2894.896500002593,514.0241999980062,0.0}
Trams182;18;4;71615;7:16;{845.340600002557,806.1041999999434,0.0}
Trams146;14;24;71626;7:17;{2597.49450000003,904.9190000016242,0.0}
Trams142;14;22;71627;7:18;{4722.0763000026345,2426.624300001189,0.0}
Trams142;14;24;71636;7:19;{5123.508700001985,2583.745899999514,0.0}
Trams147;14;17;71636;7:19;{5123.508700001985,2583.745899999514,0.0}
Trams182;18;7;71637;7:19;{1782.5218000002205,1208.6106000002474,0.0}
Trams141;14;23;71637;7:19;{6609.992500003427,3161.7836000006646,0.0}
Trams184;18;23;71640;7:20;{6593.146138654794,3149.575753243163,0.0}
Trams185;18;7;71640;7:20;{6188.119100000709,2954.7112999986857,0.0}
Trams145;14;10;71641;7:20;{2894.896500002593,514.0241999980062,0.0}
Trams181;18;16;71645;7:21;{2589.0274000018835,1538.5219000000507,0.0}
Trams182;18;15;71645;7:21;{2149.2538000009954,1363.784799998626,0.0}
Trams183;18;20;71645;7:21;{4722.0763000026345,2426.624300001189,0.0}
Trams147;14;24;71648;7:21;{5689.812200002372,2815.7713999990374,0.0}
Trams185;18;11;71652;7:22;{5634.466500002891,2784.006800001487,0.0}
Trams141;14;22;71653;7:22;{7267.007879060962,3598.2324644667874,0.0}
Trams145;14;15;71653;7:22;{2597.49450000003,904.9190000016242,0.0}
Trams181;18;17;71655;7:22;{2110.2352000027895,1344.0613000001758,0.0}
Trams182;18;18;71655;7:22;{2627.1466000005603,1561.507400000468,0.0}
Trams184;18;22;71656;7:22;{7223.311400000006,3570.043500000611,0.0}
Trams141;14;7;71658;7:23;{7477.508000001311,3581.729000000283,0.0}
Trams141;14;5;71659;7:23;{7477.508000001311,3581.729000000283,0.0}
Trams142;14;23;71660;7:23;{6271.932036142039,2982.903802087056,0.0}
Trams145;14;24;71661;7:23;{2839.1857000030577,1180.8036000002176,0.0}
Trams184;18;8;71662;7:23;{7477.508000001311,3581.729000000283,0.0}
Trams181;18;16;71664;7:24;{1692.722305299079,1166.6255241828771,0.0}
Trams185;18;14;71664;7:24;{5058.904000002891,2546.714799998328,0.0}
Trams183;18;24;71666;7:24;{5689.812200002372,2815.7713999990374,0.0}
Trams142;14;22;71667;7:24;{6593.146138654794,3149.575753243163,0.0}
Trams146;14;23;71670;7:25;{4132.967545312427,2178.980077572535,0.0}
Trams185;18;16;71672;7:25;{4672.309900000691,2395.577299999073,0.0}
Trams144;14;9;71672;7:25;{2894.896500002593,514.0241999980062,0.0}
Trams181;18;15;71674;7:25;{1213.7785956119094,964.194963392883,0.0}
Trams181;18;16;71675;7:26;{1208.916700001806,962.1525999996811,0.0}
Trams146;14;24;71683;7:27;{4722.0763000026345,2426.624300001189,0.0}
Trams181;18;12;71684;7:27;{845.340600002557,806.1041999999434,0.0}
Trams142;14;21;71684;7:27;{7267.007879060962,3598.2324644667874,0.0}
Trams144;14;12;71684;7:27;{2597.49450000003,904.9190000016242,0.0}
Trams185;18;15;71685;7:27;{4048.297289360261,2135.7927898531034,0.0}
Trams182;18;20;71686;7:27;{4084.1569000035524,2161.088000001386,0.0}
Trams142;14;7;71689;7:28;{7477.508000001311,3581.729000000283,0.0}
Trams147;14;2;71689;7:28;{7477.508000001311,3581.729000000283,0.0}
Trams142;14;6;71690;7:28;{7477.508000001311,3581.729000000283,0.0}
Trams147;14;1;71690;7:28;{7477.508000001311,3581.729000000283,0.0}
Trams144;14;23;71692;7:28;{2839.1857000030577,1180.8036000002176,0.0}
Trams145;14;23;71697;7:29;{4132.967545312427,2178.980077572535,0.0}
Trams143;14;6;71699;7:30;{2894.896500002593,514.0241999980062,0.0}
Trams182;18;24;71700;7:30;{4722.0763000026345,2426.624300001189,0.0}
Trams183;18;23;71702;7:30;{7267.007879060962,3598.2324644667874,0.0}
Trams181;18;14;71706;7:31;{1782.5218000002205,1208.6106000002474,0.0}
Trams184;18;10;71706;7:31;{5634.466500002891,2784.006800001487,0.0}
Trams183;18;3;71707;7:31;{7477.508000001311,3581.729000000283,0.0}
Trams185;18;14;71708;7:31;{2992.747200001031,1703.0900999996811,0.0}
Trams185;18;13;71709;7:31;{2942.963136644313,1688.2069726773154,0.0}
Trams145;14;24;71710;7:31;{4722.0763000026345,2426.624300001189,0.0}
Trams143;14;17;71711;7:32;{2597.49450000003,904.9190000016242,0.0}
Trams181;18;20;71714;7:32;{2149.2538000009954,1363.784799998626,0.0}
Trams143;14;19;71719;7:33;{2839.1857000030577,1180.8036000002176,0.0}
Trams181;18;24;71724;7:34;{2627.1466000005603,1561.507400000468,0.0}
Trams184;18;12;71726;7:34;{4672.309900000691,2395.577299999073,0.0}
Trams185;18;12;71727;7:34;{2110.2352000027895,1344.0613000001758,0.0}
Trams144;14;22;71728;7:34;{4132.967545312427,2178.980077572535,0.0}
Trams143;14;18;71732;7:35;{3035.1652000024915,1729.7097000014037,0.0}
Trams185;18;11;71736;7:36;{1692.722305299079,1166.6255241828771,0.0}
Trams184;18;11;71740;7:36;{4031.8555000014603,2128.9623999986798,0.0}
Trams144;14;24;71741;7:37;{4722.0763000026345,2426.624300001189,0.0}
Trams146;14;8;71745;7:37;{7477.508000001311,3581.729000000283,0.0}
Trams185;18;10;71746;7:37;{1213.7785956119094,964.194963392883,0.0}
Trams146;14;7;71746;7:37;{7477.508000001311,3581.729000000283,0.0}
Trams183;18;4;71751;7:38;{5634.466500002891,2784.006800001487,0.0}
Trams181;18;23;71755;7:39;{4084.1569000035524,2161.088000001386,0.0}
Trams143;14;17;71755;7:39;{4132.967545312427,2178.980077572535,0.0}
Trams185;18;6;71756;7:39;{845.340600002557,806.1041999999434,0.0}
Trams141;14;6;71758;7:39;{2992.747200001031,1703.0900999996811,0.0}
Trams182;18;4;71762;7:40;{7477.508000001311,3581.729000000283,0.0}
Trams183;18;6;71763;7:40;{5058.904000002891,2546.714799998328,0.0}
Trams185;18;7;71766;7:41;{1241.924200002104,980.4126999992877,0.0}
Trams145;14;23;71766;7:41;{7223.311400000006,3570.043500000611,0.0}
Trams143;14;24;71768;7:41;{4722.0763000026345,2426.624300001189,0.0}
Trams181;18;24;71769;7:41;{4722.0763000026345,2426.624300001189,0.0}
Trams184;18;12;71771;7:42;{2589.0274000018835,1538.5219000000507,0.0}
Trams141;14;5;71771;7:42;{2808.1955000013113,1135.889900000766,0.0}
Trams145;14;7;71772;7:42;{7477.508000001311,3581.729000000283,0.0}
Trams185;18;10;71778;7:43;{1782.5218000002205,1208.6106000002474,0.0}
Trams146;14;6;71778;7:43;{6138.21238208538,2940.1058384544613,0.0}
Trams184;18;13;71781;7:43;{2110.2352000027895,1344.0613000001758,0.0}
Trams185;18;18;71786;7:44;{2149.2538000009954,1363.784799998626,0.0}
Trams184;18;14;71789;7:45;{1740.6504000015557,1186.7970000002533,0.0}
Trams141;14;18;71789;7:45;{2894.896500002593,514.0241999980062,0.0}
Trams185;18;24;71796;7:46;{2627.1466000005603,1561.507400000468,0.0}
Trams184;18;13;71801;7:47;{1208.916700001806,962.1525999996811,0.0}
Trams141;14;24;71801;7:47;{2597.49450000003,904.9190000016242,0.0}
Trams144;14;2;71803;7:47;{7477.508000001311,3581.729000000283,0.0}
Trams182;18;5;71806;7:47;{5634.466500002891,2784.006800001487,0.0}
Trams184;18;12;71808;7:48;{874.5067790792331,818.4381949221134,0.0}
Trams184;18;8;71810;7:48;{845.340600002557,806.1041999999434,0.0}
Trams183;18;5;71816;7:49;{2589.0274000018835,1538.5219000000507,0.0}
Trams142;14;8;71820;7:50;{2894.896500002593,514.0241999980062,0.0}
Trams183;18;7;71826;7:51;{2110.2352000027895,1344.0613000001758,0.0}
Trams143;14;4;71830;7:51;{7477.508000001311,3581.729000000283,0.0}
Trams181;18;12;71831;7:52;{7477.508000001311,3581.729000000283,0.0}
Trams143;14;3;71831;7:52;{7477.508000001311,3581.729000000283,0.0}
Trams181;18;11;71832;7:52;{7477.508000001311,3581.729000000283,0.0}
Trams184;18;10;71832;7:52;{1782.5218000002205,1208.6106000002474,0.0}
Trams142;14;24;71832;7:52;{2597.49450000003,904.9190000016242,0.0}
Trams147;14;4;71832;7:52;{2597.49450000003,904.9190000016242,0.0}
Trams182;18;4;71840;7:53;{4031.8555000014603,2128.9623999986798,0.0}
Trams184;18;12;71840;7:53;{2149.2538000009954,1363.784799998626,0.0}
Trams147;14;22;71840;7:53;{2839.1857000030577,1180.8036000002176,0.0}
Trams144;14;3;71847;7:54;{5634.466500002891,2784.006800001487,0.0}
Trams184;18;20;71850;7:55;{2627.1466000005603,1561.507400000468,0.0}
Trams142;14;22;71854;7:55;{3084.0353342962862,1747.4296273253601,0.0}
Trams183;18;2;71855;7:56;{845.340600002557,806.1041999999434,0.0}
Trams182;18;5;71862;7:57;{2992.747200001031,1703.0900999996811,0.0}
Trams181;18;13;71863;7:57;{6188.119100000709,2954.7112999986857,0.0}
Trams185;18;23;71863;7:57;{5739.764803540053,2830.2159521656795,0.0}
Trams182;18;6;71871;7:58;{2589.0274000018835,1538.5219000000507,0.0}
Trams145;14;6;71872;7:58;{2992.747200001031,1703.0900999996811,0.0}
Trams185;18;24;71873;7:59;{6221.943900000304,2968.579499999061,0.0}
Trams181;18;15;71875;7:59;{5634.466500002891,2784.006800001487,0.0}
Trams142;14;23;71875;7:59;{4084.1569000035524,2161.088000001386,0.0}
Trams147;14;21;71875;7:59;{4084.1569000035524,2161.088000001386,0.0}
Trams146;14;14;71876;7:59;{2894.896500002593,514.0241999980062,0.0}
Trams183;18;6;71877;7:59;{1782.5218000002205,1208.6106000002474,0.0}
Trams185;18;23;71881;8:0;{6593.146138654794,3149.575753243163,0.0}
Trams144;14;2;71881;8:0;{4031.8555000014603,2128.9623999986798,0.0}
Trams182;18;5;71882;8:0;{2064.0685709043055,1320.5282183098925,0.0}
Trams183;18;9;71885;8:1;{2149.2538000009954,1363.784799998626,0.0}
Trams146;14;24;71888;8:1;{2597.49450000003,904.9190000016242,0.0}
Trams182;18;4;71889;8:1;{1740.6504000015557,1186.7970000002533,0.0}
Trams142;14;24;71889;8:1;{4722.0763000026345,2426.624300001189,0.0}
Trams147;14;24;71889;8:1;{4722.0763000026345,2426.624300001189,0.0}
Trams182;18;3;71890;8:1;{1692.722305299079,1166.6255241828771,0.0}
Trams181;18;16;71895;8:2;{4672.309900000691,2395.577299999073,0.0}
Trams184;18;24;71895;8:2;{4722.0763000026345,2426.624300001189,0.0}
Trams185;18;22;71897;8:3;{7223.311400000006,3570.043500000611,0.0}
Trams185;18;7;71903;8:4;{7477.508000001311,3581.729000000283,0.0}
Trams145;14;8;71903;8:4;{2894.896500002593,514.0241999980062,0.0}
Trams185;18;6;71904;8:4;{7477.508000001311,3581.729000000283,0.0}
Trams182;18;4;71910;8:5;{845.340600002557,806.1041999999434,0.0}
Trams145;14;10;71915;8:6;{2597.49450000003,904.9190000016242,0.0}
Trams184;18;23;71917;8:6;{5739.764803540053,2830.2159521656795,0.0}
Trams141;14;4;71920;8:6;{7477.508000001311,3581.729000000283,0.0}
Trams147;14;23;71922;8:7;{6271.932036142039,2982.903802087056,0.0}
Trams145;14;16;71923;8:7;{2839.1857000030577,1180.8036000002176,0.0}
Trams183;18;10;71926;8:7;{4084.1569000035524,2161.088000001386,0.0}
Trams184;18;24;71927;8:8;{6221.943900000304,2968.579499999061,0.0}
Trams147;14;22;71930;8:8;{6609.992500003427,3161.7836000006646,0.0}
Trams146;14;22;71931;8:8;{4084.1569000035524,2161.088000001386,0.0}
Trams182;18;7;71932;8:8;{1782.5218000002205,1208.6106000002474,0.0}
Trams144;14;3;71934;8:9;{2894.896500002593,514.0241999980062,0.0}
Trams184;18;23;71935;8:9;{6593.146138654794,3149.575753243163,0.0}
Trams147;14;21;71936;8:9;{6864.837443928478,3341.6995773341046,0.0}
Trams145;14;15;71937;8:9;{3084.0353342962862,1747.4296273253601,0.0}
Trams147;14;20;71937;8:9;{6883.719200000167,3354.242599999532,0.0}
Trams182;18;8;71940;8:10;{2149.2538000009954,1363.784799998626,0.0}
Trams183;18;24;71940;8:10;{4722.0763000026345,2426.624300001189,0.0}
Trams146;14;24;71945;8:11;{4722.0763000026345,2426.624300001189,0.0}
Trams144;14;5;71946;8:11;{2597.49450000003,904.9190000016242,0.0}
Trams181;18;19;71950;8:11;{2110.2352000027895,1344.0613000001758,0.0}
Trams182;18;10;71950;8:11;{2627.1466000005603,1561.507400000468,0.0}
Trams142;14;5;71951;8:12;{7477.508000001311,3581.729000000283,0.0}
Trams147;14;2;71951;8:12;{7477.508000001311,3581.729000000283,0.0}
Trams144;14;7;71954;8:12;{2839.1857000030577,1180.8036000002176,0.0}
Trams184;18;5;71957;8:13;{7477.508000001311,3581.729000000283,0.0}
Trams181;18;20;71958;8:13;{1740.6504000015557,1186.7970000002533,0.0}
Trams145;14;16;71958;8:13;{4084.1569000035524,2161.088000001386,0.0}
Trams181;18;19;71959;8:13;{1692.722305299079,1166.6255241828771,0.0}
Trams185;18;7;71959;8:13;{5058.904000002891,2546.714799998328,0.0}
Trams143;14;8;71961;8:13;{2894.896500002593,514.0241999980062,0.0}
Trams185;18;12;71967;8:14;{4672.309900000691,2395.577299999073,0.0}
Trams181;18;18;71970;8:15;{1208.916700001806,962.1525999996811,0.0}
Trams143;14;11;71973;8:15;{2597.49450000003,904.9190000016242,0.0}
Trams141;14;5;71976;8:16;{5058.904000002891,2546.714799998328,0.0}
Trams181;18;12;71979;8:16;{845.340600002557,806.1041999999434,0.0}
Trams183;18;23;71981;8:17;{6609.992500003427,3161.7836000006646,0.0}
Trams185;18;11;71981;8:17;{4031.8555000014603,2128.9623999986798,0.0}
Trams143;14;15;71981;8:17;{2839.1857000030577,1180.8036000002176,0.0}
Trams145;14;24;71981;8:17;{5123.508700001985,2583.745899999514,0.0}
Trams183;18;22;71988;8:18;{6883.719200000167,3354.242599999532,0.0}
Trams182;18;12;71995;8:19;{4722.0763000026345,2426.624300001189,0.0}
Trams142;14;6;71995;8:19;{5634.466500002891,2784.006800001487,0.0}
Trams181;18;17;72001;8:20;{1782.5218000002205,1208.6106000002474,0.0}
Trams183;18;2;72002;8:20;{7477.508000001311,3581.729000000283,0.0}
Trams182;18;11;72003;8:20;{5108.905971347362,2577.745680309252,0.0}
Trams182;18;24;72004;8:20;{5123.508700001985,2583.745899999514,0.0}
Trams146;14;5;72007;8:21;{7477.508000001311,3581.729000000283,0.0}
Trams181;18;19;72009;8:21;{2149.2538000009954,1363.784799998626,0.0}
Trams144;14;24;72012;8:22;{5123.508700001985,2583.745899999514,0.0}
Trams145;14;23;72012;8:22;{6593.146138654794,3149.575753243163,0.0}
Trams184;18;6;72013;8:22;{5058.904000002891,2546.714799998328,0.0}
Trams181;18;20;72019;8:23;{2627.1466000005603,1561.507400000468,0.0}
Trams141;14;4;72021;8:23;{2952.0448504139104,1673.1693294131398,0.0}
Trams145;14;22;72028;8:24;{7223.311400000006,3570.043500000611,0.0}
Trams185;18;10;72030;8:25;{1740.6504000015557,1186.7970000002533,0.0}
Trams141;14;5;72033;8:25;{2808.1955000013113,1135.889900000766,0.0}
Trams145;14;6;72034;8:25;{7477.508000001311,3581.729000000283,0.0}
Trams144;14;23;72036;8:26;{6271.932036142039,2982.903802087056,0.0}
Trams143;14;24;72039;8:26;{5123.508700001985,2583.745899999514,0.0}
Trams183;18;6;72046;8:27;{5634.466500002891,2784.006800001487,0.0}
Trams185;18;9;72049;8:28;{874.5067790792331,818.4381949221134,0.0}
Trams144;14;22;72050;8:28;{6864.837443928478,3341.6995773341046,0.0}
Trams185;18;6;72051;8:28;{845.340600002557,806.1041999999434,0.0}
Trams141;14;11;72051;8:28;{2894.896500002593,514.0241999980062,0.0}
Trams144;14;21;72051;8:28;{6883.719200000167,3354.242599999532,0.0}
Trams182;18;5;72057;8:29;{7477.508000001311,3581.729000000283,0.0}
Trams182;18;2;72058;8:29;{7477.508000001311,3581.729000000283,0.0}
Trams183;18;7;72058;8:29;{5058.904000002891,2546.714799998328,0.0}
Trams141;14;20;72063;8:30;{2597.49450000003,904.9190000016242,0.0}
Trams181;18;22;72064;8:30;{4722.0763000026345,2426.624300001189,0.0}
Trams142;14;5;72064;8:30;{2808.1955000013113,1135.889900000766,0.0}
Trams144;14;3;72065;8:31;{7477.508000001311,3581.729000000283,0.0}
Trams144;14;2;72066;8:31;{7477.508000001311,3581.729000000283,0.0}
Trams141;14;24;72071;8:32;{2839.1857000030577,1180.8036000002176,0.0}
Trams146;14;6;72071;8:32;{4672.309900000691,2395.577299999073,0.0}
Trams181;18;24;72073;8:32;{5123.508700001985,2583.745899999514,0.0}
Trams185;18;7;72073;8:32;{1782.5218000002205,1208.6106000002474,0.0}
Trams184;18;7;72076;8:32;{2110.2352000027895,1344.0613000001758,0.0}
Trams185;18;11;72081;8:33;{2149.2538000009954,1363.784799998626,0.0}
Trams142;14;11;72082;8:33;{2894.896500002593,514.0241999980062,0.0}
Trams184;18;6;72084;8:34;{1740.6504000015557,1186.7970000002533,0.0}
Trams141;14;22;72085;8:34;{3084.0353342962862,1747.4296273253601,0.0}
Trams185;18;12;72091;8:35;{2627.1466000005603,1561.507400000468,0.0}
Trams143;14;5;72092;8:35;{7477.508000001311,3581.729000000283,0.0}
Trams143;14;3;72093;8:35;{7477.508000001311,3581.729000000283,0.0}
Trams142;14;13;72094;8:35;{2597.49450000003,904.9190000016242,0.0}
Trams182;18;5;72101;8:37;{5634.466500002891,2784.006800001487,0.0}
Trams183;18;6;72102;8:37;{2992.747200001031,1703.0900999996811,0.0}
Trams142;14;19;72102;8:37;{2839.1857000030577,1180.8036000002176,0.0}
Trams184;18;5;72105;8:37;{845.340600002557,806.1041999999434,0.0}
Trams183;18;4;72111;8:38;{2589.0274000018835,1538.5219000000507,0.0}
Trams145;14;5;72111;8:38;{4048.297289360261,2135.7927898531034,0.0}
Trams181;18;23;72112;8:38;{6883.719200000167,3354.242599999532,0.0}
Trams182;18;6;72113;8:39;{5058.904000002891,2546.714799998328,0.0}
Trams141;14;24;72120;8:40;{4722.0763000026345,2426.624300001189,0.0}
Trams144;14;3;72121;8:40;{5058.904000002891,2546.714799998328,0.0}
Trams143;14;4;72124;8:40;{6188.119100000709,2954.7112999986857,0.0}
Trams181;18;13;72126;8:41;{7477.508000001311,3581.729000000283,0.0}
Trams181;18;11;72127;8:41;{7477.508000001311,3581.729000000283,0.0}
Trams146;14;5;72127;8:41;{2569.3393000029027,869.8653000015765,0.0}
Trams184;18;8;72135;8:42;{2149.2538000009954,1363.784799998626,0.0}
Trams185;18;16;72136;8:42;{4722.0763000026345,2426.624300001189,0.0}
Trams142;14;20;72137;8:43;{4084.1569000035524,2161.088000001386,0.0}
Trams146;14;10;72138;8:43;{2894.896500002593,514.0241999980062,0.0}
Trams183;18;3;72141;8:43;{1208.916700001806,962.1525999996811,0.0}
Trams144;14;4;72143;8:44;{4031.8555000014603,2128.9623999986798,0.0}
Trams184;18;10;72145;8:44;{2627.1466000005603,1561.507400000468,0.0}
Trams185;18;24;72145;8:44;{5123.508700001985,2583.745899999514,0.0}
Trams183;18;2;72150;8:45;{845.340600002557,806.1041999999434,0.0}
Trams146;14;13;72150;8:45;{2597.49450000003,904.9190000016242,0.0}
Trams142;14;21;72151;8:45;{4722.0763000026345,2426.624300001189,0.0}
Trams141;14;23;72153;8:45;{6271.932036142039,2982.903802087056,0.0}
Trams146;14;17;72158;8:46;{2839.1857000030577,1180.8036000002176,0.0}
Trams142;14;24;72160;8:46;{5123.508700001985,2583.745899999514,0.0}
Trams145;14;9;72165;8:47;{2894.896500002593,514.0241999980062,0.0}
Trams182;18;4;72166;8:47;{2589.0274000018835,1538.5219000000507,0.0}
Trams144;14;3;72166;8:47;{2952.0448504139104,1673.1693294131398,0.0}
Trams146;14;16;72172;8:48;{3084.0353342962862,1747.4296273253601,0.0}
Trams147;14;24;72172;8:48;{5689.812200002372,2815.7713999990374,0.0}
Trams182;18;6;72176;8:49;{2110.2352000027895,1344.0613000001758,0.0}
Trams184;18;11;72176;8:49;{4084.1569000035524,2161.088000001386,0.0}
Trams141;14;22;72177;8:49;{7267.007879060962,3598.2324644667874,0.0}
Trams145;14;12;72177;8:49;{2597.49450000003,904.9190000016242,0.0}
Trams183;18;4;72180;8:50;{2149.2538000009954,1363.784799998626,0.0}
Trams141;14;4;72182;8:50;{7477.508000001311,3581.729000000283,0.0}
Trams141;14;3;72183;8:50;{7477.508000001311,3581.729000000283,0.0}
Trams182;18;5;72184;8:50;{1740.6504000015557,1186.7970000002533,0.0}
Trams145;14;13;72185;8:51;{2839.1857000030577,1180.8036000002176,0.0}
Trams144;14;2;72186;8:51;{2567.6414284064917,825.1840510346515,0.0}
Trams181;18;13;72190;8:51;{4672.309900000691,2395.577299999073,0.0}
Trams183;18;5;72190;8:51;{2627.1466000005603,1561.507400000468,0.0}
Trams184;18;15;72190;8:51;{4722.0763000026345,2426.624300001189,0.0}
Trams142;14;23;72191;8:52;{6593.146138654794,3149.575753243163,0.0}
Trams142;14;24;72192;8:52;{6609.992500003427,3161.7836000006646,0.0}
Trams143;14;3;72192;8:52;{2992.747200001031,1703.0900999996811,0.0}
Trams147;14;23;72192;8:52;{6609.992500003427,3161.7836000006646,0.0}
Trams144;14;4;72196;8:52;{2894.896500002593,514.0241999980062,0.0}
Trams185;18;5;72198;8:53;{7477.508000001311,3581.729000000283,0.0}
Trams147;14;22;72199;8:53;{6883.719200000167,3354.242599999532,0.0}
Trams182;18;4;72203;8:54;{874.5067790792331,818.4381949221134,0.0}
Trams181;18;16;72204;8:54;{4031.8555000014603,2128.9623999986798,0.0}
Trams182;18;5;72204;8:54;{845.340600002557,806.1041999999434,0.0}
Trams182;18;4;72205;8:54;{845.340600002557,806.1041999999434,0.0}
Trams147;14;21;72207;8:54;{7223.311400000006,3570.043500000611,0.0}
Trams144;14;5;72208;8:54;{2597.49450000003,904.9190000016242,0.0}
Trams147;14;20;72208;8:54;{7267.007879060962,3598.2324644667874,0.0}
Trams184;18;24;72211;8:55;{5689.812200002372,2815.7713999990374,0.0}
Trams142;14;6;72213;8:55;{7477.508000001311,3581.729000000283,0.0}
Trams147;14;2;72213;8:55;{7477.508000001311,3581.729000000283,0.0}
Trams141;14;4;72214;8:55;{6188.119100000709,2954.7112999986857,0.0}
Trams144;14;9;72216;8:56;{2839.1857000030577,1180.8036000002176,0.0}
Trams146;14;18;72216;8:56;{5123.508700001985,2583.745899999514,0.0}
Trams184;18;23;72223;8:57;{6271.932036142039,2982.903802087056,0.0}
Trams141;14;6;72226;8:57;{5634.466500002891,2784.006800001487,0.0}
Trams182;18;7;72227;8:58;{1782.5218000002205,1208.6106000002474,0.0}
Trams146;14;22;72228;8:58;{5689.812200002372,2815.7713999990374,0.0}
Trams145;14;15;72234;8:59;{4722.0763000026345,2426.624300001189,0.0}
Trams182;18;10;72235;8:59;{2149.2538000009954,1363.784799998626,0.0}
Trams143;14;5;72235;8:59;{2597.49450000003,904.9190000016242,0.0}
Trams141;14;8;72238;8:59;{5058.904000002891,2546.714799998328,0.0}
Trams146;14;24;72239;9:0;{6221.943900000304,2968.579499999061,0.0}
Trams185;18;6;72242;9:0;{5634.466500002891,2784.006800001487,0.0}
Trams143;14;6;72243;9:0;{2839.1857000030577,1180.8036000002176,0.0}
Trams181;18;15;72245;9:1;{2110.2352000027895,1344.0613000001758,0.0}
Trams182;18;12;72245;9:1;{2627.1466000005603,1561.507400000468,0.0}
Trams146;14;23;72248;9:1;{6609.992500003427,3161.7836000006646,0.0}
Trams184;18;6;72252;9:2;{7477.508000001311,3581.729000000283,0.0}
Trams181;18;14;72253;9:2;{1740.6504000015557,1186.7970000002533,0.0}
Trams184;18;4;72253;9:2;{7477.508000001311,3581.729000000283,0.0}
Trams182;18;11;72254;9:2;{3035.1652000024915,1729.7097000014037,0.0}
Trams185;18;8;72254;9:2;{5058.904000002891,2546.714799998328,0.0}
Trams141;14;7;72259;9:3;{4048.297289360261,2135.7927898531034,0.0}
Trams145;14;24;72266;9:4;{6221.943900000304,2968.579499999061,0.0}
Trams183;18;6;72267;9:4;{6221.943900000304,2968.579499999061,0.0}
Trams146;14;6;72269;9:5;{7477.508000001311,3581.729000000283,0.0}
Trams146;14;5;72270;9:5;{7477.508000001311,3581.729000000283,0.0}
Trams181;18;10;72274;9:5;{845.340600002557,806.1041999999434,0.0}
Trams185;18;10;72276;9:6;{4031.8555000014603,2128.9623999986798,0.0}
Trams141;14;3;72282;9:7;{2992.747200001031,1703.0900999996811,0.0}
Trams183;18;5;72283;9:7;{6883.719200000167,3354.242599999532,0.0}
Trams145;14;6;72296;9:9;{7477.508000001311,3581.729000000283,0.0}
Trams183;18;2;72297;9:9;{7477.508000001311,3581.729000000283,0.0}
Trams145;14;5;72297;9:9;{7477.508000001311,3581.729000000283,0.0}
Trams144;14;8;72298;9:9;{6271.932036142039,2982.903802087056,0.0}
Trams144;14;7;72306;9:11;{6609.992500003427,3161.7836000006646,0.0}
Trams185;18;8;72307;9:11;{2589.0274000018835,1538.5219000000507,0.0}
Trams141;14;4;72313;9:12;{2894.896500002593,514.0241999980062,0.0}
Trams144;14;6;72313;9:12;{6883.719200000167,3354.242599999532,0.0}
Trams182;18;10;72323;9:14;{6271.932036142039,2982.903802087056,0.0}
Trams185;18;7;72325;9:14;{1740.6504000015557,1186.7970000002533,0.0}
Trams185;18;6;72326;9:14;{1692.722305299079,1166.6255241828771,0.0}
Trams144;14;3;72327;9:14;{7477.508000001311,3581.729000000283,0.0}
Trams144;14;2;72328;9:14;{7477.508000001311,3581.729000000283,0.0}
Trams182;18;9;72331;9:15;{6609.992500003427,3161.7836000006646,0.0}
Trams143;14;5;72340;9:16;{6883.719200000167,3354.242599999532,0.0}
Trams185;18;5;72346;9:17;{845.340600002557,806.1041999999434,0.0}
Trams182;18;3;72352;9:18;{7477.508000001311,3581.729000000283,0.0}
Trams143;14;3;72354;9:19;{7477.508000001311,3581.729000000283,0.0}
Trams141;14;3;72444;9:34;{7477.508000001311,3581.729000000283,0.0}
Trams185;18;6;74777;16:3;{4084.1569000035524,2161.088000001386,0.0}
Trams181;18;20;74782;16:3;{7477.508000001311,3581.729000000283,0.0}
Trams181;18;22;74783;16:4;{7446.12100000307,3545.9720000009984,0.0}
Trams144;14;3;74785;16:4;{2992.747200001031,1703.0900999996811,0.0}
Trams184;18;3;74800;16:6;{2627.1466000005603,1561.507400000468,0.0}
Trams141;14;14;74803;16:7;{7477.508000001311,3581.729000000283,0.0}
Trams143;14;4;74812;16:8;{2992.747200001031,1703.0900999996811,0.0}
Trams181;18;21;74814;16:9;{6138.21238208538,2940.1058384544613,0.0}
Trams144;14;2;74816;16:9;{2894.896500002593,514.0241999980062,0.0}
Trams145;14;6;74818;16:9;{3035.1652000024915,1729.7097000014037,0.0}
Trams141;14;15;74819;16:10;{6831.853600002825,3315.144899999723,0.0}
Trams185;18;5;74823;16:10;{6221.943900000304,2968.579499999061,0.0}
Trams181;18;20;74825;16:11;{5634.466500002891,2784.006800001487,0.0}
Trams143;14;3;74825;16:11;{2808.1955000013113,1135.889900000766,0.0}
Trams143;14;2;74833;16:12;{2567.6414284064917,825.1840510346515,0.0}
Trams142;14;15;74834;16:12;{7477.508000001311,3581.729000000283,0.0}
Trams183;18;3;74835;16:12;{2149.2538000009954,1363.784799998626,0.0}
Trams141;14;14;74835;16:12;{6138.21238208538,2940.1058384544613,0.0}
Trams142;14;16;74842;16:13;{7172.43200000003,3532.2607999984175,0.0}
Trams143;14;3;74843;16:14;{2894.896500002593,514.0241999980062,0.0}
Trams181;18;17;74845;16:14;{4672.309900000691,2395.577299999073,0.0}
Trams141;14;13;74845;16:14;{5641.738919684285,2786.998382666919,0.0}
Trams142;14;17;74850;16:15;{6831.853600002825,3315.144899999723,0.0}
Trams185;18;16;74854;16:15;{7477.508000001311,3581.729000000283,0.0}
Trams145;14;5;74854;16:15;{4722.0763000026345,2426.624300001189,0.0}
Trams185;18;18;74855;16:16;{7446.12100000307,3545.9720000009984,0.0}
Trams142;14;18;74857;16:16;{6563.806600000709,3123.2601999994367,0.0}
Trams141;14;14;74858;16:16;{5058.904000002891,2546.714799998328,0.0}
Trams141;14;13;74859;16:16;{5010.473492013262,2527.781076226536,0.0}
Trams182;18;4;74860;16:16;{845.340600002557,806.1041999999434,0.0}
Trams145;14;4;74862;16:17;{5108.905971347362,2577.745680309252,0.0}
Trams141;14;12;74867;16:18;{4624.179771982149,2375.8925514936154,0.0}
Trams185;18;19;74870;16:18;{6831.853600002825,3315.144899999723,0.0}
Trams183;18;2;74876;16:19;{4084.1569000035524,2161.088000001386,0.0}
Trams141;14;13;74880;16:20;{4031.8555000014603,2128.9623999986798,0.0}
Trams181;18;16;74881;16:20;{2992.747200001031,1703.0900999996811,0.0}
Trams185;18;20;74885;16:21;{6188.119100000709,2954.7112999986857,0.0}
Trams181;18;14;74890;16:21;{2589.0274000018835,1538.5219000000507,0.0}
Trams146;14;24;74890;16:21;{7477.508000001311,3581.729000000283,0.0}
Trams185;18;17;74896;16:22;{5641.738919684285,2786.998382666919,0.0}
Trams185;18;15;74897;16:23;{5634.466500002891,2784.006800001487,0.0}
Trams142;14;13;74897;16:23;{4672.309900000691,2395.577299999073,0.0}
Trams181;18;13;74900;16:23;{2110.2352000027895,1344.0613000001758,0.0}
Trams182;18;3;74900;16:23;{2627.1466000005603,1561.507400000468,0.0}
Trams181;18;12;74901;16:23;{2064.0685709043055,1320.5282183098925,0.0}
Trams141;14;14;74902;16:23;{2992.747200001031,1703.0900999996811,0.0}
Trams184;18;9;74908;16:24;{7477.508000001311,3581.729000000283,0.0}
Trams184;18;10;74909;16:25;{7446.12100000307,3545.9720000009984,0.0}
Trams185;18;14;74910;16:25;{5010.473492013262,2527.781076226536,0.0}
Trams142;14;12;74911;16:25;{4031.8555000014603,2128.9623999986798,0.0}
Trams141;14;11;74915;16:26;{2808.1955000013113,1135.889900000766,0.0}
Trams184;18;12;74916;16:26;{7172.43200000003,3532.2607999984175,0.0}
Trams141;14;10;74916;16:26;{2774.94460455129,1095.9101807449765,0.0}
Trams185;18;13;74917;16:26;{4672.309900000691,2395.577299999073,0.0}
Trams145;14;10;74917;16:26;{7477.508000001311,3581.729000000283,0.0}
Trams141;14;11;74922;16:27;{2569.3393000029027,869.8653000015765,0.0}
Trams141;14;8;74923;16:27;{2567.6414284064917,825.1840510346515,0.0}
Trams184;18;13;74924;16:27;{6831.853600002825,3315.144899999723,0.0}
Trams181;18;15;74929;16:28;{845.340600002557,806.1041999999434,0.0}
Trams185;18;12;74931;16:28;{4031.8555000014603,2128.9623999986798,0.0}
Trams146;14;23;74932;16:28;{5641.738919684285,2786.998382666919,0.0}
Trams141;14;4;74933;16:29;{2894.896500002593,514.0241999980062,0.0}
Trams142;14;13;74933;16:29;{2992.747200001031,1703.0900999996811,0.0}
Trams145;14;11;74933;16:29;{6831.853600002825,3315.144899999723,0.0}
Trams146;14;21;74933;16:29;{5634.466500002891,2784.006800001487,0.0}
Trams181;18;17;74939;16:30;{1241.924200002104,980.4126999992877,0.0}
Trams143;14;2;74944;16:30;{6221.943900000304,2968.579499999061,0.0}
Trams146;14;20;74945;16:31;{5058.904000002891,2546.714799998328,0.0}
Trams142;14;12;74946;16:31;{2808.1955000013113,1135.889900000766,0.0}
Trams146;14;19;74946;16:31;{5010.473492013262,2527.781076226536,0.0}
Trams144;14;7;74948;16:31;{7477.508000001311,3581.729000000283,0.0}
Trams184;18;12;74950;16:31;{5641.738919684285,2786.998382666919,0.0}
Trams184;18;11;74951;16:32;{5634.466500002891,2784.006800001487,0.0}
Trams183;18;3;74953;16:32;{7477.508000001311,3581.729000000283,0.0}
Trams141;14;5;74953;16:32;{2839.1857000030577,1180.8036000002176,0.0}
Trams142;14;9;74953;16:32;{2569.3393000029027,869.8653000015765,0.0}
Trams146;14;17;74953;16:32;{4672.309900000691,2395.577299999073,0.0}
Trams142;14;8;74954;16:32;{2567.6414284064917,825.1840510346515,0.0}
Trams185;18;11;74962;16:33;{2589.0274000018835,1538.5219000000507,0.0}
Trams142;14;6;74964;16:34;{2894.896500002593,514.0241999980062,0.0}
Trams146;14;16;74967;16:34;{4031.8555000014603,2128.9623999986798,0.0}
Trams183;18;5;74969;16:35;{6831.853600002825,3315.144899999723,0.0}
Trams184;18;10;74972;16:35;{4624.179771982149,2375.8925514936154,0.0}
Trams185;18;10;74972;16:35;{2110.2352000027895,1344.0613000001758,0.0}
Trams185;18;9;74973;16:35;{2064.0685709043055,1320.5282183098925,0.0}
Trams145;14;10;74973;16:35;{5010.473492013262,2527.781076226536,0.0}
Trams143;14;11;74975;16:36;{7477.508000001311,3581.729000000283,0.0}
Trams185;18;6;74980;16:36;{1740.6504000015557,1186.7970000002533,0.0}
Trams185;18;5;74981;16:37;{1692.722305299079,1166.6255241828771,0.0}
Trams146;14;17;74989;16:38;{2992.747200001031,1703.0900999996811,0.0}
Trams144;14;6;74990;16:38;{5641.738919684285,2786.998382666919,0.0}
Trams143;14;12;74991;16:38;{6831.853600002825,3315.144899999723,0.0}
Trams144;14;7;74991;16:38;{5634.466500002891,2784.006800001487,0.0}
Trams185;18;9;75001;16:40;{845.340600002557,806.1041999999434,0.0}
Trams146;14;14;75002;16:40;{2808.1955000013113,1135.889900000766,0.0}
Trams146;14;12;75003;16:40;{2774.94460455129,1095.9101807449765,0.0}
Trams144;14;6;75004;16:40;{5010.473492013262,2527.781076226536,0.0}
Trams184;18;12;75007;16:41;{2992.747200001031,1703.0900999996811,0.0}
Trams182;18;18;75008;16:41;{7477.508000001311,3581.729000000283,0.0}
Trams146;14;11;75009;16:41;{2569.3393000029027,869.8653000015765,0.0}
Trams146;14;9;75010;16:41;{2567.6414284064917,825.1840510346515,0.0}
Trams185;18;10;75011;16:42;{1241.924200002104,980.4126999992877,0.0}
Trams181;18;16;75014;16:42;{4722.0763000026345,2426.624300001189,0.0}
Trams184;18;10;75016;16:42;{2589.0274000018835,1538.5219000000507,0.0}
Trams143;14;11;75018;16:43;{5634.466500002891,2784.006800001487,0.0}
Trams146;14;10;75019;16:43;{2894.896500002593,514.0241999980062,0.0}
Trams146;14;7;75020;16:43;{2894.896500002593,514.0241999980062,0.0}
Trams181;18;15;75022;16:43;{5108.905971347362,2577.745680309252,0.0}
Trams144;14;5;75025;16:44;{4031.8555000014603,2128.9623999986798,0.0}
Trams184;18;9;75027;16:44;{2064.0685709043055,1320.5282183098925,0.0}
Trams145;14;8;75029;16:45;{2808.1955000013113,1135.889900000766,0.0}
Trams143;14;10;75030;16:45;{5058.904000002891,2546.714799998328,0.0}
Trams143;14;9;75031;16:45;{5010.473492013262,2527.781076226536,0.0}
Trams184;18;5;75034;16:45;{1740.6504000015557,1186.7970000002533,0.0}
Trams181;18;13;75036;16:46;{5739.764803540053,2830.2159521656795,0.0}
Trams145;14;6;75037;16:46;{2567.6414284064917,825.1840510346515,0.0}
Trams143;14;8;75038;16:46;{4672.309900000691,2395.577299999073,0.0}
Trams182;18;19;75039;16:46;{6188.119100000709,2954.7112999986857,0.0}
Trams182;18;18;75040;16:46;{6138.21238208538,2940.1058384544613,0.0}
Trams185;18;8;75042;16:47;{2675.4015184145933,1580.8842637522473,0.0}
Trams181;18;11;75046;16:47;{6221.943900000304,2968.579499999061,0.0}
Trams145;14;5;75047;16:48;{2894.896500002593,514.0241999980062,0.0}
Trams185;18;9;75050;16:48;{3035.1652000024915,1729.7097000014037,0.0}
Trams184;18;6;75055;16:49;{845.340600002557,806.1041999999434,0.0}
Trams182;18;17;75063;16:50;{5058.904000002891,2546.714799998328,0.0}
Trams182;18;16;75064;16:50;{5010.473492013262,2527.781076226536,0.0}
Trams184;18;7;75065;16:51;{1241.924200002104,980.4126999992877,0.0}
Trams141;14;24;75065;16:51;{7477.508000001311,3581.729000000283,0.0}
Trams144;14;4;75067;16:51;{2569.3393000029027,869.8653000015765,0.0}
Trams144;14;3;75068;16:51;{2567.6414284064917,825.1840510346515,0.0}
Trams182;18;15;75071;16:52;{4672.309900000691,2395.577299999073,0.0}
Trams183;18;3;75071;16:52;{2110.2352000027895,1344.0613000001758,0.0}
Trams182;18;14;75072;16:52;{4624.179771982149,2375.8925514936154,0.0}
Trams183;18;2;75072;16:52;{2064.0685709043055,1320.5282183098925,0.0}
Trams181;18;24;75077;16:53;{7477.508000001311,3581.729000000283,0.0}
Trams144;14;2;75078;16:53;{2894.896500002593,514.0241999980062,0.0}
Trams182;18;13;75085;16:54;{4031.8555000014603,2128.9623999986798,0.0}
Trams185;18;7;75086;16:54;{4722.0763000026345,2426.624300001189,0.0}
Trams143;14;7;75088;16:54;{2774.94460455129,1095.9101807449765,0.0}
Trams185;18;6;75094;16:55;{5108.905971347362,2577.745680309252,0.0}
Trams143;14;6;75094;16:55;{2569.3393000029027,869.8653000015765,0.0}
Trams184;18;6;75095;16:56;{2627.1466000005603,1561.507400000468,0.0}
Trams143;14;4;75095;16:56;{2567.6414284064917,825.1840510346515,0.0}
Trams142;14;23;75096;16:56;{7477.508000001311,3581.729000000283,0.0}
Trams141;14;23;75097;16:56;{6138.21238208538,2940.1058384544613,0.0}
Trams142;14;24;75104;16:57;{7172.43200000003,3532.2607999984175,0.0}
Trams147;14;3;75104;16:57;{7172.43200000003,3532.2607999984175,0.0}
Trams143;14;2;75105;16:57;{2894.896500002593,514.0241999980062,0.0}
Trams182;18;14;75107;16:58;{2992.747200001031,1703.0900999996811,0.0}
Trams141;14;19;75107;16:58;{5641.738919684285,2786.998382666919,0.0}
Trams141;14;18;75108;16:58;{5634.466500002891,2784.006800001487,0.0}
Trams182;18;12;75116;16:59;{2589.0274000018835,1538.5219000000507,0.0}
Trams185;18;5;75118;16:59;{6221.943900000304,2968.579499999061,0.0}
Trams147;14;5;75119;17:0;{6563.806600000709,3123.2601999994367,0.0}
Trams182;18;11;75126;17:1;{2110.2352000027895,1344.0613000001758,0.0}
Trams184;18;7;75126;17:1;{4084.1569000035524,2161.088000001386,0.0}
Trams182;18;8;75127;17:1;{2064.0685709043055,1320.5282183098925,0.0}
Trams147;14;7;75127;17:1;{6188.119100000709,2954.7112999986857,0.0}
Trams141;14;19;75128;17:1;{4672.309900000691,2395.577299999073,0.0}
Trams181;18;22;75133;17:2;{5010.473492013262,2527.781076226536,0.0}
Trams182;18;5;75134;17:2;{1740.6504000015557,1186.7970000002533,0.0}
Trams182;18;4;75135;17:2;{1692.722305299079,1166.6255241828771,0.0}
Trams184;18;6;75139;17:3;{4707.823850244834,2420.7529164061234,0.0}
Trams142;14;22;75139;17:3;{5634.466500002891,2784.006800001487,0.0}
Trams181;18;20;75140;17:3;{4672.309900000691,2395.577299999073,0.0}
Trams183;18;3;75140;17:3;{2627.1466000005603,1561.507400000468,0.0}
Trams181;18;18;75141;17:3;{4624.179771982149,2375.8925514936154,0.0}
Trams141;14;20;75142;17:3;{4031.8555000014603,2128.9623999986798,0.0}
Trams184;18;5;75148;17:4;{5108.905971347362,2577.745680309252,0.0}
Trams185;18;24;75149;17:5;{7477.508000001311,3581.729000000283,0.0}
Trams142;14;20;75152;17:5;{5010.473492013262,2527.781076226536,0.0}
Trams146;14;24;75152;17:5;{7477.508000001311,3581.729000000283,0.0}
Trams181;18;17;75154;17:5;{4031.8555000014603,2128.9623999986798,0.0}
Trams182;18;9;75155;17:6;{845.340600002557,806.1041999999434,0.0}
Trams142;14;18;75159;17:6;{4672.309900000691,2395.577299999073,0.0}
Trams147;14;6;75159;17:6;{4672.309900000691,2395.577299999073,0.0}
Trams142;14;15;75160;17:6;{4624.179771982149,2375.8925514936154,0.0}
Trams141;14;19;75164;17:7;{2992.747200001031,1703.0900999996811,0.0}
Trams142;14;16;75173;17:9;{4031.8555000014603,2128.9623999986798,0.0}
Trams141;14;18;75177;17:9;{2808.1955000013113,1135.889900000766,0.0}
Trams141;14;13;75178;17:9;{2774.94460455129,1095.9101807449765,0.0}
Trams145;14;24;75179;17:10;{7477.508000001311,3581.729000000283,0.0}
Trams185;18;22;75181;17:10;{6138.21238208538,2940.1058384544613,0.0}
Trams141;14;11;75184;17:10;{2569.3393000029027,869.8653000015765,0.0}
Trams181;18;14;75185;17:11;{2589.0274000018835,1538.5219000000507,0.0}
Trams141;14;8;75185;17:11;{2567.6414284064917,825.1840510346515,0.0}
Trams185;18;21;75191;17:12;{5641.738919684285,2786.998382666919,0.0}
Trams185;18;19;75192;17:12;{5634.466500002891,2784.006800001487,0.0}
Trams146;14;23;75194;17:12;{5641.738919684285,2786.998382666919,0.0}
Trams181;18;12;75195;17:12;{2110.2352000027895,1344.0613000001758,0.0}
Trams182;18;10;75195;17:12;{2627.1466000005603,1561.507400000468,0.0}
Trams141;14;6;75195;17:12;{2894.896500002593,514.0241999980062,0.0}
Trams181;18;11;75196;17:12;{2064.0685709043055,1320.5282183098925,0.0}
Trams181;18;10;75203;17:14;{1740.6504000015557,1186.7970000002533,0.0}
Trams184;18;24;75203;17:14;{7477.508000001311,3581.729000000283,0.0}
Trams185;18;15;75204;17:14;{5058.904000002891,2546.714799998328,0.0}
Trams183;18;2;75207;17:14;{5739.764803540053,2830.2159521656795,0.0}
Trams146;14;20;75208;17:14;{5010.473492013262,2527.781076226536,0.0}
Trams142;14;14;75209;17:15;{2774.94460455129,1095.9101807449765,0.0}
Trams144;14;24;75210;17:15;{7477.508000001311,3581.729000000283,0.0}
Trams145;14;22;75211;17:15;{6138.21238208538,2940.1058384544613,0.0}
Trams185;18;14;75213;17:15;{4624.179771982149,2375.8925514936154,0.0}
Trams146;14;17;75215;17:16;{4672.309900000691,2395.577299999073,0.0}
Trams142;14;11;75216;17:16;{2567.6414284064917,825.1840510346515,0.0}
Trams146;14;16;75216;17:16;{4624.179771982149,2375.8925514936154,0.0}
Trams145;14;19;75221;17:17;{5641.738919684285,2786.998382666919,0.0}
Trams181;18;15;75224;17:17;{845.340600002557,806.1041999999434,0.0}
Trams185;18;12;75226;17:17;{4031.8555000014603,2128.9623999986798,0.0}
Trams142;14;7;75226;17:17;{2894.896500002593,514.0241999980062,0.0}
Trams147;14;2;75226;17:17;{2894.896500002593,514.0241999980062,0.0}
Trams141;14;7;75228;17:18;{3035.1652000024915,1729.7097000014037,0.0}
Trams146;14;17;75229;17:18;{4031.8555000014603,2128.9623999986798,0.0}
Trams181;18;16;75234;17:19;{1241.924200002104,980.4126999992877,0.0}
Trams145;14;16;75234;17:19;{5058.904000002891,2546.714799998328,0.0}
Trams145;14;15;75235;17:19;{5010.473492013262,2527.781076226536,0.0}
Trams143;14;23;75237;17:19;{7477.508000001311,3581.729000000283,0.0}
Trams182;18;9;75240;17:20;{4722.0763000026345,2426.624300001189,0.0}
Trams144;14;23;75242;17:20;{6138.21238208538,2940.1058384544613,0.0}
Trams184;18;23;75245;17:21;{5641.738919684285,2786.998382666919,0.0}
Trams143;14;24;75245;17:21;{7172.43200000003,3532.2607999984175,0.0}
Trams181;18;17;75246;17:21;{1782.5218000002205,1208.6106000002474,0.0}
Trams184;18;22;75246;17:21;{5634.466500002891,2784.006800001487,0.0}
Trams183;18;24;75248;17:21;{7477.508000001311,3581.729000000283,0.0}
Trams182;18;7;75249;17:21;{5123.508700001985,2583.745899999514,0.0}
Trams141;14;8;75250;17:21;{4084.1569000035524,2161.088000001386,0.0}
Trams144;14;22;75252;17:22;{5641.738919684285,2786.998382666919,0.0}
Trams181;18;18;75254;17:22;{2149.2538000009954,1363.784799998626,0.0}
Trams181;18;17;75255;17:22;{2197.307743831217,1383.6548398164498,0.0}
Trams145;14;16;75256;17:22;{4031.8555000014603,2128.9623999986798,0.0}
Trams185;18;11;75257;17:23;{2589.0274000018835,1538.5219000000507,0.0}
Trams184;18;17;75259;17:23;{5010.473492013262,2527.781076226536,0.0}
Trams142;14;8;75259;17:23;{3035.1652000024915,1729.7097000014037,0.0}
Trams146;14;14;75264;17:24;{2808.1955000013113,1135.889900000766,0.0}
Trams144;14;21;75265;17:24;{5058.904000002891,2546.714799998328,0.0}
Trams184;18;15;75266;17:24;{4672.309900000691,2395.577299999073,0.0}
Trams185;18;10;75267;17:24;{2110.2352000027895,1344.0613000001758,0.0}
Trams185;18;9;75268;17:24;{2064.0685709043055,1320.5282183098925,0.0}
Trams146;14;13;75271;17:25;{2569.3393000029027,869.8653000015765,0.0}
Trams182;18;5;75272;17:25;{6221.943900000304,2968.579499999061,0.0}
Trams141;14;7;75272;17:25;{5108.905971347362,2577.745680309252,0.0}
Trams146;14;10;75272;17:25;{2567.6414284064917,825.1840510346515,0.0}
Trams144;14;20;75273;17:25;{4672.309900000691,2395.577299999073,0.0}
Trams144;14;19;75274;17:25;{4624.179771982149,2375.8925514936154,0.0}
Trams185;18;7;75275;17:26;{1740.6504000015557,1186.7970000002533,0.0}
Trams185;18;6;75276;17:26;{1692.722305299079,1166.6255241828771,0.0}
Trams143;14;22;75279;17:26;{5641.738919684285,2786.998382666919,0.0}
Trams143;14;21;75280;17:26;{5634.466500002891,2784.006800001487,0.0}
Trams146;14;7;75282;17:27;{2894.896500002593,514.0241999980062,0.0}
Trams144;14;20;75287;17:28;{4031.8555000014603,2128.9623999986798,0.0}
Trams145;14;15;75291;17:28;{2808.1955000013113,1135.889900000766,0.0}
Trams145;14;11;75292;17:28;{2774.94460455129,1095.9101807449765,0.0}
Trams143;14;18;75293;17:29;{5010.473492013262,2527.781076226536,0.0}
Trams142;14;7;75295;17:29;{4722.0763000026345,2426.624300001189,0.0}
Trams185;18;9;75296;17:29;{845.340600002557,806.1041999999434,0.0}
Trams141;14;6;75296;17:29;{6221.943900000304,2968.579499999061,0.0}
Trams145;14;9;75299;17:30;{2567.6414284064917,825.1840510346515,0.0}
Trams143;14;12;75300;17:30;{4672.309900000691,2395.577299999073,0.0}
Trams143;14;11;75301;17:30;{4624.179771982149,2375.8925514936154,0.0}
Trams182;18;24;75303;17:30;{7477.508000001311,3581.729000000283,0.0}
Trams185;18;10;75306;17:31;{1241.924200002104,980.4126999992877,0.0}
Trams181;18;15;75308;17:31;{4707.823850244834,2420.7529164061234,0.0}
Trams144;14;21;75309;17:31;{2992.747200001031,1703.0900999996811,0.0}
Trams145;14;6;75309;17:31;{2894.896500002593,514.0241999980062,0.0}
Trams183;18;21;75311;17:32;{4672.309900000691,2395.577299999073,0.0}
Trams184;18;11;75311;17:32;{2589.0274000018835,1538.5219000000507,0.0}
Trams181;18;13;75317;17:33;{5108.905971347362,2577.745680309252,0.0}
Trams181;18;12;75318;17:33;{5123.508700001985,2583.745899999514,0.0}
Trams184;18;7;75321;17:33;{2110.2352000027895,1344.0613000001758,0.0}
Trams184;18;4;75322;17:33;{2064.0685709043055,1320.5282183098925,0.0}
Trams144;14;19;75322;17:33;{2808.1955000013113,1135.889900000766,0.0}
Trams144;14;17;75323;17:34;{2774.94460455129,1095.9101807449765,0.0}
Trams183;18;22;75325;17:34;{4031.8555000014603,2128.9623999986798,0.0}
Trams141;14;24;75327;17:34;{7477.508000001311,3581.729000000283,0.0}
Trams184;18;3;75329;17:35;{1740.6504000015557,1186.7970000002533,0.0}
Trams144;14;16;75329;17:35;{2569.3393000029027,869.8653000015765,0.0}
Trams181;18;10;75330;17:35;{5689.812200002372,2815.7713999990374,0.0}
Trams144;14;11;75330;17:35;{2567.6414284064917,825.1840510346515,0.0}
Trams181;18;9;75331;17:35;{5739.764803540053,2830.2159521656795,0.0}
Trams182;18;22;75335;17:36;{6138.21238208538,2940.1058384544613,0.0}
Trams185;18;11;75336;17:36;{2627.1466000005603,1561.507400000468,0.0}
Trams143;14;12;75336;17:36;{2992.747200001031,1703.0900999996811,0.0}
Trams146;14;8;75337;17:36;{4084.1569000035524,2161.088000001386,0.0}
Trams144;14;12;75339;17:36;{2894.896500002593,514.0241999980062,0.0}
Trams144;14;5;75340;17:36;{2894.896500002593,514.0241999980062,0.0}
Trams182;18;19;75345;17:37;{5641.738919684285,2786.998382666919,0.0}
Trams182;18;20;75346;17:37;{5634.466500002891,2784.006800001487,0.0}
Trams184;18;6;75350;17:38;{845.340600002557,806.1041999999434,0.0}
Trams143;14;10;75350;17:38;{2774.94460455129,1095.9101807449765,0.0}
Trams183;18;19;75356;17:39;{2589.0274000018835,1538.5219000000507,0.0}
Trams143;14;8;75356;17:39;{2569.3393000029027,869.8653000015765,0.0}
Trams143;14;6;75357;17:39;{2567.6414284064917,825.1840510346515,0.0}
Trams182;18;17;75358;17:39;{5058.904000002891,2546.714799998328,0.0}
Trams142;14;24;75358;17:39;{7477.508000001311,3581.729000000283,0.0}
Trams147;14;24;75358;17:39;{7477.508000001311,3581.729000000283,0.0}
Trams182;18;16;75366;17:41;{4672.309900000691,2395.577299999073,0.0}
Trams183;18;16;75366;17:41;{2110.2352000027895,1344.0613000001758,0.0}
Trams143;14;7;75366;17:41;{2894.896500002593,514.0241999980062,0.0}
Trams182;18;14;75367;17:41;{4624.179771982149,2375.8925514936154,0.0}
Trams183;18;9;75367;17:41;{2064.0685709043055,1320.5282183098925,0.0}
Trams143;14;3;75367;17:41;{2894.896500002593,514.0241999980062,0.0}
Trams181;18;24;75372;17:42;{7477.508000001311,3581.729000000283,0.0}
Trams146;14;7;75372;17:42;{5689.812200002372,2815.7713999990374,0.0}
Trams183;18;2;75374;17:42;{1740.6504000015557,1186.7970000002533,0.0}
Trams182;18;12;75380;17:43;{4031.8555000014603,2128.9623999986798,0.0}
Trams185;18;10;75380;17:43;{4707.823850244834,2420.7529164061234,0.0}
Trams185;18;9;75381;17:43;{4722.0763000026345,2426.624300001189,0.0}
Trams141;14;23;75382;17:43;{5058.904000002891,2546.714799998328,0.0}
Trams184;18;5;75390;17:45;{2627.1466000005603,1561.507400000468,0.0}
Trams185;18;8;75390;17:45;{5123.508700001985,2583.745899999514,0.0}
Trams142;14;23;75390;17:45;{6138.21238208538,2940.1058384544613,0.0}
Trams183;18;5;75395;17:46;{845.340600002557,806.1041999999434,0.0}
Trams142;14;22;75401;17:47;{5634.466500002891,2784.006800001487,0.0}
Trams185;18;7;75402;17:47;{5689.812200002372,2815.7713999990374,0.0}
Trams185;18;6;75403;17:47;{5739.764803540053,2830.2159521656795,0.0}
Trams141;14;24;75404;17:47;{4031.8555000014603,2128.9623999986798,0.0}
Trams182;18;9;75411;17:48;{2589.0274000018835,1538.5219000000507,0.0}
Trams146;14;24;75414;17:49;{7477.508000001311,3581.729000000283,0.0}
Trams147;14;21;75414;17:49;{5010.473492013262,2527.781076226536,0.0}
Trams181;18;22;75415;17:49;{5634.466500002891,2784.006800001487,0.0}
Trams147;14;17;75421;17:50;{4672.309900000691,2395.577299999073,0.0}
Trams182;18;6;75422;17:50;{2064.0685709043055,1320.5282183098925,0.0}
Trams142;14;21;75422;17:50;{4624.179771982149,2375.8925514936154,0.0}
Trams183;18;3;75426;17:51;{2197.307743831217,1383.6548398164498,0.0}
Trams181;18;20;75428;17:51;{5010.473492013262,2527.781076226536,0.0}
Trams182;18;5;75429;17:51;{1740.6504000015557,1186.7970000002533,0.0}
Trams181;18;18;75435;17:52;{4672.309900000691,2395.577299999073,0.0}
Trams142;14;23;75435;17:52;{4031.8555000014603,2128.9623999986798,0.0}
Trams141;14;19;75439;17:53;{2808.1955000013113,1135.889900000766,0.0}
Trams141;14;18;75440;17:53;{2774.94460455129,1095.9101807449765,0.0}
Trams145;14;24;75441;17:53;{7477.508000001311,3581.729000000283,0.0}
Trams184;18;4;75443;17:54;{5108.905971347362,2577.745680309252,0.0}
Trams185;18;24;75444;17:54;{7477.508000001311,3581.729000000283,0.0}
Trams141;14;14;75446;17:54;{2569.3393000029027,869.8653000015765,0.0}
Trams141;14;8;75447;17:54;{2567.6414284064917,825.1840510346515,0.0}
Trams181;18;19;75449;17:55;{4031.8555000014603,2128.9623999986798,0.0}
Trams182;18;10;75450;17:55;{845.340600002557,806.1041999999434,0.0}
Trams146;14;23;75456;17:56;{5641.738919684285,2786.998382666919,0.0}
Trams184;18;3;75457;17:56;{5739.764803540053,2830.2159521656795,0.0}
Trams141;14;6;75457;17:56;{2894.896500002593,514.0241999980062,0.0}
Trams142;14;24;75457;17:56;{2992.747200001031,1703.0900999996811,0.0}
Trams146;14;24;75457;17:56;{5634.466500002891,2784.006800001487,0.0}
Trams183;18;4;75466;17:57;{4084.1569000035524,2161.088000001386,0.0}
Trams146;14;21;75469;17:58;{5058.904000002891,2546.714799998328,0.0}
Trams142;14;17;75470;17:58;{2808.1955000013113,1135.889900000766,0.0}
Trams142;14;13;75471;17:58;{2774.94460455129,1095.9101807449765,0.0}
Trams147;14;16;75471;17:58;{2774.94460455129,1095.9101807449765,0.0}
Trams181;18;18;75472;17:58;{2942.963136644313,1688.2069726773154,0.0}
Trams182;18;12;75472;17:58;{1782.5218000002205,1208.6106000002474,0.0}
Trams144;14;24;75472;17:58;{7477.508000001311,3581.729000000283,0.0}
Trams145;14;23;75473;17:59;{6138.21238208538,2940.1058384544613,0.0}
Trams142;14;14;75477;17:59;{2569.3393000029027,869.8653000015765,0.0}
Trams146;14;20;75477;17:59;{4672.309900000691,2395.577299999073,0.0}
Trams147;14;7;75477;17:59;{2569.3393000029027,869.8653000015765,0.0}
Trams142;14;9;75478;17:59;{2567.6414284064917,825.1840510346515,0.0}
Trams147;14;3;75478;17:59;{2567.6414284064917,825.1840510346515,0.0}
Trams181;18;14;75480;18:0;{2589.0274000018835,1538.5219000000507,0.0}
Trams182;18;11;75480;18:0;{2149.2538000009954,1363.784799998626,0.0}
Trams145;14;21;75483;18:0;{5641.738919684285,2786.998382666919,0.0}
Trams145;14;20;75484;18:0;{5634.466500002891,2784.006800001487,0.0}
Trams185;18;23;75486;18:1;{5641.738919684285,2786.998382666919,0.0}
Trams142;14;8;75488;18:1;{2894.896500002593,514.0241999980062,0.0}
Trams147;14;1;75488;18:1;{2894.896500002593,514.0241999980062,0.0}
Trams181;18;11;75490;18:1;{2110.2352000027895,1344.0613000001758,0.0}
Trams181;18;10;75491;18:2;{2064.0685709043055,1320.5282183098925,0.0}
Trams182;18;10;75491;18:2;{2675.4015184145933,1580.8842637522473,0.0}
Trams146;14;21;75491;18:2;{4031.8555000014603,2128.9623999986798,0.0}
Trams145;14;19;75496;18:2;{5058.904000002891,2546.714799998328,0.0}
Trams181;18;9;75498;18:3;{1740.6504000015557,1186.7970000002533,0.0}
Trams184;18;24;75498;18:3;{7477.508000001311,3581.729000000283,0.0}
Trams185;18;22;75499;18:3;{5058.904000002891,2546.714799998328,0.0}
Trams143;14;24;75499;18:3;{7477.508000001311,3581.729000000283,0.0}
Trams185;18;17;75500;18:3;{5010.473492013262,2527.781076226536,0.0}
Trams183;18;3;75501;18:3;{5689.812200002372,2815.7713999990374,0.0}
Trams144;14;23;75504;18:4;{6138.21238208538,2940.1058384544613,0.0}
Trams185;18;14;75507;18:4;{4672.309900000691,2395.577299999073,0.0}
Trams181;18;8;75509;18:5;{1213.7785956119094,964.194963392883,0.0}
Trams146;14;23;75513;18:5;{2992.747200001031,1703.0900999996811,0.0}
Trams144;14;21;75515;18:6;{5634.466500002891,2784.006800001487,0.0}
Trams181;18;9;75519;18:6;{845.340600002557,806.1041999999434,0.0}
Trams182;18;11;75521;18:7;{4084.1569000035524,2161.088000001386,0.0}
Trams146;14;17;75526;18:7;{2808.1955000013113,1135.889900000766,0.0}
Trams144;14;18;75527;18:8;{5058.904000002891,2546.714799998328,0.0}
Trams146;14;14;75527;18:8;{2774.94460455129,1095.9101807449765,0.0}
Trams146;14;12;75533;18:9;{2569.3393000029027,869.8653000015765,0.0}
Trams146;14;10;75534;18:9;{2567.6414284064917,825.1840510346515,0.0}
Trams182;18;10;75535;18:9;{4722.0763000026345,2426.624300001189,0.0}
Trams181;18;10;75541;18:10;{1782.5218000002205,1208.6106000002474,0.0}
Trams183;18;24;75543;18:10;{7477.508000001311,3581.729000000283,0.0}
Trams182;18;9;75544;18:10;{5123.508700001985,2583.745899999514,0.0}
Trams146;14;8;75544;18:10;{2894.896500002593,514.0241999980062,0.0}
Trams181;18;9;75549;18:11;{2149.2538000009954,1363.784799998626,0.0}
Trams185;18;9;75552;18:12;{2589.0274000018835,1538.5219000000507,0.0}
Trams184;18;23;75553;18:12;{5058.904000002891,2546.714799998328,0.0}
Trams145;14;20;75553;18:12;{2808.1955000013113,1135.889900000766,0.0}
Trams184;18;12;75554;18:12;{5010.473492013262,2527.781076226536,0.0}
Trams145;14;18;75554;18:12;{2774.94460455129,1095.9101807449765,0.0}
Trams143;14;21;75555;18:12;{5010.473492013262,2527.781076226536,0.0}
Trams182;18;8;75557;18:13;{5739.764803540053,2830.2159521656795,0.0}
Trams181;18;10;75559;18:13;{2627.1466000005603,1561.507400000468,0.0}
Trams145;14;15;75560;18:13;{2569.3393000029027,869.8653000015765,0.0}
Trams184;18;10;75561;18:13;{4672.309900000691,2395.577299999073,0.0}
Trams145;14;12;75561;18:13;{2567.6414284064917,825.1840510346515,0.0}
Trams184;18;8;75562;18:13;{4624.179771982149,2375.8925514936154,0.0}
Trams185;18;8;75562;18:13;{2110.2352000027895,1344.0613000001758,0.0}
Trams143;14;17;75562;18:13;{4672.309900000691,2395.577299999073,0.0}
Trams185;18;7;75563;18:14;{2064.0685709043055,1320.5282183098925,0.0}
Trams143;14;15;75563;18:14;{4624.179771982149,2375.8925514936154,0.0}
Trams182;18;6;75567;18:14;{6221.943900000304,2968.579499999061,0.0}
Trams181;18;11;75568;18:14;{3035.1652000024915,1729.7097000014037,0.0}
Trams185;18;6;75570;18:15;{1740.6504000015557,1186.7970000002533,0.0}
Trams145;14;11;75571;18:15;{2894.896500002593,514.0241999980062,0.0}
Trams183;18;23;75575;18:16;{6138.21238208538,2940.1058384544613,0.0}
Trams184;18;7;75575;18:16;{4031.8555000014603,2128.9623999986798,0.0}
Trams142;14;7;75578;18:16;{5689.812200002372,2815.7713999990374,0.0}
Trams144;14;17;75584;18:17;{2808.1955000013113,1135.889900000766,0.0}
Trams183;18;22;75585;18:17;{5641.738919684285,2786.998382666919,0.0}
Trams183;18;23;75586;18:17;{5634.466500002891,2784.006800001487,0.0}
Trams141;14;24;75589;18:18;{7477.508000001311,3581.729000000283,0.0}
Trams185;18;11;75591;18:18;{845.340600002557,806.1041999999434,0.0}
Trams144;14;12;75591;18:18;{2569.3393000029027,869.8653000015765,0.0}
Trams145;14;12;75591;18:18;{2839.1857000030577,1180.8036000002176,0.0}
Trams144;14;10;75592;18:18;{2567.6414284064917,825.1840510346515,0.0}
Trams182;18;24;75598;18:19;{7477.508000001311,3581.729000000283,0.0}
Trams183;18;18;75599;18:20;{5010.473492013262,2527.781076226536,0.0}
Trams185;18;12;75601;18:20;{1241.924200002104,980.4126999992877,0.0}
Trams144;14;6;75602;18:20;{2894.896500002593,514.0241999980062,0.0}
Trams181;18;9;75604;18:20;{4722.0763000026345,2426.624300001189,0.0}
Trams183;18;11;75606;18:21;{4672.309900000691,2395.577299999073,0.0}
Trams183;18;10;75607;18:21;{4624.179771982149,2375.8925514936154,0.0}
Trams143;14;11;75611;18:22;{2808.1955000013113,1135.889900000766,0.0}
Trams181;18;8;75612;18:22;{5108.905971347362,2577.745680309252,0.0}
Trams143;14;10;75612;18:22;{2774.94460455129,1095.9101807449765,0.0}
Trams185;18;13;75613;18:22;{1782.5218000002205,1208.6106000002474,0.0}
Trams184;18;6;75616;18:22;{2110.2352000027895,1344.0613000001758,0.0}
Trams143;14;9;75618;18:23;{2569.3393000029027,869.8653000015765,0.0}
Trams143;14;6;75619;18:23;{2567.6414284064917,825.1840510346515,0.0}
Trams183;18;8;75620;18:23;{4031.8555000014603,2128.9623999986798,0.0}
Trams142;14;24;75620;18:23;{7477.508000001311,3581.729000000283,0.0}
Trams147;14;24;75620;18:23;{7477.508000001311,3581.729000000283,0.0}
Trams141;14;23;75621;18:23;{6138.21238208538,2940.1058384544613,0.0}
Trams185;18;12;75622;18:23;{2197.307743831217,1383.6548398164498,0.0}
Trams144;14;5;75622;18:23;{2839.1857000030577,1180.8036000002176,0.0}
Trams184;18;5;75624;18:24;{1740.6504000015557,1186.7970000002533,0.0}
Trams184;18;4;75625;18:24;{1692.722305299079,1166.6255241828771,0.0}
Trams181;18;7;75626;18:24;{5739.764803540053,2830.2159521656795,0.0}
Trams143;14;7;75628;18:24;{2894.896500002593,514.0241999980062,0.0}
Trams143;14;4;75629;18:25;{2894.896500002593,514.0241999980062,0.0}
Trams182;18;23;75630;18:25;{6138.21238208538,2940.1058384544613,0.0}
Trams185;18;13;75631;18:25;{2627.1466000005603,1561.507400000468,0.0}
Trams144;14;6;75635;18:26;{3035.1652000024915,1729.7097000014037,0.0}
Trams182;18;22;75640;18:26;{5641.738919684285,2786.998382666919,0.0}
Trams182;18;21;75641;18:27;{5634.466500002891,2784.006800001487,0.0}
Trams141;14;24;75644;18:27;{5058.904000002891,2546.714799998328,0.0}
Trams184;18;5;75645;18:27;{845.340600002557,806.1041999999434,0.0}
Trams183;18;6;75651;18:28;{2589.0274000018835,1538.5219000000507,0.0}
Trams141;14;23;75652;18:28;{4672.309900000691,2395.577299999073,0.0}
Trams147;14;21;75652;18:28;{6138.21238208538,2940.1058384544613,0.0}
Trams182;18;18;75654;18:29;{5010.473492013262,2527.781076226536,0.0}
Trams184;18;6;75655;18:29;{1241.924200002104,980.4126999992877,0.0}
Trams182;18;12;75661;18:30;{4672.309900000691,2395.577299999073,0.0}
Trams145;14;11;75661;18:30;{5689.812200002372,2815.7713999990374,0.0}
Trams183;18;5;75662;18:30;{2064.0685709043055,1320.5282183098925,0.0}
Trams147;14;20;75662;18:30;{5641.738919684285,2786.998382666919,0.0}
Trams142;14;23;75663;18:30;{5634.466500002891,2784.006800001487,0.0}
Trams147;14;12;75663;18:30;{5634.466500002891,2784.006800001487,0.0}
Trams181;18;24;75667;18:31;{7477.508000001311,3581.729000000283,0.0}
Trams184;18;7;75667;18:31;{1782.5218000002205,1208.6106000002474,0.0}
Trams183;18;4;75669;18:31;{1740.6504000015557,1186.7970000002533,0.0}
Trams184;18;6;75675;18:32;{2149.2538000009954,1363.784799998626,0.0}
Trams185;18;10;75676;18:32;{4722.0763000026345,2426.624300001189,0.0}
Trams142;14;22;75676;18:32;{5010.473492013262,2527.781076226536,0.0}
Trams146;14;24;75676;18:32;{7477.508000001311,3581.729000000283,0.0}
Trams144;14;5;75680;18:33;{5123.508700001985,2583.745899999514,0.0}
Trams142;14;23;75683;18:34;{4672.309900000691,2395.577299999073,0.0}
Trams185;18;9;75684;18:34;{5108.905971347362,2577.745680309252,0.0}
Trams184;18;7;75685;18:34;{2627.1466000005603,1561.507400000468,0.0}
Trams141;14;24;75688;18:34;{2992.747200001031,1703.0900999996811,0.0}
Trams183;18;5;75690;18:35;{845.340600002557,806.1041999999434,0.0}
Trams185;18;8;75697;18:36;{5689.812200002372,2815.7713999990374,0.0}
Trams142;14;24;75697;18:36;{4031.8555000014603,2128.9623999986798,0.0}
Trams185;18;7;75698;18:36;{5739.764803540053,2830.2159521656795,0.0}
Trams141;14;22;75701;18:37;{2808.1955000013113,1135.889900000766,0.0}
Trams141;14;18;75702;18:37;{2774.94460455129,1095.9101807449765,0.0}
Trams145;14;23;75703;18:37;{7477.508000001311,3581.729000000283,0.0}
Trams182;18;11;75706;18:37;{2589.0274000018835,1538.5219000000507,0.0}
Trams141;14;16;75708;18:38;{2569.3393000029027,869.8653000015765,0.0}
Trams146;14;23;75708;18:38;{6138.21238208538,2940.1058384544613,0.0}
Trams141;14;12;75709;18:38;{2567.6414284064917,825.1840510346515,0.0}
Trams181;18;23;75710;18:38;{5634.466500002891,2784.006800001487,0.0}
Trams145;14;24;75711;18:38;{7172.43200000003,3532.2607999984175,0.0}
Trams182;18;10;75717;18:39;{2064.0685709043055,1320.5282183098925,0.0}
Trams141;14;13;75718;18:39;{2894.896500002593,514.0241999980062,0.0}
Trams146;14;21;75718;18:39;{5641.738919684285,2786.998382666919,0.0}
Trams141;14;7;75719;18:40;{2894.896500002593,514.0241999980062,0.0}
Trams146;14;20;75719;18:40;{5634.466500002891,2784.006800001487,0.0}
Trams147;14;14;75719;18:40;{2992.747200001031,1703.0900999996811,0.0}
Trams181;18;22;75722;18:40;{5058.904000002891,2546.714799998328,0.0}
Trams181;18;20;75723;18:40;{5010.473492013262,2527.781076226536,0.0}
Trams182;18;8;75724;18:40;{1740.6504000015557,1186.7970000002533,0.0}
Trams181;18;18;75730;18:41;{4672.309900000691,2395.577299999073,0.0}
Trams183;18;6;75730;18:41;{2627.1466000005603,1561.507400000468,0.0}
Trams181;18;17;75731;18:42;{4624.179771982149,2375.8925514936154,0.0}
Trams141;14;8;75731;18:42;{2597.49450000003,904.9190000016242,0.0}
Trams142;14;23;75732;18:42;{2808.1955000013113,1135.889900000766,0.0}
Trams142;14;22;75733;18:42;{2774.94460455129,1095.9101807449765,0.0}
Trams144;14;17;75734;18:42;{7477.508000001311,3581.729000000283,0.0}
Trams183;18;8;75739;18:43;{3035.1652000024915,1729.7097000014037,0.0}
Trams185;18;24;75739;18:43;{7477.508000001311,3581.729000000283,0.0}
Trams142;14;19;75740;18:43;{2567.6414284064917,825.1840510346515,0.0}
Trams147;14;10;75740;18:43;{2567.6414284064917,825.1840510346515,0.0}
Trams144;14;22;75742;18:43;{7172.43200000003,3532.2607999984175,0.0}
Trams145;14;23;75745;18:44;{5641.738919684285,2786.998382666919,0.0}
Trams142;14;7;75750;18:45;{2894.896500002593,514.0241999980062,0.0}
Trams144;14;24;75750;18:45;{6831.853600002825,3315.144899999723,0.0}
Trams147;14;1;75750;18:45;{2894.896500002593,514.0241999980062,0.0}
Trams184;18;5;75751;18:45;{5689.812200002372,2815.7713999990374,0.0}
Trams184;18;3;75752;18:45;{5739.764803540053,2830.2159521656795,0.0}
Trams145;14;22;75758;18:46;{5058.904000002891,2546.714799998328,0.0}
Trams145;14;20;75759;18:46;{5010.473492013262,2527.781076226536,0.0}
Trams143;14;24;75761;18:47;{7477.508000001311,3581.729000000283,0.0}
Trams142;14;8;75762;18:47;{2597.49450000003,904.9190000016242,0.0}
Trams145;14;17;75766;18:47;{4672.309900000691,2395.577299999073,0.0}
Trams182;18;7;75776;18:49;{2197.307743831217,1383.6548398164498,0.0}
Trams144;14;23;75776;18:49;{5641.738919684285,2786.998382666919,0.0}
Trams144;14;22;75777;18:49;{5634.466500002891,2784.006800001487,0.0}
Trams183;18;6;75783;18:50;{5108.905971347362,2577.745680309252,0.0}
Trams142;14;9;75783;18:50;{3035.1652000024915,1729.7097000014037,0.0}
Trams181;18;15;75785;18:51;{2110.2352000027895,1344.0613000001758,0.0}
Trams181;18;12;75786;18:51;{2064.0685709043055,1320.5282183098925,0.0}
Trams141;14;7;75787;18:51;{4707.823850244834,2420.7529164061234,0.0}
Trams146;14;19;75788;18:51;{2808.1955000013113,1135.889900000766,0.0}
Trams146;14;18;75789;18:51;{2774.94460455129,1095.9101807449765,0.0}
Trams144;14;18;75790;18:51;{5010.473492013262,2527.781076226536,0.0}
Trams181;18;8;75793;18:52;{1740.6504000015557,1186.7970000002533,0.0}
Trams184;18;22;75793;18:52;{7477.508000001311,3581.729000000283,0.0}
Trams143;14;23;75793;18:52;{6138.21238208538,2940.1058384544613,0.0}
Trams182;18;8;75794;18:52;{3035.1652000024915,1729.7097000014037,0.0}
Trams146;14;16;75795;18:52;{2569.3393000029027,869.8653000015765,0.0}
Trams183;18;5;75796;18:52;{5689.812200002372,2815.7713999990374,0.0}
Trams146;14;14;75796;18:52;{2567.6414284064917,825.1840510346515,0.0}
Trams144;14;15;75797;18:53;{4672.309900000691,2395.577299999073,0.0}
Trams144;14;14;75798;18:53;{4624.179771982149,2375.8925514936154,0.0}
Trams184;18;24;75801;18:53;{7172.43200000003,3532.2607999984175,0.0}
Trams185;18;23;75802;18:53;{4672.309900000691,2395.577299999073,0.0}
Trams143;14;21;75803;18:54;{5641.738919684285,2786.998382666919,0.0}
Trams146;14;15;75805;18:54;{2894.896500002593,514.0241999980062,0.0}
Trams146;14;9;75806;18:54;{2894.896500002593,514.0241999980062,0.0}
Trams183;18;4;75807;18:54;{6221.943900000304,2968.579499999061,0.0}
Trams144;14;13;75811;18:55;{4031.8555000014603,2128.9623999986798,0.0}
Trams181;18;13;75814;18:55;{845.340600002557,806.1041999999434,0.0}
Trams145;14;15;75815;18:56;{2808.1955000013113,1135.889900000766,0.0}
Trams181;18;14;75816;18:56;{902.5305000022054,834.7037000004202,0.0}
Trams145;14;13;75816;18:56;{2774.94460455129,1095.9101807449765,0.0}
Trams143;14;20;75817;18:56;{5010.473492013262,2527.781076226536,0.0}
Trams145;14;12;75823;18:57;{2567.6414284064917,825.1840510346515,0.0}
Trams143;14;17;75824;18:57;{4672.309900000691,2395.577299999073,0.0}
Trams145;14;11;75833;18:59;{2894.896500002593,514.0241999980062,0.0}
Trams181;18;17;75836;18:59;{1782.5218000002205,1208.6106000002474,0.0}
Trams184;18;23;75836;18:59;{5634.466500002891,2784.006800001487,0.0}
Trams183;18;16;75838;18:59;{7477.508000001311,3581.729000000283,0.0}
Trams185;18;24;75838;18:59;{2992.747200001031,1703.0900999996811,0.0}
Trams143;14;16;75838;18:59;{4031.8555000014603,2128.9623999986798,0.0}
Trams146;14;11;75839;19:0;{3035.1652000024915,1729.7097000014037,0.0}
Trams142;14;8;75840;19:0;{5689.812200002372,2815.7713999990374,0.0}
Trams142;14;7;75841;19:0;{5739.764803540053,2830.2159521656795,0.0}
Trams181;18;18;75844;19:0;{2149.2538000009954,1363.784799998626,0.0}
Trams181;18;17;75845;19:1;{2197.307743831217,1383.6548398164498,0.0}
Trams183;18;17;75846;19:1;{7172.43200000003,3532.2607999984175,0.0}
Trams185;18;23;75847;19:1;{2589.0274000018835,1538.5219000000507,0.0}
Trams141;14;16;75851;19:2;{7477.508000001311,3581.729000000283,0.0}
Trams144;14;12;75853;19:2;{2569.3393000029027,869.8653000015765,0.0}
Trams181;18;19;75854;19:2;{2627.1466000005603,1561.507400000468,0.0}
Trams183;18;22;75854;19:2;{6831.853600002825,3315.144899999723,0.0}
Trams144;14;11;75854;19:2;{2567.6414284064917,825.1840510346515,0.0}
Trams184;18;21;75856;19:2;{4672.309900000691,2395.577299999073,0.0}
Trams185;18;14;75858;19:3;{2064.0685709043055,1320.5282183098925,0.0}
Trams183;18;24;75861;19:3;{6563.806600000709,3123.2601999994367,0.0}
Trams182;18;7;75862;19:3;{6221.943900000304,2968.579499999061,0.0}
Trams144;14;6;75864;19:4;{2894.896500002593,514.0241999980062,0.0}
Trams185;18;10;75865;19:4;{1740.6504000015557,1186.7970000002533,0.0}
Trams185;18;8;75866;19:4;{1692.722305299079,1166.6255241828771,0.0}
Trams141;14;20;75867;19:4;{6831.853600002825,3315.144899999723,0.0}
Trams183;18;23;75870;19:5;{6138.21238208538,2940.1058384544613,0.0}
Trams143;14;13;75873;19:5;{2808.1955000013113,1135.889900000766,0.0}
Trams141;14;24;75874;19:5;{6563.806600000709,3123.2601999994367,0.0}
Trams144;14;7;75876;19:6;{2597.49450000003,904.9190000016242,0.0}
Trams183;18;21;75880;19:6;{5641.738919684285,2786.998382666919,0.0}
Trams143;14;11;75880;19:6;{2569.3393000029027,869.8653000015765,0.0}
Trams183;18;22;75881;19:7;{5634.466500002891,2784.006800001487,0.0}
Trams143;14;10;75881;19:7;{2567.6414284064917,825.1840510346515,0.0}
Trams146;14;9;75883;19:7;{5108.905971347362,2577.745680309252,0.0}
Trams181;18;14;75885;19:7;{4084.1569000035524,2161.088000001386,0.0}
Trams143;14;11;75890;19:8;{2894.896500002593,514.0241999980062,0.0}
Trams143;14;6;75891;19:8;{2894.896500002593,514.0241999980062,0.0}
Trams183;18;19;75894;19:9;{5010.473492013262,2527.781076226536,0.0}
Trams144;14;6;75898;19:9;{3084.0353342962862,1747.4296273253601,0.0}
Trams181;18;12;75899;19:10;{4722.0763000026345,2426.624300001189,0.0}
Trams183;18;16;75901;19:10;{4672.309900000691,2395.577299999073,0.0}
Trams184;18;15;75901;19:10;{2589.0274000018835,1538.5219000000507,0.0}
Trams142;14;11;75905;19:11;{6563.806600000709,3123.2601999994367,0.0}
Trams181;18;10;75907;19:11;{5108.905971347362,2577.745680309252,0.0}
Trams184;18;14;75911;19:12;{2110.2352000027895,1344.0613000001758,0.0}
Trams184;18;6;75912;19:12;{2064.0685709043055,1320.5282183098925,0.0}
Trams142;14;20;75913;19:12;{6188.119100000709,2954.7112999986857,0.0}
Trams182;18;8;75916;19:12;{6563.806600000709,3123.2601999994367,0.0}
Trams184;18;4;75919;19:13;{1740.6504000015557,1186.7970000002533,0.0}
Trams184;18;3;75920;19:13;{1692.722305299079,1166.6255241828771,0.0}
Trams181;18;9;75921;19:13;{5739.764803540053,2830.2159521656795,0.0}
Trams182;18;11;75924;19:14;{6188.119100000709,2954.7112999986857,0.0}
Trams142;14;18;75937;19:16;{5058.904000002891,2546.714799998328,0.0}
Trams142;14;17;75938;19:16;{5010.473492013262,2527.781076226536,0.0}
Trams142;14;15;75945;19:17;{4672.309900000691,2395.577299999073,0.0}
Trams183;18;13;75946;19:17;{2589.0274000018835,1538.5219000000507,0.0}
Trams183;18;9;75957;19:19;{2064.0685709043055,1320.5282183098925,0.0}
Trams141;14;23;75963;19:20;{2808.1955000013113,1135.889900000766,0.0}
Trams183;18;7;75964;19:20;{1740.6504000015557,1186.7970000002533,0.0}
Trams141;14;17;75964;19:20;{2774.94460455129,1095.9101807449765,0.0}
Trams183;18;6;75965;19:21;{1692.722305299079,1166.6255241828771,0.0}
Trams141;14;15;75970;19:21;{2569.3393000029027,869.8653000015765,0.0}
Trams141;14;9;75971;19:22;{2567.6414284064917,825.1840510346515,0.0}
Trams141;14;7;75981;19:23;{2894.896500002593,514.0241999980062,0.0}
Trams183;18;5;75985;19:24;{845.340600002557,806.1041999999434,0.0}
Trams142;14;10;75994;19:25;{2808.1955000013113,1135.889900000766,0.0}
Trams182;18;8;76001;19:27;{2589.0274000018835,1538.5219000000507,0.0}
Trams141;14;8;76001;19:27;{2839.1857000030577,1180.8036000002176,0.0}
Trams142;14;9;76002;19:27;{2567.6414284064917,825.1840510346515,0.0}
Trams142;14;7;76012;19:28;{2894.896500002593,514.0241999980062,0.0}
Trams141;14;7;76015;19:29;{3084.0353342962862,1747.4296273253601,0.0}
Trams182;18;7;76019;19:30;{1740.6504000015557,1186.7970000002533,0.0}
Trams146;14;10;76057;19:36;{2569.3393000029027,869.8653000015765,0.0}
Trams146;14;11;76088;19:41;{2839.1857000030577,1180.8036000002176,0.0}
Trams146;14;10;76102;19:43;{3084.0353342962862,1747.4296273253601,0.0}
