tramName;tramLine;nPassengers;cycleNo;time;location
Trams145;14;2;13069;6:1;{5123.508700001985,2583.745899999514,0.0}
Trams144;14;1;13080;6:3;{4722.0763000026345,2426.624300001189,0.0}
Trams187;18;5;13087;6:4;{1782.5218000002205,1208.6106000002474,0.0}
Trams185;18;3;13088;6:4;{2589.0274000018835,1538.5219000000507,0.0}
Trams145;14;3;13092;6:5;{6221.943900000304,2968.579499999061,0.0}
Trams188;18;1;13095;6:5;{4722.0763000026345,2426.624300001189,0.0}
Trams183;18;5;13099;6:6;{5058.904000002891,2546.714799998328,0.0}
Trams141;14;7;13101;6:6;{2894.896500002593,514.0241999980062,0.0}
Trams188;18;4;13104;6:7;{5123.508700001985,2583.745899999514,0.0}
Trams187;18;7;13105;6:7;{2627.1466000005603,1561.507400000468,0.0}
Trams141;14;10;13113;6:8;{2597.49450000003,904.9190000016242,0.0}
Trams188;18;5;13116;6:9;{5689.812200002372,2815.7713999990374,0.0}
Trams182;18;2;13118;6:9;{6188.119100000709,2954.7112999986857,0.0}
Trams185;18;2;13118;6:9;{1208.916700001806,962.1525999996811,0.0}
Trams142;14;8;13119;6:9;{2894.896500002593,514.0241999980062,0.0}
Trams141;14;11;13121;6:10;{2839.1857000030577,1180.8036000002176,0.0}
Trams145;14;1;13122;6:10;{7477.508000001311,3581.729000000283,0.0}
Trams142;14;13;13131;6:11;{2597.49450000003,904.9190000016242,0.0}
Trams186;18;3;13135;6:12;{2627.1466000005603,1561.507400000468,0.0}
Trams182;18;3;13142;6:13;{5058.904000002891,2546.714799998328,0.0}
Trams183;18;4;13143;6:13;{2992.747200001031,1703.0900999996811,0.0}
Trams144;14;0;13143;6:13;{7477.508000001311,3581.729000000283,0.0}
Trams185;18;3;13149;6:14;{1782.5218000002205,1208.6106000002474,0.0}
Trams182;18;4;13150;6:15;{4672.309900000691,2395.577299999073,0.0}
Trams187;18;14;13150;6:15;{4722.0763000026345,2426.624300001189,0.0}
Trams188;18;4;13151;6:15;{7223.311400000006,3570.043500000611,0.0}
Trams183;18;3;13152;6:15;{2589.0274000018835,1538.5219000000507,0.0}
Trams142;14;12;13152;6:15;{3035.1652000024915,1729.7097000014037,0.0}
Trams143;14;9;13154;6:15;{2894.896500002593,514.0241999980062,0.0}
Trams188;18;0;13157;6:16;{7477.508000001311,3581.729000000283,0.0}
Trams187;18;18;13159;6:16;{5123.508700001985,2583.745899999514,0.0}
Trams143;14;12;13166;6:17;{2597.49450000003,904.9190000016242,0.0}
Trams181;18;3;13170;6:18;{5634.466500002891,2784.006800001487,0.0}
Trams184;18;3;13172;6:18;{1782.5218000002205,1208.6106000002474,0.0}
Trams142;14;11;13174;6:19;{4084.1569000035524,2161.088000001386,0.0}
Trams143;14;15;13174;6:19;{2839.1857000030577,1180.8036000002176,0.0}
Trams141;14;14;13179;6:19;{5123.508700001985,2583.745899999514,0.0}
Trams184;18;4;13180;6:20;{2149.2538000009954,1363.784799998626,0.0}
Trams186;18;4;13180;6:20;{4722.0763000026345,2426.624300001189,0.0}
Trams187;18;20;13182;6:20;{6221.943900000304,2968.579499999061,0.0}
Trams142;14;12;13188;6:21;{4722.0763000026345,2426.624300001189,0.0}
Trams149;14;10;13188;6:21;{2894.896500002593,514.0241999980062,0.0}
Trams141;14;15;13191;6:21;{5689.812200002372,2815.7713999990374,0.0}
Trams142;14;11;13197;6:22;{5123.508700001985,2583.745899999514,0.0}
Trams148;14;2;13197;6:22;{2569.3393000029027,869.8653000015765,0.0}
Trams187;18;19;13198;6:23;{6883.719200000167,3354.242599999532,0.0}
Trams149;14;17;13200;6:23;{2597.49450000003,904.9190000016242,0.0}
Trams141;14;14;13202;6:23;{6221.943900000304,2968.579499999061,0.0}
Trams182;18;3;13205;6:24;{2110.2352000027895,1344.0613000001758,0.0}
Trams187;18;17;13206;6:24;{7223.311400000006,3570.043500000611,0.0}
Trams148;14;3;13208;6:24;{2894.896500002593,514.0241999980062,0.0}
Trams149;14;18;13208;6:24;{2839.1857000030577,1180.8036000002176,0.0}
Trams185;18;5;13212;6:25;{4722.0763000026345,2426.624300001189,0.0}
Trams187;18;5;13212;6:25;{7477.508000001311,3581.729000000283,0.0}
Trams183;18;4;13213;6:25;{1782.5218000002205,1208.6106000002474,0.0}
Trams188;18;1;13213;6:25;{5058.904000002891,2546.714799998328,0.0}
Trams141;14;13;13217;6:26;{6864.837443928478,3341.6995773341046,0.0}
Trams142;14;13;13220;6:26;{6221.943900000304,2968.579499999061,0.0}
Trams148;14;6;13220;6:26;{2597.49450000003,904.9190000016242,0.0}
Trams185;18;7;13221;6:26;{5123.508700001985,2583.745899999514,0.0}
Trams143;14;14;13222;6:27;{4707.823850244834,2420.7529164061234,0.0}
Trams147;14;5;13223;6:27;{2894.896500002593,514.0241999980062,0.0}
Trams148;14;7;13228;6:28;{2839.1857000030577,1180.8036000002176,0.0}
Trams183;18;5;13231;6:28;{2627.1466000005603,1561.507400000468,0.0}
Trams141;14;5;13232;6:28;{7477.508000001311,3581.729000000283,0.0}
Trams185;18;9;13233;6:28;{5689.812200002372,2815.7713999990374,0.0}
Trams141;14;4;13233;6:28;{7477.508000001311,3581.729000000283,0.0}
Trams182;18;1;13234;6:29;{845.340600002557,806.1041999999434,0.0}
Trams181;18;4;13235;6:29;{2589.0274000018835,1538.5219000000507,0.0}
Trams184;18;5;13235;6:29;{4722.0763000026345,2426.624300001189,0.0}
Trams142;14;12;13235;6:29;{6864.837443928478,3341.6995773341046,0.0}
Trams147;14;6;13235;6:29;{2597.49450000003,904.9190000016242,0.0}
Trams186;18;2;13242;6:30;{7477.508000001311,3581.729000000283,0.0}
Trams147;14;7;13243;6:30;{2839.1857000030577,1180.8036000002176,0.0}
Trams149;14;19;13243;6:30;{4084.1569000035524,2161.088000001386,0.0}
Trams184;18;6;13244;6:30;{5123.508700001985,2583.745899999514,0.0}
Trams185;18;10;13244;6:30;{6221.943900000304,2968.579499999061,0.0}
Trams187;18;6;13244;6:30;{6188.119100000709,2954.7112999986857,0.0}
Trams142;14;5;13250;6:31;{7477.508000001311,3581.729000000283,0.0}
Trams146;14;3;13250;6:31;{2597.49450000003,904.9190000016242,0.0}
Trams185;18;9;13253;6:32;{6609.992500003427,3161.7836000006646,0.0}
Trams145;14;4;13253;6:32;{2894.896500002593,514.0241999980062,0.0}
Trams149;14;21;13257;6:32;{4722.0763000026345,2426.624300001189,0.0}
Trams185;18;8;13260;6:33;{6883.719200000167,3354.242599999532,0.0}
Trams183;18;6;13262;6:33;{4084.1569000035524,2161.088000001386,0.0}
Trams148;14;6;13263;6:33;{4084.1569000035524,2161.088000001386,0.0}
Trams182;18;3;13264;6:34;{2149.2538000009954,1363.784799998626,0.0}
Trams145;14;9;13265;6:34;{2597.49450000003,904.9190000016242,0.0}
Trams188;18;0;13266;6:34;{2589.0274000018835,1538.5219000000507,0.0}
Trams149;14;22;13266;6:34;{5123.508700001985,2583.745899999514,0.0}
Trams185;18;7;13269;6:34;{7267.007879060962,3598.2324644667874,0.0}
Trams181;18;2;13272;6:35;{874.5067790792331,818.4381949221134,0.0}
Trams144;14;3;13273;6:35;{2894.896500002593,514.0241999980062,0.0}
Trams145;14;10;13273;6:35;{2839.1857000030577,1180.8036000002176,0.0}
Trams181;18;1;13274;6:35;{845.340600002557,806.1041999999434,0.0}
Trams182;18;4;13274;6:35;{2627.1466000005603,1561.507400000468,0.0}
Trams185;18;1;13274;6:35;{7477.508000001311,3581.729000000283,0.0}
Trams183;18;9;13276;6:36;{4722.0763000026345,2426.624300001189,0.0}
Trams143;14;15;13279;6:36;{7223.311400000006,3570.043500000611,0.0}
Trams149;14;21;13279;6:36;{5739.764803540053,2830.2159521656795,0.0}
Trams183;18;10;13285;6:37;{5123.508700001985,2583.745899999514,0.0}
Trams143;14;5;13285;6:37;{7477.508000001311,3581.729000000283,0.0}
Trams145;14;9;13287;6:37;{3084.0353342962862,1747.4296273253601,0.0}
Trams149;14;22;13289;6:38;{6221.943900000304,2968.579499999061,0.0}
Trams147;14;8;13292;6:38;{4722.0763000026345,2426.624300001189,0.0}
Trams144;14;4;13293;6:38;{2839.1857000030577,1180.8036000002176,0.0}
Trams181;18;2;13296;6:39;{1782.5218000002205,1208.6106000002474,0.0}
Trams183;18;11;13297;6:39;{5689.812200002372,2815.7713999990374,0.0}
Trams184;18;1;13297;6:39;{7477.508000001311,3581.729000000283,0.0}
Trams149;14;21;13297;6:39;{6593.146138654794,3149.575753243163,0.0}
Trams184;18;0;13298;6:39;{7477.508000001311,3581.729000000283,0.0}
Trams148;14;5;13298;6:39;{5689.812200002372,2815.7713999990374,0.0}
Trams147;14;9;13301;6:40;{5123.508700001985,2583.745899999514,0.0}
Trams181;18;5;13304;6:40;{2149.2538000009954,1363.784799998626,0.0}
Trams182;18;5;13305;6:40;{4084.1569000035524,2161.088000001386,0.0}
Trams186;18;3;13306;6:41;{4672.309900000691,2395.577299999073,0.0}
Trams144;14;5;13306;6:41;{3035.1652000024915,1729.7097000014037,0.0}
Trams146;14;4;13307;6:41;{4722.0763000026345,2426.624300001189,0.0}
Trams181;18;7;13314;6:42;{2627.1466000005603,1561.507400000468,0.0}
Trams149;14;20;13314;6:42;{7267.007879060962,3598.2324644667874,0.0}
Trams146;14;6;13316;6:42;{5123.508700001985,2583.745899999514,0.0}
Trams183;18;10;13317;6:42;{6609.992500003427,3161.7836000006646,0.0}
Trams185;18;2;13318;6:43;{5634.466500002891,2784.006800001487,0.0}
Trams149;14;3;13319;6:43;{7477.508000001311,3581.729000000283,0.0}
Trams187;18;7;13321;6:43;{2589.0274000018835,1538.5219000000507,0.0}
Trams185;18;3;13330;6:45;{5058.904000002891,2546.714799998328,0.0}
Trams145;14;10;13331;6:45;{5123.508700001985,2583.745899999514,0.0}
Trams183;18;9;13333;6:45;{7267.007879060962,3598.2324644667874,0.0}
Trams188;18;1;13335;6:45;{2149.2538000009954,1363.784799998626,0.0}
Trams183;18;1;13338;6:46;{7477.508000001311,3581.729000000283,0.0}
Trams148;14;1;13339;6:46;{7477.508000001311,3581.729000000283,0.0}
Trams184;18;1;13341;6:46;{5634.466500002891,2784.006800001487,0.0}
Trams144;14;8;13342;6:47;{4722.0763000026345,2426.624300001189,0.0}
Trams145;14;11;13343;6:47;{5689.812200002372,2815.7713999990374,0.0}
Trams188;18;2;13345;6:47;{2627.1466000005603,1561.507400000468,0.0}
Trams187;18;6;13351;6:48;{1208.916700001806,962.1525999996811,0.0}
Trams144;14;11;13351;6:48;{5123.508700001985,2583.745899999514,0.0}
Trams147;14;3;13354;6:49;{7477.508000001311,3581.729000000283,0.0}
Trams147;14;2;13355;6:49;{7477.508000001311,3581.729000000283,0.0}
Trams187;18;5;13360;6:50;{845.340600002557,806.1041999999434,0.0}
Trams184;18;2;13361;6:50;{4672.309900000691,2395.577299999073,0.0}
Trams141;14;10;13363;6:50;{2894.896500002593,514.0241999980062,0.0}
Trams144;14;14;13363;6:50;{5689.812200002372,2815.7713999990374,0.0}
Trams146;14;2;13369;6:51;{7477.508000001311,3581.729000000283,0.0}
Trams186;18;2;13370;6:51;{1692.722305299079,1166.6255241828771,0.0}
Trams144;14;13;13374;6:52;{6221.943900000304,2968.579499999061,0.0}
Trams141;14;16;13375;6:52;{2597.49450000003,904.9190000016242,0.0}
Trams181;18;8;13380;6:53;{5689.812200002372,2815.7713999990374,0.0}
Trams182;18;2;13381;6:53;{7477.508000001311,3581.729000000283,0.0}
Trams142;14;6;13381;6:53;{2894.896500002593,514.0241999980062,0.0}
Trams182;18;1;13382;6:53;{7477.508000001311,3581.729000000283,0.0}
Trams141;14;23;13383;6:53;{2839.1857000030577,1180.8036000002176,0.0}
Trams145;14;2;13384;6:54;{7477.508000001311,3581.729000000283,0.0}
Trams145;14;1;13385;6:54;{7477.508000001311,3581.729000000283,0.0}
Trams187;18;9;13390;6:55;{2149.2538000009954,1363.784799998626,0.0}
Trams142;14;7;13393;6:55;{2597.49450000003,904.9190000016242,0.0}
Trams183;18;2;13394;6:55;{5058.904000002891,2546.714799998328,0.0}
Trams141;14;22;13396;6:56;{3035.1652000024915,1729.7097000014037,0.0}
Trams141;14;21;13397;6:56;{3084.0353342962862,1747.4296273253601,0.0}
Trams181;18;7;13399;6:56;{6593.146138654794,3149.575753243163,0.0}
Trams187;18;10;13400;6:56;{2627.1466000005603,1561.507400000468,0.0}
Trams185;18;2;13401;6:56;{1740.6504000015557,1186.7970000002533,0.0}
Trams142;14;8;13401;6:56;{2839.1857000030577,1180.8036000002176,0.0}
Trams183;18;4;13402;6:57;{4672.309900000691,2395.577299999073,0.0}
Trams144;14;2;13404;6:57;{7477.508000001311,3581.729000000283,0.0}
Trams144;14;0;13405;6:57;{7477.508000001311,3581.729000000283,0.0}
Trams187;18;9;13409;6:58;{3035.1652000024915,1729.7097000014037,0.0}
Trams188;18;3;13411;6:58;{5689.812200002372,2815.7713999990374,0.0}
Trams181;18;6;13416;6:59;{7267.007879060962,3598.2324644667874,0.0}
Trams183;18;3;13416;6:59;{4031.8555000014603,2128.9623999986798,0.0}
Trams143;14;9;13416;6:59;{2894.896500002593,514.0241999980062,0.0}
Trams186;18;4;13420;7:0;{2149.2538000009954,1363.784799998626,0.0}
Trams181;18;1;13421;7:0;{7477.508000001311,3581.729000000283,0.0}
Trams185;18;1;13422;7:0;{845.340600002557,806.1041999999434,0.0}
Trams188;18;4;13422;7:0;{6221.943900000304,2968.579499999061,0.0}
Trams143;14;15;13428;7:1;{2597.49450000003,904.9190000016242,0.0}
Trams187;18;10;13431;7:1;{4084.1569000035524,2161.088000001386,0.0}
Trams141;14;24;13432;7:2;{4722.0763000026345,2426.624300001189,0.0}
Trams182;18;3;13437;7:2;{5058.904000002891,2546.714799998328,0.0}
Trams182;18;5;13445;7:4;{4672.309900000691,2395.577299999073,0.0}
Trams184;18;1;13445;7:4;{845.340600002557,806.1041999999434,0.0}
Trams187;18;12;13445;7:4;{4722.0763000026345,2426.624300001189,0.0}
Trams188;18;3;13446;7:4;{7223.311400000006,3570.043500000611,0.0}
Trams144;14;1;13448;7:4;{5634.466500002891,2784.006800001487,0.0}
Trams142;14;9;13450;7:5;{4722.0763000026345,2426.624300001189,0.0}
Trams143;14;14;13450;7:5;{3084.0353342962862,1747.4296273253601,0.0}
Trams149;14;8;13450;7:5;{2894.896500002593,514.0241999980062,0.0}
Trams185;18;4;13452;7:5;{2149.2538000009954,1363.784799998626,0.0}
Trams188;18;0;13452;7:5;{7477.508000001311,3581.729000000283,0.0}
Trams187;18;18;13454;7:5;{5123.508700001985,2583.745899999514,0.0}
Trams182;18;4;13458;7:6;{4048.297289360261,2135.7927898531034,0.0}
Trams185;18;5;13462;7:7;{2627.1466000005603,1561.507400000468,0.0}
Trams145;14;2;13462;7:7;{4031.8555000014603,2128.9623999986798,0.0}
Trams149;14;12;13462;7:7;{2597.49450000003,904.9190000016242,0.0}
Trams181;18;2;13465;7:7;{5634.466500002891,2784.006800001487,0.0}
Trams183;18;2;13466;7:7;{1692.722305299079,1166.6255241828771,0.0}
Trams184;18;0;13466;7:7;{1768.882714616512,1202.84636491075,0.0}
Trams187;18;21;13466;7:7;{5689.812200002372,2815.7713999990374,0.0}
Trams187;18;20;13467;7:7;{5739.764803540053,2830.2159521656795,0.0}
Trams144;14;2;13468;7:8;{4672.309900000691,2395.577299999073,0.0}
Trams148;14;4;13470;7:8;{2894.896500002593,514.0241999980062,0.0}
Trams149;14;16;13470;7:8;{2839.1857000030577,1180.8036000002176,0.0}
Trams185;18;6;13471;7:8;{3035.1652000024915,1729.7097000014037,0.0}
Trams142;14;10;13471;7:8;{5689.812200002372,2815.7713999990374,0.0}
Trams142;14;9;13472;7:8;{5739.764803540053,2830.2159521656795,0.0}
Trams184;18;1;13475;7:9;{2149.2538000009954,1363.784799998626,0.0}
Trams186;18;6;13475;7:9;{4722.0763000026345,2426.624300001189,0.0}
Trams187;18;22;13477;7:9;{6221.943900000304,2968.579499999061,0.0}
Trams141;14;23;13479;7:9;{6864.837443928478,3341.6995773341046,0.0}
Trams182;18;3;13481;7:10;{2992.747200001031,1703.0900999996811,0.0}
Trams144;14;1;13482;7:10;{4031.8555000014603,2128.9623999986798,0.0}
Trams148;14;7;13482;7:10;{2597.49450000003,904.9190000016242,0.0}
Trams186;18;11;13484;7:10;{5123.508700001985,2583.745899999514,0.0}
Trams181;18;5;13485;7:10;{4672.309900000691,2395.577299999073,0.0}
Trams184;18;2;13485;7:10;{2627.1466000005603,1561.507400000468,0.0}
Trams143;14;18;13485;7:10;{4722.0763000026345,2426.624300001189,0.0}
Trams147;14;4;13485;7:10;{2894.896500002593,514.0241999980062,0.0}
Trams183;18;1;13486;7:11;{845.340600002557,806.1041999999434,0.0}
Trams182;18;4;13490;7:11;{2589.0274000018835,1538.5219000000507,0.0}
Trams148;14;10;13490;7:11;{2839.1857000030577,1180.8036000002176,0.0}
Trams141;14;4;13494;7:12;{7477.508000001311,3581.729000000283,0.0}
Trams143;14;20;13494;7:12;{5123.508700001985,2583.745899999514,0.0}
Trams141;14;3;13495;7:12;{7477.508000001311,3581.729000000283,0.0}
Trams145;14;1;13497;7:12;{2808.1955000013113,1135.889900000766,0.0}
Trams147;14;8;13497;7:12;{2597.49450000003,904.9190000016242,0.0}
Trams146;14;3;13500;7:13;{2894.896500002593,514.0241999980062,0.0}
Trams147;14;9;13505;7:14;{2839.1857000030577,1180.8036000002176,0.0}
Trams143;14;21;13506;7:14;{5689.812200002372,2815.7713999990374,0.0}
Trams185;18;8;13507;7:14;{4722.0763000026345,2426.624300001189,0.0}
Trams187;18;4;13507;7:14;{7477.508000001311,3581.729000000283,0.0}
Trams143;14;20;13507;7:14;{5739.764803540053,2830.2159521656795,0.0}
Trams182;18;5;13508;7:14;{1740.6504000015557,1186.7970000002533,0.0}
Trams188;18;2;13508;7:14;{5058.904000002891,2546.714799998328,0.0}
Trams142;14;4;13512;7:15;{7477.508000001311,3581.729000000283,0.0}
Trams146;14;8;13512;7:15;{2597.49450000003,904.9190000016242,0.0}
Trams145;14;2;13515;7:15;{2894.896500002593,514.0241999980062,0.0}
Trams183;18;6;13516;7:16;{2149.2538000009954,1363.784799998626,0.0}
Trams185;18;10;13516;7:16;{5123.508700001985,2583.745899999514,0.0}
Trams144;14;0;13517;7:16;{2808.1955000013113,1135.889900000766,0.0}
Trams146;14;11;13520;7:16;{2839.1857000030577,1180.8036000002176,0.0}
Trams183;18;10;13526;7:17;{2627.1466000005603,1561.507400000468,0.0}
Trams145;14;3;13527;7:17;{2597.49450000003,904.9190000016242,0.0}
Trams185;18;9;13528;7:18;{5689.812200002372,2815.7713999990374,0.0}
Trams149;14;17;13528;7:18;{5123.508700001985,2583.745899999514,0.0}
Trams182;18;1;13529;7:18;{845.340600002557,806.1041999999434,0.0}
Trams181;18;7;13530;7:18;{2589.0274000018835,1538.5219000000507,0.0}
Trams184;18;8;13530;7:18;{4722.0763000026345,2426.624300001189,0.0}
Trams186;18;10;13532;7:18;{7267.007879060962,3598.2324644667874,0.0}
Trams144;14;1;13535;7:19;{2894.896500002593,514.0241999980062,0.0}
Trams145;14;6;13535;7:19;{2839.1857000030577,1180.8036000002176,0.0}
Trams186;18;2;13537;7:19;{7477.508000001311,3581.729000000283,0.0}
Trams182;18;2;13539;7:19;{1241.924200002104,980.4126999992877,0.0}
Trams185;18;10;13539;7:19;{6221.943900000304,2968.579499999061,0.0}
Trams148;14;11;13539;7:19;{4722.0763000026345,2426.624300001189,0.0}
Trams149;14;19;13540;7:20;{5689.812200002372,2815.7713999990374,0.0}
Trams143;14;4;13547;7:21;{7477.508000001311,3581.729000000283,0.0}
Trams144;14;4;13547;7:21;{2597.49450000003,904.9190000016242,0.0}
Trams181;18;6;13548;7:21;{1740.6504000015557,1186.7970000002533,0.0}
Trams143;14;3;13548;7:21;{7477.508000001311,3581.729000000283,0.0}
Trams145;14;7;13548;7:21;{3035.1652000024915,1729.7097000014037,0.0}
Trams148;14;13;13548;7:21;{5123.508700001985,2583.745899999514,0.0}
Trams141;14;4;13550;7:21;{5058.904000002891,2546.714799998328,0.0}
Trams188;18;0;13552;7:22;{2992.747200001031,1703.0900999996811,0.0}
Trams147;14;13;13554;7:22;{4722.0763000026345,2426.624300001189,0.0}
Trams144;14;7;13555;7:22;{2839.1857000030577,1180.8036000002176,0.0}
Trams146;14;12;13555;7:22;{4084.1569000035524,2161.088000001386,0.0}
Trams182;18;4;13559;7:23;{2149.2538000009954,1363.784799998626,0.0}
Trams181;18;5;13560;7:23;{1208.916700001806,962.1525999996811,0.0}
Trams184;18;9;13562;7:23;{6221.943900000304,2968.579499999061,0.0}
Trams147;14;15;13563;7:23;{5123.508700001985,2583.745899999514,0.0}
Trams181;18;4;13567;7:24;{874.5067790792331,818.4381949221134,0.0}
Trams181;18;5;13568;7:24;{845.340600002557,806.1041999999434,0.0}
Trams181;18;2;13569;7:24;{845.340600002557,806.1041999999434,0.0}
Trams182;18;10;13569;7:24;{2627.1466000005603,1561.507400000468,0.0}
Trams185;18;1;13569;7:24;{7477.508000001311,3581.729000000283,0.0}
Trams146;14;14;13569;7:24;{4722.0763000026345,2426.624300001189,0.0}
Trams148;14;14;13571;7:25;{6221.943900000304,2968.579499999061,0.0}
Trams149;14;18;13576;7:26;{7267.007879060962,3598.2324644667874,0.0}
Trams146;14;19;13578;7:26;{5123.508700001985,2583.745899999514,0.0}
Trams149;14;4;13581;7:26;{7477.508000001311,3581.729000000283,0.0}
Trams149;14;3;13582;7:27;{7477.508000001311,3581.729000000283,0.0}
Trams145;14;8;13584;7:27;{4722.0763000026345,2426.624300001189,0.0}
Trams148;14;13;13587;7:27;{6883.719200000167,3354.242599999532,0.0}
Trams144;14;9;13590;7:28;{4084.1569000035524,2161.088000001386,0.0}
Trams146;14;21;13590;7:28;{5689.812200002372,2815.7713999990374,0.0}
Trams184;18;0;13592;7:28;{7477.508000001311,3581.729000000283,0.0}
Trams145;14;10;13593;7:28;{5123.508700001985,2583.745899999514,0.0}
Trams181;18;3;13599;7:29;{2149.2538000009954,1363.784799998626,0.0}
Trams146;14;22;13601;7:30;{6221.943900000304,2968.579499999061,0.0}
Trams148;14;1;13601;7:30;{7477.508000001311,3581.729000000283,0.0}
Trams144;14;10;13604;7:30;{4722.0763000026345,2426.624300001189,0.0}
Trams181;18;4;13609;7:31;{2627.1466000005603,1561.507400000468,0.0}
Trams144;14;14;13613;7:32;{5123.508700001985,2583.745899999514,0.0}
Trams182;18;11;13614;7:32;{4722.0763000026345,2426.624300001189,0.0}
Trams141;14;3;13615;7:32;{2567.6414284064917,825.1840510346515,0.0}
Trams145;14;11;13616;7:32;{6221.943900000304,2968.579499999061,0.0}
Trams147;14;3;13616;7:32;{7477.508000001311,3581.729000000283,0.0}
Trams147;14;2;13617;7:32;{7477.508000001311,3581.729000000283,0.0}
Trams188;18;1;13622;7:33;{1782.5218000002205,1208.6106000002474,0.0}
Trams141;14;18;13625;7:34;{2894.896500002593,514.0241999980062,0.0}
Trams144;14;17;13625;7:34;{5689.812200002372,2815.7713999990374,0.0}
Trams146;14;21;13626;7:34;{7267.007879060962,3598.2324644667874,0.0}
Trams188;18;5;13630;7:35;{2149.2538000009954,1363.784799998626,0.0}
Trams146;14;2;13631;7:35;{7477.508000001311,3581.729000000283,0.0}
Trams183;18;3;13633;7:35;{7477.508000001311,3581.729000000283,0.0}
Trams183;18;2;13634;7:35;{7477.508000001311,3581.729000000283,0.0}
Trams144;14;18;13636;7:36;{6221.943900000304,2968.579499999061,0.0}
Trams141;14;24;13637;7:36;{2597.49450000003,904.9190000016242,0.0}
Trams188;18;6;13640;7:36;{2627.1466000005603,1561.507400000468,0.0}
Trams145;14;12;13640;7:36;{7223.311400000006,3570.043500000611,0.0}
Trams142;14;7;13643;7:37;{2894.896500002593,514.0241999980062,0.0}
Trams145;14;2;13646;7:37;{7477.508000001311,3581.729000000283,0.0}
Trams184;18;1;13648;7:38;{5058.904000002891,2546.714799998328,0.0}
Trams181;18;6;13654;7:39;{4722.0763000026345,2426.624300001189,0.0}
Trams142;14;15;13655;7:39;{2597.49450000003,904.9190000016242,0.0}
Trams144;14;17;13661;7:40;{7267.007879060962,3598.2324644667874,0.0}
Trams182;18;9;13662;7:40;{6883.719200000167,3354.242599999532,0.0}
Trams181;18;8;13663;7:40;{5123.508700001985,2583.745899999514,0.0}
Trams142;14;24;13663;7:40;{2839.1857000030577,1180.8036000002176,0.0}
Trams1411;14;2;13663;7:40;{2839.1857000030577,1180.8036000002176,0.0}
Trams186;18;3;13664;7:40;{1740.6504000015557,1186.7970000002533,0.0}
Trams144;14;1;13666;7:41;{7477.508000001311,3581.729000000283,0.0}
Trams188;18;7;13671;7:41;{4084.1569000035524,2161.088000001386,0.0}
Trams182;18;2;13676;7:42;{7477.508000001311,3581.729000000283,0.0}
Trams182;18;1;13677;7:42;{7477.508000001311,3581.729000000283,0.0}
Trams187;18;5;13677;7:42;{1782.5218000002205,1208.6106000002474,0.0}
Trams143;14;9;13678;7:43;{2894.896500002593,514.0241999980062,0.0}
Trams186;18;2;13685;7:44;{845.340600002557,806.1041999999434,0.0}
Trams187;18;8;13685;7:44;{2149.2538000009954,1363.784799998626,0.0}
Trams188;18;11;13685;7:44;{4722.0763000026345,2426.624300001189,0.0}
Trams181;18;11;13686;7:44;{6221.943900000304,2968.579499999061,0.0}
Trams146;14;3;13687;7:44;{5058.904000002891,2546.714799998328,0.0}
Trams183;18;3;13689;7:44;{5058.904000002891,2546.714799998328,0.0}
Trams143;14;16;13690;7:45;{2597.49450000003,904.9190000016242,0.0}
Trams141;14;23;13693;7:45;{4707.823850244834,2420.7529164061234,0.0}
Trams141;14;24;13694;7:45;{4722.0763000026345,2426.624300001189,0.0}
Trams187;18;10;13695;7:45;{2627.1466000005603,1561.507400000468,0.0}
Trams143;14;20;13698;7:46;{2839.1857000030577,1180.8036000002176,0.0}
Trams181;18;10;13702;7:47;{6883.719200000167,3354.242599999532,0.0}
Trams188;18;15;13706;7:47;{5689.812200002372,2815.7713999990374,0.0}
Trams186;18;3;13707;7:47;{1782.5218000002205,1208.6106000002474,0.0}
Trams181;18;9;13710;7:48;{7223.311400000006,3570.043500000611,0.0}
Trams149;14;5;13712;7:48;{2894.896500002593,514.0241999980062,0.0}
Trams1411;14;4;13712;7:48;{4722.0763000026345,2426.624300001189,0.0}
Trams181;18;3;13716;7:49;{7477.508000001311,3581.729000000283,0.0}
Trams182;18;2;13720;7:50;{5634.466500002891,2784.006800001487,0.0}
Trams184;18;0;13720;7:50;{1692.722305299079,1166.6255241828771,0.0}
Trams1411;14;10;13721;7:50;{5123.508700001985,2583.745899999514,0.0}
Trams149;14;12;13724;7:50;{2597.49450000003,904.9190000016242,0.0}
Trams144;14;2;13730;7:51;{4672.309900000691,2395.577299999073,0.0}
Trams146;14;2;13731;7:51;{2992.747200001031,1703.0900999996811,0.0}
Trams188;18;14;13732;7:52;{6864.837443928478,3341.6995773341046,0.0}
Trams148;14;4;13732;7:52;{2894.896500002593,514.0241999980062,0.0}
Trams149;14;17;13732;7:52;{2839.1857000030577,1180.8036000002176,0.0}
Trams1411;14;11;13733;7:52;{5689.812200002372,2815.7713999990374,0.0}
Trams185;18;2;13739;7:53;{1782.5218000002205,1208.6106000002474,0.0}
Trams182;18;3;13740;7:53;{4672.309900000691,2395.577299999073,0.0}
Trams187;18;18;13740;7:53;{4722.0763000026345,2426.624300001189,0.0}
Trams188;18;13;13742;7:53;{7267.007879060962,3598.2324644667874,0.0}
Trams144;14;3;13744;7:54;{4031.8555000014603,2128.9623999986798,0.0}
Trams148;14;7;13744;7:54;{2597.49450000003,904.9190000016242,0.0}
Trams1411;14;12;13744;7:54;{6221.943900000304,2968.579499999061,0.0}
Trams185;18;5;13747;7:54;{2149.2538000009954,1363.784799998626,0.0}
Trams188;18;0;13747;7:54;{7477.508000001311,3581.729000000283,0.0}
Trams143;14;21;13747;7:54;{4722.0763000026345,2426.624300001189,0.0}
Trams148;14;8;13752;7:55;{2839.1857000030577,1180.8036000002176,0.0}
Trams186;18;4;13756;7:56;{4084.1569000035524,2161.088000001386,0.0}
Trams141;14;2;13756;7:56;{7477.508000001311,3581.729000000283,0.0}
Trams185;18;7;13757;7:56;{2627.1466000005603,1561.507400000468,0.0}
Trams147;14;3;13759;7:56;{2597.49450000003,904.9190000016242,0.0}
Trams181;18;4;13760;7:56;{5634.466500002891,2784.006800001487,0.0}
Trams187;18;19;13761;7:56;{5689.812200002372,2815.7713999990374,0.0}
Trams146;14;5;13762;7:57;{2894.896500002593,514.0241999980062,0.0}
Trams144;14;2;13767;7:57;{2952.0448504139104,1673.1693294131398,0.0}
Trams147;14;4;13767;7:57;{2839.1857000030577,1180.8036000002176,0.0}
Trams149;14;18;13767;7:57;{4084.1569000035524,2161.088000001386,0.0}
Trams143;14;22;13768;7:58;{5689.812200002372,2815.7713999990374,0.0}
Trams149;14;17;13768;7:58;{4132.967545312427,2178.980077572535,0.0}
Trams143;14;21;13769;7:58;{5739.764803540053,2830.2159521656795,0.0}
Trams184;18;1;13770;7:58;{2149.2538000009954,1363.784799998626,0.0}
Trams186;18;5;13770;7:58;{4722.0763000026345,2426.624300001189,0.0}
Trams187;18;20;13772;7:58;{6221.943900000304,2968.579499999061,0.0}
Trams142;14;2;13774;7:59;{7477.508000001311,3581.729000000283,0.0}
Trams146;14;6;13774;7:59;{2597.49450000003,904.9190000016242,0.0}
Trams1411;14;2;13774;7:59;{7477.508000001311,3581.729000000283,0.0}
Trams1411;14;0;13775;7:59;{7477.508000001311,3581.729000000283,0.0}
Trams182;18;2;13777;7:59;{2942.963136644313,1688.2069726773154,0.0}
Trams145;14;3;13777;7:59;{2894.896500002593,514.0241999980062,0.0}
Trams186;18;8;13779;7:59;{5123.508700001985,2583.745899999514,0.0}
Trams144;14;1;13780;8:0;{2774.94460455129,1095.9101807449765,0.0}
Trams183;18;2;13781;8:0;{845.340600002557,806.1041999999434,0.0}
Trams149;14;18;13781;8:0;{4722.0763000026345,2426.624300001189,0.0}
Trams146;14;8;13782;8:0;{2839.1857000030577,1180.8036000002176,0.0}
Trams148;14;9;13787;8:1;{4084.1569000035524,2161.088000001386,0.0}
Trams141;14;3;13788;8:1;{6188.119100000709,2954.7112999986857,0.0}
Trams186;18;9;13791;8:1;{5689.812200002372,2815.7713999990374,0.0}
Trams181;18;3;13794;8:2;{4031.8555000014603,2128.9623999986798,0.0}
Trams182;18;1;13795;8:2;{2110.2352000027895,1344.0613000001758,0.0}
Trams187;18;19;13797;8:2;{7267.007879060962,3598.2324644667874,0.0}
Trams144;14;4;13797;8:2;{2894.896500002593,514.0241999980062,0.0}
Trams145;14;5;13797;8:2;{2839.1857000030577,1180.8036000002176,0.0}
Trams187;18;3;13802;8:3;{7477.508000001311,3581.729000000283,0.0}
Trams183;18;5;13803;8:3;{1782.5218000002205,1208.6106000002474,0.0}
Trams142;14;3;13806;8:4;{6188.119100000709,2954.7112999986857,0.0}
Trams143;14;3;13809;8:4;{7477.508000001311,3581.729000000283,0.0}
Trams144;14;5;13809;8:4;{2597.49450000003,904.9190000016242,0.0}
Trams143;14;2;13810;8:5;{7477.508000001311,3581.729000000283,0.0}
Trams148;14;12;13810;8:5;{5123.508700001985,2583.745899999514,0.0}
Trams183;18;6;13811;8:5;{2149.2538000009954,1363.784799998626,0.0}
Trams147;14;7;13816;8:6;{4722.0763000026345,2426.624300001189,0.0}
Trams144;14;9;13817;8:6;{2839.1857000030577,1180.8036000002176,0.0}
Trams148;14;15;13822;8:7;{5689.812200002372,2815.7713999990374,0.0}
Trams181;18;4;13825;8:7;{2589.0274000018835,1538.5219000000507,0.0}
Trams147;14;8;13825;8:7;{5123.508700001985,2583.745899999514,0.0}
Trams183;18;5;13830;8:8;{3035.1652000024915,1729.7097000014037,0.0}
Trams146;14;9;13831;8:8;{4722.0763000026345,2426.624300001189,0.0}
Trams186;18;1;13832;8:8;{7477.508000001311,3581.729000000283,0.0}
Trams145;14;4;13832;8:8;{4084.1569000035524,2161.088000001386,0.0}
Trams148;14;14;13834;8:9;{6271.932036142039,2982.903802087056,0.0}
Trams149;14;17;13838;8:9;{7267.007879060962,3598.2324644667874,0.0}
Trams146;14;10;13840;8:10;{5123.508700001985,2583.745899999514,0.0}
Trams149;14;1;13843;8:10;{7477.508000001311,3581.729000000283,0.0}
Trams187;18;5;13846;8:11;{5634.466500002891,2784.006800001487,0.0}
Trams183;18;4;13852;8:12;{4084.1569000035524,2161.088000001386,0.0}
Trams142;14;2;13852;8:12;{4031.8555000014603,2128.9623999986798,0.0}
Trams144;14;8;13853;8:12;{4132.967545312427,2178.980077572535,0.0}
Trams145;14;5;13855;8:12;{5123.508700001985,2583.745899999514,0.0}
Trams148;14;15;13857;8:12;{7223.311400000006,3570.043500000611,0.0}
Trams187;18;6;13858;8:13;{5058.904000002891,2546.714799998328,0.0}
Trams148;14;2;13863;8:13;{7477.508000001311,3581.729000000283,0.0}
Trams181;18;3;13864;8:14;{845.340600002557,806.1041999999434,0.0}
Trams182;18;4;13864;8:14;{2627.1466000005603,1561.507400000468,0.0}
Trams185;18;1;13864;8:14;{7477.508000001311,3581.729000000283,0.0}
Trams148;14;1;13864;8:14;{7477.508000001311,3581.729000000283,0.0}
Trams183;18;6;13866;8:14;{4722.0763000026345,2426.624300001189,0.0}
Trams145;14;6;13867;8:14;{5689.812200002372,2815.7713999990374,0.0}
Trams183;18;7;13875;8:15;{5123.508700001985,2583.745899999514,0.0}
Trams149;14;2;13875;8:15;{6188.119100000709,2954.7112999986857,0.0}
Trams141;14;2;13877;8:16;{2567.6414284064917,825.1840510346515,0.0}
Trams147;14;1;13878;8:16;{7477.508000001311,3581.729000000283,0.0}
Trams184;18;0;13887;8:17;{7477.508000001311,3581.729000000283,0.0}
Trams141;14;14;13887;8:17;{2894.896500002593,514.0241999980062,0.0}
Trams186;18;2;13888;8:18;{5058.904000002891,2546.714799998328,0.0}
Trams141;14;15;13888;8:18;{2892.683600001037,511.3241000007838,0.0}
Trams146;14;3;13893;8:18;{7477.508000001311,3581.729000000283,0.0}
Trams181;18;4;13894;8:19;{2149.2538000009954,1363.784799998626,0.0}
Trams146;14;2;13894;8:19;{7477.508000001311,3581.729000000283,0.0}
Trams182;18;3;13895;8:19;{4084.1569000035524,2161.088000001386,0.0}
Trams186;18;3;13896;8:19;{4672.309900000691,2395.577299999073,0.0}
Trams141;14;24;13899;8:19;{2597.49450000003,904.9190000016242,0.0}
Trams187;18;5;13902;8:20;{2992.747200001031,1703.0900999996811,0.0}
Trams145;14;5;13902;8:20;{7223.311400000006,3570.043500000611,0.0}
Trams181;18;5;13904;8:20;{2627.1466000005603,1561.507400000468,0.0}
Trams142;14;3;13905;8:20;{2894.896500002593,514.0241999980062,0.0}
Trams149;14;3;13907;8:21;{4672.309900000691,2395.577299999073,0.0}
Trams145;14;1;13908;8:21;{7477.508000001311,3581.729000000283,0.0}
Trams182;18;6;13909;8:21;{4722.0763000026345,2426.624300001189,0.0}
Trams188;18;1;13917;8:22;{1782.5218000002205,1208.6106000002474,0.0}
Trams142;14;6;13917;8:22;{2597.49450000003,904.9190000016242,0.0}
Trams182;18;9;13918;8:23;{5123.508700001985,2583.745899999514,0.0}
Trams141;14;23;13921;8:23;{3084.0353342962862,1747.4296273253601,0.0}
Trams149;14;2;13921;8:23;{4031.8555000014603,2128.9623999986798,0.0}
Trams187;18;4;13922;8:23;{2064.0685709043055,1320.5282183098925,0.0}
Trams188;18;3;13925;8:24;{2149.2538000009954,1363.784799998626,0.0}
Trams142;14;12;13925;8:24;{2839.1857000030577,1180.8036000002176,0.0}
Trams183;18;2;13928;8:24;{7477.508000001311,3581.729000000283,0.0}
Trams144;14;1;13928;8:24;{7477.508000001311,3581.729000000283,0.0}
Trams187;18;3;13929;8:24;{1740.6504000015557,1186.7970000002533,0.0}
Trams181;18;6;13935;8:25;{4084.1569000035524,2161.088000001386,0.0}
Trams188;18;4;13935;8:25;{2627.1466000005603,1561.507400000468,0.0}
Trams143;14;4;13940;8:26;{2894.896500002593,514.0241999980062,0.0}
Trams182;18;8;13942;8:27;{6271.932036142039,2982.903802087056,0.0}
Trams141;14;20;13943;8:27;{4132.967545312427,2178.980077572535,0.0}
Trams181;18;7;13949;8:28;{4722.0763000026345,2426.624300001189,0.0}
Trams143;14;6;13952;8:28;{2597.49450000003,904.9190000016242,0.0}
Trams149;14;1;13957;8:29;{2774.94460455129,1095.9101807449765,0.0}
Trams181;18;10;13958;8:29;{5123.508700001985,2583.745899999514,0.0}
Trams143;14;9;13960;8:30;{2839.1857000030577,1180.8036000002176,0.0}
Trams142;14;11;13961;8:30;{4132.967545312427,2178.980077572535,0.0}
Trams181;18;11;13970;8:31;{5689.812200002372,2815.7713999990374,0.0}
Trams182;18;1;13971;8:31;{7477.508000001311,3581.729000000283,0.0}
Trams183;18;3;13972;8:32;{5634.466500002891,2784.006800001487,0.0}
Trams187;18;5;13972;8:32;{1782.5218000002205,1208.6106000002474,0.0}
Trams142;14;10;13973;8:32;{4707.823850244834,2420.7529164061234,0.0}
Trams142;14;11;13974;8:32;{4722.0763000026345,2426.624300001189,0.0}
Trams149;14;2;13974;8:32;{2894.896500002593,514.0241999980062,0.0}
Trams186;18;1;13980;8:33;{845.340600002557,806.1041999999434,0.0}
Trams187;18;10;13980;8:33;{2149.2538000009954,1363.784799998626,0.0}
Trams149;14;6;13986;8:34;{2597.49450000003,904.9190000016242,0.0}
Trams141;14;19;13988;8:34;{6221.943900000304,2968.579499999061,0.0}
Trams188;18;5;13989;8:34;{5123.508700001985,2583.745899999514,0.0}
Trams141;14;18;13989;8:34;{6271.932036142039,2982.903802087056,0.0}
Trams181;18;10;13990;8:35;{6609.992500003427,3161.7836000006646,0.0}
Trams148;14;7;13994;8:35;{2894.896500002593,514.0241999980062,0.0}
Trams149;14;7;13994;8:35;{2839.1857000030577,1180.8036000002176,0.0}
Trams142;14;12;13995;8:35;{5689.812200002372,2815.7713999990374,0.0}
Trams184;18;1;13996;8:36;{2589.0274000018835,1538.5219000000507,0.0}
Trams181;18;9;14006;8:37;{7267.007879060962,3598.2324644667874,0.0}
Trams143;14;11;14009;8:38;{4722.0763000026345,2426.624300001189,0.0}
Trams147;14;2;14009;8:38;{2894.896500002593,514.0241999980062,0.0}
Trams181;18;2;14011;8:38;{7477.508000001311,3581.729000000283,0.0}
Trams148;14;10;14014;8:39;{2839.1857000030577,1180.8036000002176,0.0}
Trams182;18;2;14015;8:39;{5634.466500002891,2784.006800001487,0.0}
Trams141;14;4;14018;8:39;{7477.508000001311,3581.729000000283,0.0}
Trams143;14;13;14018;8:39;{5123.508700001985,2583.745899999514,0.0}
Trams141;14;3;14019;8:39;{7477.508000001311,3581.729000000283,0.0}
Trams186;18;2;14020;8:40;{2627.1466000005603,1561.507400000468,0.0}
Trams187;18;9;14021;8:40;{4084.1569000035524,2161.088000001386,0.0}
Trams147;14;4;14021;8:40;{2597.49450000003,904.9190000016242,0.0}
Trams184;18;0;14026;8:41;{1208.916700001806,962.1525999996811,0.0}
Trams182;18;4;14027;8:41;{5058.904000002891,2546.714799998328,0.0}
Trams148;14;11;14027;8:41;{3035.1652000024915,1729.7097000014037,0.0}
Trams143;14;14;14030;8:41;{5689.812200002372,2815.7713999990374,0.0}
Trams142;14;10;14031;8:41;{7267.007879060962,3598.2324644667874,0.0}
Trams185;18;2;14034;8:42;{1782.5218000002205,1208.6106000002474,0.0}
Trams187;18;11;14035;8:42;{4722.0763000026345,2426.624300001189,0.0}
Trams142;14;3;14036;8:42;{7477.508000001311,3581.729000000283,0.0}
Trams146;14;3;14036;8:42;{2597.49450000003,904.9190000016242,0.0}
Trams142;14;2;14037;8:42;{7477.508000001311,3581.729000000283,0.0}
Trams185;18;5;14042;8:43;{2149.2538000009954,1363.784799998626,0.0}
Trams188;18;0;14042;8:43;{7477.508000001311,3581.729000000283,0.0}
Trams181;18;5;14043;8:43;{6188.119100000709,2954.7112999986857,0.0}
Trams147;14;3;14043;8:43;{3084.0353342962862,1747.4296273253601,0.0}
Trams146;14;6;14044;8:44;{2839.1857000030577,1180.8036000002176,0.0}
Trams182;18;3;14048;8:44;{4048.297289360261,2135.7927898531034,0.0}
Trams148;14;12;14049;8:44;{4084.1569000035524,2161.088000001386,0.0}
Trams187;18;12;14056;8:46;{5689.812200002372,2815.7713999990374,0.0}
Trams184;18;1;14057;8:46;{1782.5218000002205,1208.6106000002474,0.0}
Trams148;14;15;14063;8:47;{4722.0763000026345,2426.624300001189,0.0}
Trams149;14;8;14064;8:47;{5689.812200002372,2815.7713999990374,0.0}
Trams143;14;15;14065;8:47;{7223.311400000006,3570.043500000611,0.0}
Trams143;14;14;14066;8:47;{7267.007879060962,3598.2324644667874,0.0}
Trams181;18;7;14067;8:47;{5058.904000002891,2546.714799998328,0.0}
Trams143;14;3;14071;8:48;{7477.508000001311,3581.729000000283,0.0}
Trams143;14;2;14072;8:48;{7477.508000001311,3581.729000000283,0.0}
Trams181;18;9;14075;8:49;{4672.309900000691,2395.577299999073,0.0}
Trams184;18;2;14075;8:49;{2627.1466000005603,1561.507400000468,0.0}
Trams183;18;2;14076;8:49;{845.340600002557,806.1041999999434,0.0}
Trams147;14;4;14078;8:49;{4722.0763000026345,2426.624300001189,0.0}
Trams144;14;2;14079;8:49;{2839.1857000030577,1180.8036000002176,0.0}
Trams148;14;17;14084;8:50;{5689.812200002372,2815.7713999990374,0.0}
Trams149;14;7;14084;8:50;{6609.992500003427,3161.7836000006646,0.0}
Trams188;18;1;14086;8:51;{5634.466500002891,2784.006800001487,0.0}
Trams147;14;6;14087;8:51;{5123.508700001985,2583.745899999514,0.0}
Trams181;18;8;14089;8:51;{4031.8555000014603,2128.9623999986798,0.0}
Trams182;18;2;14091;8:51;{2064.0685709043055,1320.5282183098925,0.0}
Trams149;14;6;14091;8:51;{6883.719200000167,3354.242599999532,0.0}
Trams146;14;7;14093;8:52;{4722.0763000026345,2426.624300001189,0.0}
Trams187;18;3;14097;8:52;{7477.508000001311,3581.729000000283,0.0}
Trams188;18;2;14098;8:53;{5058.904000002891,2546.714799998328,0.0}
Trams182;18;1;14099;8:53;{1692.722305299079,1166.6255241828771,0.0}
Trams147;14;7;14099;8:53;{5689.812200002372,2815.7713999990374,0.0}
Trams148;14;16;14103;8:53;{6593.146138654794,3149.575753243163,0.0}
Trams149;14;0;14105;8:54;{7477.508000001311,3581.729000000283,0.0}
Trams183;18;4;14106;8:54;{2149.2538000009954,1363.784799998626,0.0}
Trams188;18;3;14106;8:54;{4672.309900000691,2395.577299999073,0.0}
Trams145;14;4;14108;8:54;{4722.0763000026345,2426.624300001189,0.0}
Trams147;14;8;14110;8:55;{6221.943900000304,2968.579499999061,0.0}
Trams181;18;6;14111;8:55;{2992.747200001031,1703.0900999996811,0.0}
Trams142;14;1;14114;8:55;{4031.8555000014603,2128.9623999986798,0.0}
Trams146;14;8;14114;8:55;{5689.812200002372,2815.7713999990374,0.0}
Trams183;18;6;14116;8:56;{2627.1466000005603,1561.507400000468,0.0}
Trams145;14;5;14117;8:56;{5123.508700001985,2583.745899999514,0.0}
Trams146;14;7;14125;8:57;{6221.943900000304,2968.579499999061,0.0}
Trams148;14;2;14125;8:57;{7477.508000001311,3581.729000000283,0.0}
Trams148;14;1;14126;8:57;{7477.508000001311,3581.729000000283,0.0}
Trams186;18;1;14127;8:57;{7477.508000001311,3581.729000000283,0.0}
Trams143;14;3;14127;8:57;{5058.904000002891,2546.714799998328,0.0}
Trams144;14;3;14128;8:58;{4722.0763000026345,2426.624300001189,0.0}
Trams184;18;3;14129;8:58;{5123.508700001985,2583.745899999514,0.0}
Trams146;14;6;14133;8:58;{6593.146138654794,3149.575753243163,0.0}
Trams143;14;4;14135;8:59;{4672.309900000691,2395.577299999073,0.0}
Trams144;14;4;14137;8:59;{5123.508700001985,2583.745899999514,0.0}
Trams147;14;2;14140;9:0;{7477.508000001311,3581.729000000283,0.0}
Trams187;18;4;14141;9:0;{5634.466500002891,2784.006800001487,0.0}
Trams181;18;5;14149;9:1;{1213.7785956119094,964.194963392883,0.0}
Trams141;14;13;14149;9:1;{2894.896500002593,514.0241999980062,0.0}
Trams143;14;3;14149;9:1;{4031.8555000014603,2128.9623999986798,0.0}
Trams144;14;3;14149;9:1;{5689.812200002372,2815.7713999990374,0.0}
Trams181;18;4;14150;9:1;{1208.916700001806,962.1525999996811,0.0}
Trams146;14;3;14155;9:2;{7477.508000001311,3581.729000000283,0.0}
Trams146;14;2;14156;9:2;{7477.508000001311,3581.729000000283,0.0}
Trams181;18;3;14159;9:3;{845.340600002557,806.1041999999434,0.0}
Trams182;18;2;14159;9:3;{2627.1466000005603,1561.507400000468,0.0}
Trams185;18;0;14159;9:3;{7477.508000001311,3581.729000000283,0.0}
Trams188;18;1;14161;9:3;{2110.2352000027895,1344.0613000001758,0.0}
Trams141;14;19;14161;9:3;{2597.49450000003,904.9190000016242,0.0}
Trams141;14;20;14169;9:4;{2839.1857000030577,1180.8036000002176,0.0}
Trams145;14;1;14170;9:5;{7477.508000001311,3581.729000000283,0.0}
Trams184;18;1;14182;9:7;{7477.508000001311,3581.729000000283,0.0}
Trams184;18;0;14183;9:7;{7477.508000001311,3581.729000000283,0.0}
Trams143;14;2;14185;9:7;{2774.94460455129,1095.9101807449765,0.0}
Trams188;18;0;14190;9:8;{845.340600002557,806.1041999999434,0.0}
Trams144;14;1;14190;9:8;{7477.508000001311,3581.729000000283,0.0}
Trams183;18;2;14223;9:13;{7477.508000001311,3581.729000000283,0.0}
Trams187;18;3;14245;9:17;{845.340600002557,806.1041999999434,0.0}
Trams182;18;1;14266;9:21;{7477.508000001311,3581.729000000283,0.0}
Trams141;14;5;14280;9:23;{7477.508000001311,3581.729000000283,0.0}
Trams141;14;4;14281;9:23;{7477.508000001311,3581.729000000283,0.0}
Trams181;18;4;16667;16:1;{7477.508000001311,3581.729000000283,0.0}
Trams142;14;2;16673;16:2;{6831.853600002825,3315.144899999723,0.0}
Trams186;18;2;16675;16:2;{2627.1466000005603,1561.507400000468,0.0}
Trams181;18;5;16683;16:3;{6831.853600002825,3315.144899999723,0.0}
Trams143;14;10;16692;16:5;{7477.508000001311,3581.729000000283,0.0}
Trams185;18;1;16697;16:6;{2149.2538000009954,1363.784799998626,0.0}
Trams188;18;1;16698;16:6;{7477.508000001311,3581.729000000283,0.0}
Trams184;18;1;16700;16:6;{1241.924200002104,980.4126999992877,0.0}
Trams143;14;12;16700;16:6;{7172.43200000003,3532.2607999984175,0.0}
Trams188;18;2;16706;16:7;{7172.43200000003,3532.2607999984175,0.0}
Trams143;14;13;16708;16:8;{6831.853600002825,3315.144899999723,0.0}
Trams144;14;2;16712;16:8;{3035.1652000024915,1729.7097000014037,0.0}
Trams184;18;2;16720;16:10;{2149.2538000009954,1363.784799998626,0.0}
Trams181;18;4;16723;16:10;{5010.473492013262,2527.781076226536,0.0}
Trams143;14;12;16724;16:10;{6138.21238208538,2940.1058384544613,0.0}
Trams149;14;11;16726;16:11;{7477.508000001311,3581.729000000283,0.0}
Trams186;18;1;16728;16:11;{5108.905971347362,2577.745680309252,0.0}
Trams184;18;1;16731;16:11;{2675.4015184145933,1580.8842637522473,0.0}
Trams142;14;3;16734;16:12;{4031.8555000014603,2128.9623999986798,0.0}
Trams149;14;12;16734;16:12;{7172.43200000003,3532.2607999984175,0.0}
Trams141;14;5;16738;16:13;{2992.747200001031,1703.0900999996811,0.0}
Trams148;14;12;16746;16:14;{7477.508000001311,3581.729000000283,0.0}
Trams143;14;13;16747;16:14;{5058.904000002891,2546.714799998328,0.0}
Trams143;14;12;16748;16:14;{5010.473492013262,2527.781076226536,0.0}
Trams187;18;6;16753;16:15;{7477.508000001311,3581.729000000283,0.0}
Trams188;18;1;16754;16:15;{5010.473492013262,2527.781076226536,0.0}
Trams143;14;11;16755;16:15;{4672.309900000691,2395.577299999073,0.0}
Trams144;14;1;16756;16:16;{5108.905971347362,2577.745680309252,0.0}
Trams141;14;4;16759;16:16;{2567.6414284064917,825.1840510346515,0.0}
Trams147;14;7;16761;16:16;{7477.508000001311,3581.729000000283,0.0}
Trams147;14;8;16762;16:17;{7446.12100000307,3545.9720000009984,0.0}
Trams149;14;11;16768;16:18;{5641.738919684285,2786.998382666919,0.0}
Trams182;18;4;16774;16:19;{845.340600002557,806.1041999999434,0.0}
Trams181;18;3;16775;16:19;{2589.0274000018835,1538.5219000000507,0.0}
Trams146;14;12;16776;16:19;{7477.508000001311,3581.729000000283,0.0}
Trams142;14;2;16777;16:19;{2567.6414284064917,825.1840510346515,0.0}
Trams148;14;13;16777;16:19;{6188.119100000709,2954.7112999986857,0.0}
Trams148;14;12;16778;16:19;{6138.21238208538,2940.1058384544613,0.0}
Trams149;14;9;16781;16:20;{5058.904000002891,2546.714799998328,0.0}
Trams186;18;5;16783;16:20;{7477.508000001311,3581.729000000283,0.0}
Trams184;18;0;16784;16:20;{5123.508700001985,2583.745899999514,0.0}
Trams185;18;0;16784;16:20;{6221.943900000304,2968.579499999061,0.0}
Trams149;14;8;16789;16:21;{4672.309900000691,2395.577299999073,0.0}
Trams149;14;7;16790;16:21;{4624.179771982149,2375.8925514936154,0.0}
Trams145;14;6;16791;16:21;{7477.508000001311,3581.729000000283,0.0}
Trams145;14;9;16792;16:22;{7446.12100000307,3545.9720000009984,0.0}
Trams142;14;1;16800;16:23;{2633.281761326615,942.6452763450786,0.0}
Trams148;14;11;16801;16:23;{5058.904000002891,2546.714799998328,0.0}
Trams148;14;8;16802;16:23;{5010.473492013262,2527.781076226536,0.0}
Trams147;14;9;16804;16:24;{5634.466500002891,2784.006800001487,0.0}
Trams146;14;11;16808;16:24;{6138.21238208538,2940.1058384544613,0.0}
Trams148;14;6;16809;16:24;{4672.309900000691,2395.577299999073,0.0}
Trams148;14;4;16810;16:25;{4624.179771982149,2375.8925514936154,0.0}
Trams144;14;7;16811;16:25;{7477.508000001311,3581.729000000283,0.0}
Trams143;14;8;16812;16:25;{2567.6414284064917,825.1840510346515,0.0}
Trams181;18;5;16814;16:25;{845.340600002557,806.1041999999434,0.0}
Trams182;18;5;16814;16:25;{2627.1466000005603,1561.507400000468,0.0}
Trams185;18;3;16816;16:26;{7446.12100000307,3545.9720000009984,0.0}
Trams147;14;8;16816;16:26;{5058.904000002891,2546.714799998328,0.0}
Trams143;14;5;16822;16:27;{2894.896500002593,514.0241999980062,0.0}
Trams185;18;4;16823;16:27;{7172.43200000003,3532.2607999984175,0.0}
Trams181;18;6;16824;16:27;{1241.924200002104,980.4126999992877,0.0}
Trams183;18;1;16824;16:27;{5108.905971347362,2577.745680309252,0.0}
Trams188;18;0;16824;16:27;{1740.6504000015557,1186.7970000002533,0.0}
Trams186;18;4;16826;16:27;{5634.466500002891,2784.006800001487,0.0}
Trams144;14;8;16827;16:27;{6831.853600002825,3315.144899999723,0.0}
Trams146;14;10;16832;16:28;{5010.473492013262,2527.781076226536,0.0}
Trams144;14;9;16834;16:29;{6563.806600000709,3123.2601999994367,0.0}
Trams184;18;6;16838;16:29;{7477.508000001311,3581.729000000283,0.0}
Trams147;14;9;16838;16:29;{4031.8555000014603,2128.9623999986798,0.0}
Trams149;14;6;16838;16:29;{2808.1955000013113,1135.889900000766,0.0}
Trams146;14;9;16839;16:29;{4672.309900000691,2395.577299999073,0.0}
Trams149;14;5;16839;16:29;{2774.94460455129,1095.9101807449765,0.0}
Trams181;18;5;16844;16:30;{2149.2538000009954,1363.784799998626,0.0}
Trams149;14;4;16845;16:30;{2569.3393000029027,869.8653000015765,0.0}
Trams145;14;10;16846;16:31;{5058.904000002891,2546.714799998328,0.0}
Trams149;14;2;16846;16:31;{2567.6414284064917,825.1840510346515,0.0}
Trams185;18;2;16847;16:31;{6138.21238208538,2940.1058384544613,0.0}
Trams144;14;7;16853;16:32;{5641.738919684285,2786.998382666919,0.0}
Trams181;18;4;16854;16:32;{2627.1466000005603,1561.507400000468,0.0}
Trams144;14;8;16854;16:32;{5634.466500002891,2784.006800001487,0.0}
Trams145;14;9;16854;16:32;{4672.309900000691,2395.577299999073,0.0}
Trams145;14;8;16855;16:32;{4624.179771982149,2375.8925514936154,0.0}
Trams149;14;1;16856;16:32;{2894.896500002593,514.0241999980062,0.0}
Trams182;18;4;16859;16:33;{4722.0763000026345,2426.624300001189,0.0}
Trams147;14;10;16860;16:33;{2992.747200001031,1703.0900999996811,0.0}
Trams184;18;7;16861;16:33;{6563.806600000709,3123.2601999994367,0.0}
Trams187;18;4;16861;16:33;{2589.0274000018835,1538.5219000000507,0.0}
Trams144;14;7;16866;16:34;{5058.904000002891,2546.714799998328,0.0}
Trams148;14;2;16866;16:34;{2567.6414284064917,825.1840510346515,0.0}
Trams182;18;3;16867;16:34;{5108.905971347362,2577.745680309252,0.0}
Trams184;18;6;16870;16:35;{6138.21238208538,2940.1058384544613,0.0}
Trams147;14;8;16873;16:35;{2808.1955000013113,1135.889900000766,0.0}
Trams144;14;5;16874;16:35;{4672.309900000691,2395.577299999073,0.0}
Trams148;14;1;16876;16:36;{2894.896500002593,514.0241999980062,0.0}
Trams183;18;12;16879;16:36;{7477.508000001311,3581.729000000283,0.0}
Trams187;18;2;16879;16:36;{1740.6504000015557,1186.7970000002533,0.0}
Trams182;18;2;16880;16:36;{5689.812200002372,2815.7713999990374,0.0}
Trams147;14;7;16880;16:36;{2569.3393000029027,869.8653000015765,0.0}
Trams182;18;1;16881;16:36;{5739.764803540053,2830.2159521656795,0.0}
Trams147;14;6;16881;16:36;{2567.6414284064917,825.1840510346515,0.0}
Trams183;18;13;16887;16:37;{7172.43200000003,3532.2607999984175,0.0}
Trams146;14;8;16889;16:38;{2774.94460455129,1095.9101807449765,0.0}
Trams147;14;2;16891;16:38;{2894.896500002593,514.0241999980062,0.0}
Trams184;18;5;16894;16:39;{5010.473492013262,2527.781076226536,0.0}
Trams146;14;7;16895;16:39;{2569.3393000029027,869.8653000015765,0.0}
Trams146;14;3;16896;16:39;{2567.6414284064917,825.1840510346515,0.0}
Trams143;14;4;16899;16:39;{5108.905971347362,2577.745680309252,0.0}
Trams184;18;3;16901;16:40;{4672.309900000691,2395.577299999073,0.0}
Trams186;18;3;16901;16:40;{2110.2352000027895,1344.0613000001758,0.0}
Trams141;14;24;16901;16:40;{7477.508000001311,3581.729000000283,0.0}
Trams183;18;15;16902;16:40;{6563.806600000709,3123.2601999994367,0.0}
Trams145;14;7;16903;16:40;{2808.1955000013113,1135.889900000766,0.0}
Trams146;14;2;16906;16:41;{2894.896500002593,514.0241999980062,0.0}
Trams186;18;1;16909;16:41;{1740.6504000015557,1186.7970000002533,0.0}
Trams144;14;6;16910;16:41;{2992.747200001031,1703.0900999996811,0.0}
Trams183;18;14;16911;16:41;{6138.21238208538,2940.1058384544613,0.0}
Trams145;14;5;16911;16:41;{2567.6414284064917,825.1840510346515,0.0}
Trams184;18;2;16915;16:42;{4031.8555000014603,2128.9623999986798,0.0}
Trams142;14;12;16919;16:43;{7477.508000001311,3581.729000000283,0.0}
Trams145;14;6;16920;16:43;{2894.896500002593,514.0241999980062,0.0}
Trams145;14;3;16921;16:43;{2894.896500002593,514.0241999980062,0.0}
Trams182;18;5;16922;16:43;{7477.508000001311,3581.729000000283,0.0}
Trams187;18;4;16922;16:43;{1782.5218000002205,1208.6106000002474,0.0}
Trams185;18;1;16923;16:43;{2589.0274000018835,1538.5219000000507,0.0}
Trams186;18;3;16930;16:45;{845.340600002557,806.1041999999434,0.0}
Trams181;18;3;16931;16:45;{6221.943900000304,2968.579499999061,0.0}
Trams144;14;4;16931;16:45;{2567.6414284064917,825.1840510346515,0.0}
Trams183;18;12;16935;16:45;{5010.473492013262,2527.781076226536,0.0}
Trams185;18;0;16941;16:46;{1740.6504000015557,1186.7970000002533,0.0}
Trams144;14;1;16941;16:46;{2894.896500002593,514.0241999980062,0.0}
Trams183;18;8;16942;16:47;{4672.309900000691,2395.577299999073,0.0}
Trams141;14;23;16944;16:47;{5634.466500002891,2784.006800001487,0.0}
Trams142;14;13;16950;16:48;{6188.119100000709,2954.7112999986857,0.0}
Trams143;14;22;16954;16:49;{7477.508000001311,3581.729000000283,0.0}
Trams183;18;7;16956;16:49;{4031.8555000014603,2128.9623999986798,0.0}
Trams141;14;22;16956;16:49;{5058.904000002891,2546.714799998328,0.0}
Trams184;18;1;16957;16:49;{2064.0685709043055,1320.5282183098925,0.0}
Trams181;18;5;16962;16:50;{7477.508000001311,3581.729000000283,0.0}
Trams185;18;2;16962;16:50;{845.340600002557,806.1041999999434,0.0}
Trams182;18;6;16965;16:50;{5634.466500002891,2784.006800001487,0.0}
Trams186;18;2;16970;16:51;{2627.1466000005603,1561.507400000468,0.0}
Trams143;14;23;16970;16:51;{6831.853600002825,3315.144899999723,0.0}
Trams142;14;11;16975;16:52;{5010.473492013262,2527.781076226536,0.0}
Trams183;18;8;16978;16:53;{2992.747200001031,1703.0900999996811,0.0}
Trams141;14;21;16978;16:53;{4031.8555000014603,2128.9623999986798,0.0}
Trams142;14;10;16982;16:53;{4672.309900000691,2395.577299999073,0.0}
Trams142;14;9;16983;16:53;{4624.179771982149,2375.8925514936154,0.0}
Trams185;18;3;16984;16:54;{1782.5218000002205,1208.6106000002474,0.0}
Trams184;18;2;16985;16:54;{845.340600002557,806.1041999999434,0.0}
Trams187;18;3;16985;16:54;{4722.0763000026345,2426.624300001189,0.0}
Trams183;18;7;16987;16:54;{2589.0274000018835,1538.5219000000507,0.0}
Trams149;14;8;16988;16:54;{7477.508000001311,3581.729000000283,0.0}
Trams188;18;2;16993;16:55;{7477.508000001311,3581.729000000283,0.0}
Trams187;18;2;16994;16:55;{5123.508700001985,2583.745899999514,0.0}
Trams143;14;20;16996;16:56;{5641.738919684285,2786.998382666919,0.0}
Trams149;14;9;16996;16:56;{7172.43200000003,3532.2607999984175,0.0}
Trams143;14;21;16997;16:56;{5634.466500002891,2784.006800001487,0.0}
Trams183;18;2;16998;16:56;{2064.0685709043055,1320.5282183098925,0.0}
Trams141;14;22;17000;16:56;{2992.747200001031,1703.0900999996811,0.0}
Trams183;18;1;17005;16:57;{1740.6504000015557,1186.7970000002533,0.0}
Trams148;14;8;17008;16:58;{7477.508000001311,3581.729000000283,0.0}
Trams143;14;19;17009;16:58;{5058.904000002891,2546.714799998328,0.0}
Trams143;14;16;17010;16:58;{5010.473492013262,2527.781076226536,0.0}
Trams141;14;20;17013;16:58;{2808.1955000013113,1135.889900000766,0.0}
Trams141;14;19;17014;16:59;{2774.94460455129,1095.9101807449765,0.0}
Trams143;14;13;17017;16:59;{4672.309900000691,2395.577299999073,0.0}
Trams141;14;12;17020;17:0;{2569.3393000029027,869.8653000015765,0.0}
Trams141;14;10;17021;17:0;{2567.6414284064917,825.1840510346515,0.0}
Trams147;14;10;17023;17:0;{7477.508000001311,3581.729000000283,0.0}
Trams183;18;2;17026;17:1;{845.340600002557,806.1041999999434,0.0}
Trams182;18;3;17030;17:1;{2589.0274000018835,1538.5219000000507,0.0}
Trams149;14;7;17030;17:1;{5641.738919684285,2786.998382666919,0.0}
Trams141;14;5;17031;17:1;{2894.896500002593,514.0241999980062,0.0}
Trams142;14;7;17031;17:1;{2808.1955000013113,1135.889900000766,0.0}
Trams185;18;5;17033;17:2;{4084.1569000035524,2161.088000001386,0.0}
Trams184;18;3;17034;17:2;{3035.1652000024915,1729.7097000014037,0.0}
Trams186;18;1;17037;17:2;{5739.764803540053,2830.2159521656795,0.0}
Trams146;14;16;17038;17:3;{7477.508000001311,3581.729000000283,0.0}
Trams142;14;6;17039;17:3;{2567.6414284064917,825.1840510346515,0.0}
Trams148;14;7;17040;17:3;{6138.21238208538,2940.1058384544613,0.0}
Trams182;18;2;17041;17:3;{2064.0685709043055,1320.5282183098925,0.0}
Trams146;14;17;17046;17:4;{7172.43200000003,3532.2607999984175,0.0}
Trams185;18;2;17047;17:4;{4722.0763000026345,2426.624300001189,0.0}
Trams187;18;10;17048;17:4;{7477.508000001311,3581.729000000283,0.0}
Trams142;14;7;17048;17:4;{2894.896500002593,514.0241999980062,0.0}
Trams142;14;2;17049;17:4;{2894.896500002593,514.0241999980062,0.0}
Trams141;14;6;17051;17:5;{2839.1857000030577,1180.8036000002176,0.0}
Trams148;14;8;17051;17:5;{5634.466500002891,2784.006800001487,0.0}
Trams145;14;8;17053;17:5;{7477.508000001311,3581.729000000283,0.0}
Trams185;18;1;17055;17:5;{5108.905971347362,2577.745680309252,0.0}
Trams184;18;4;17056;17:6;{4084.1569000035524,2161.088000001386,0.0}
Trams147;14;9;17065;17:7;{5641.738919684285,2786.998382666919,0.0}
Trams182;18;4;17069;17:8;{845.340600002557,806.1041999999434,0.0}
Trams185;18;0;17069;17:8;{5739.764803540053,2830.2159521656795,0.0}
Trams142;14;3;17069;17:8;{2839.1857000030577,1180.8036000002176,0.0}
Trams181;18;4;17070;17:8;{2589.0274000018835,1538.5219000000507,0.0}
Trams146;14;15;17070;17:8;{6138.21238208538,2940.1058384544613,0.0}
Trams148;14;7;17071;17:8;{4672.309900000691,2395.577299999073,0.0}
Trams143;14;10;17073;17:8;{2569.3393000029027,869.8653000015765,0.0}
Trams144;14;15;17073;17:8;{7477.508000001311,3581.729000000283,0.0}
Trams143;14;9;17074;17:9;{2567.6414284064917,825.1840510346515,0.0}
Trams144;14;17;17074;17:9;{7446.12100000307,3545.9720000009984,0.0}
Trams184;18;3;17078;17:9;{5108.905971347362,2577.745680309252,0.0}
Trams186;18;4;17078;17:9;{7477.508000001311,3581.729000000283,0.0}
Trams182;18;5;17079;17:9;{1241.924200002104,980.4126999992877,0.0}
Trams184;18;2;17079;17:9;{5123.508700001985,2583.745899999514,0.0}
Trams181;18;3;17080;17:10;{2110.2352000027895,1344.0613000001758,0.0}
Trams146;14;13;17080;17:10;{5641.738919684285,2786.998382666919,0.0}
Trams144;14;18;17081;17:10;{7172.43200000003,3532.2607999984175,0.0}
Trams143;14;10;17083;17:10;{2894.896500002593,514.0241999980062,0.0}
Trams143;14;5;17084;17:10;{2894.896500002593,514.0241999980062,0.0}
Trams141;14;5;17086;17:11;{4084.1569000035524,2161.088000001386,0.0}
Trams147;14;8;17086;17:11;{4672.309900000691,2395.577299999073,0.0}
Trams147;14;7;17087;17:11;{4624.179771982149,2375.8925514936154,0.0}
Trams144;14;19;17089;17:11;{6831.853600002825,3315.144899999723,0.0}
Trams184;18;1;17092;17:12;{5739.764803540053,2830.2159521656795,0.0}
Trams146;14;12;17093;17:12;{5058.904000002891,2546.714799998328,0.0}
Trams146;14;10;17094;17:12;{5010.473492013262,2527.781076226536,0.0}
Trams143;14;6;17096;17:12;{2597.49450000003,904.9190000016242,0.0}
Trams147;14;6;17100;17:13;{4031.8555000014603,2128.9623999986798,0.0}
Trams149;14;6;17100;17:13;{2808.1955000013113,1135.889900000766,0.0}
Trams146;14;8;17101;17:13;{4672.309900000691,2395.577299999073,0.0}
Trams149;14;2;17101;17:13;{2774.94460455129,1095.9101807449765,0.0}
Trams187;18;9;17103;17:13;{5058.904000002891,2546.714799998328,0.0}
Trams187;18;8;17104;17:14;{5010.473492013262,2527.781076226536,0.0}
Trams148;14;6;17107;17:14;{2992.747200001031,1703.0900999996811,0.0}
Trams149;14;3;17107;17:14;{2569.3393000029027,869.8653000015765,0.0}
Trams149;14;2;17108;17:14;{2567.6414284064917,825.1840510346515,0.0}
Trams181;18;7;17109;17:14;{845.340600002557,806.1041999999434,0.0}
Trams145;14;7;17109;17:14;{5010.473492013262,2527.781076226536,0.0}
Trams185;18;18;17110;17:15;{7477.508000001311,3581.729000000283,0.0}
Trams183;18;1;17111;17:15;{4722.0763000026345,2426.624300001189,0.0}
Trams188;18;0;17112;17:15;{2064.0685709043055,1320.5282183098925,0.0}
Trams144;14;18;17116;17:16;{5634.466500002891,2784.006800001487,0.0}
Trams145;14;6;17116;17:16;{4672.309900000691,2395.577299999073,0.0}
Trams142;14;2;17117;17:16;{4707.823850244834,2420.7529164061234,0.0}
Trams143;14;8;17117;17:16;{3035.1652000024915,1729.7097000014037,0.0}
Trams148;14;5;17121;17:16;{2774.94460455129,1095.9101807449765,0.0}
Trams148;14;3;17127;17:17;{2569.3393000029027,869.8653000015765,0.0}
Trams144;14;16;17128;17:18;{5058.904000002891,2546.714799998328,0.0}
Trams144;14;14;17129;17:18;{5010.473492013262,2527.781076226536,0.0}
Trams184;18;14;17133;17:18;{7477.508000001311,3581.729000000283,0.0}
Trams184;18;18;17134;17:19;{7446.12100000307,3545.9720000009984,0.0}
Trams144;14;12;17136;17:19;{4672.309900000691,2395.577299999073,0.0}
Trams148;14;1;17138;17:19;{2894.896500002593,514.0241999980062,0.0}
Trams147;14;4;17142;17:20;{2569.3393000029027,869.8653000015765,0.0}
Trams147;14;3;17143;17:20;{2567.6414284064917,825.1840510346515,0.0}
Trams184;18;19;17149;17:21;{6831.853600002825,3315.144899999723,0.0}
Trams181;18;4;17150;17:21;{2675.4015184145933,1580.8842637522473,0.0}
Trams146;14;7;17151;17:21;{2774.94460455129,1095.9101807449765,0.0}
Trams185;18;17;17152;17:22;{5641.738919684285,2786.998382666919,0.0}
Trams182;18;4;17153;17:22;{4707.823850244834,2420.7529164061234,0.0}
Trams147;14;2;17153;17:22;{2894.896500002593,514.0241999980062,0.0}
Trams182;18;2;17154;17:22;{4722.0763000026345,2426.624300001189,0.0}
Trams187;18;7;17156;17:22;{2589.0274000018835,1538.5219000000507,0.0}
Trams146;14;6;17157;17:22;{2569.3393000029027,869.8653000015765,0.0}
Trams146;14;5;17158;17:23;{2567.6414284064917,825.1840510346515,0.0}
Trams143;14;6;17161;17:23;{5108.905971347362,2577.745680309252,0.0}
Trams143;14;5;17162;17:23;{5123.508700001985,2583.745899999514,0.0}
Trams141;14;24;17163;17:23;{7477.508000001311,3581.729000000283,0.0}
Trams184;18;18;17165;17:24;{6138.21238208538,2940.1058384544613,0.0}
Trams185;18;15;17165;17:24;{5058.904000002891,2546.714799998328,0.0}
Trams185;18;13;17166;17:24;{5010.473492013262,2527.781076226536,0.0}
Trams187;18;5;17166;17:24;{2110.2352000027895,1344.0613000001758,0.0}
Trams187;18;2;17167;17:24;{2064.0685709043055,1320.5282183098925,0.0}
Trams146;14;2;17168;17:24;{2894.896500002593,514.0241999980062,0.0}
Trams145;14;4;17172;17:25;{2569.3393000029027,869.8653000015765,0.0}
Trams185;18;9;17173;17:25;{4672.309900000691,2395.577299999073,0.0}
Trams183;18;18;17174;17:25;{7477.508000001311,3581.729000000283,0.0}
Trams185;18;7;17174;17:25;{4624.179771982149,2375.8925514936154,0.0}
Trams184;18;17;17175;17:25;{5641.738919684285,2786.998382666919,0.0}
Trams142;14;24;17181;17:26;{7477.508000001311,3581.729000000283,0.0}
Trams1411;14;7;17181;17:26;{7477.508000001311,3581.729000000283,0.0}
Trams1411;14;14;17182;17:27;{7446.12100000307,3545.9720000009984,0.0}
Trams145;14;3;17183;17:27;{2894.896500002593,514.0241999980062,0.0}
Trams144;14;10;17185;17:27;{2808.1955000013113,1135.889900000766,0.0}
Trams186;18;3;17186;17:27;{2589.0274000018835,1538.5219000000507,0.0}
Trams144;14;7;17186;17:27;{2774.94460455129,1095.9101807449765,0.0}
Trams184;18;15;17188;17:28;{5058.904000002891,2546.714799998328,0.0}
Trams184;18;14;17189;17:28;{5010.473492013262,2527.781076226536,0.0}
Trams1411;14;15;17189;17:28;{7172.43200000003,3532.2607999984175,0.0}
Trams183;18;20;17190;17:28;{6831.853600002825,3315.144899999723,0.0}
Trams144;14;6;17192;17:28;{2569.3393000029027,869.8653000015765,0.0}
Trams144;14;5;17193;17:28;{2567.6414284064917,825.1840510346515,0.0}
Trams181;18;3;17194;17:29;{4722.0763000026345,2426.624300001189,0.0}
Trams141;14;23;17195;17:29;{6138.21238208538,2940.1058384544613,0.0}
Trams184;18;9;17196;17:29;{4672.309900000691,2395.577299999073,0.0}
Trams186;18;2;17196;17:29;{2110.2352000027895,1344.0613000001758,0.0}
Trams184;18;7;17197;17:29;{4624.179771982149,2375.8925514936154,0.0}
Trams144;14;1;17203;17:30;{2894.896500002593,514.0241999980062,0.0}
Trams183;18;21;17205;17:30;{6188.119100000709,2954.7112999986857,0.0}
Trams141;14;22;17205;17:30;{5641.738919684285,2786.998382666919,0.0}
Trams183;18;20;17206;17:31;{6138.21238208538,2940.1058384544613,0.0}
Trams181;18;2;17216;17:32;{5739.764803540053,2830.2159521656795,0.0}
Trams143;14;24;17216;17:32;{7477.508000001311,3581.729000000283,0.0}
Trams1410;14;6;17216;17:32;{7477.508000001311,3581.729000000283,0.0}
Trams182;18;6;17217;17:32;{7477.508000001311,3581.729000000283,0.0}
Trams182;18;9;17218;17:33;{7446.12100000307,3545.9720000009984,0.0}
Trams185;18;5;17218;17:33;{2589.0274000018835,1538.5219000000507,0.0}
Trams1411;14;13;17224;17:34;{5634.466500002891,2784.006800001487,0.0}
Trams182;18;10;17225;17:34;{7172.43200000003,3532.2607999984175,0.0}
Trams141;14;23;17226;17:34;{4672.309900000691,2395.577299999073,0.0}
Trams185;18;3;17228;17:34;{2110.2352000027895,1344.0613000001758,0.0}
Trams185;18;0;17229;17:34;{2064.0685709043055,1320.5282183098925,0.0}
Trams183;18;12;17230;17:35;{5010.473492013262,2527.781076226536,0.0}
Trams1411;14;12;17236;17:36;{5058.904000002891,2546.714799998328,0.0}
Trams183;18;9;17237;17:36;{4672.309900000691,2395.577299999073,0.0}
Trams1411;14;11;17237;17:36;{5010.473492013262,2527.781076226536,0.0}
Trams183;18;6;17238;17:36;{4624.179771982149,2375.8925514936154,0.0}
Trams141;14;22;17240;17:36;{4031.8555000014603,2128.9623999986798,0.0}
Trams184;18;2;17241;17:36;{2589.0274000018835,1538.5219000000507,0.0}
Trams1411;14;10;17244;17:37;{4672.309900000691,2395.577299999073,0.0}
Trams186;18;3;17247;17:37;{1782.5218000002205,1208.6106000002474,0.0}
Trams143;14;22;17248;17:38;{6138.21238208538,2940.1058384544613,0.0}
Trams149;14;24;17250;17:38;{7477.508000001311,3581.729000000283,0.0}
Trams184;18;1;17252;17:38;{2064.0685709043055,1320.5282183098925,0.0}
Trams181;18;7;17257;17:39;{7477.508000001311,3581.729000000283,0.0}
Trams185;18;1;17257;17:39;{845.340600002557,806.1041999999434,0.0}
Trams142;14;23;17258;17:39;{4031.8555000014603,2128.9623999986798,0.0}
Trams143;14;21;17258;17:39;{5641.738919684285,2786.998382666919,0.0}
Trams182;18;8;17259;17:39;{5641.738919684285,2786.998382666919,0.0}
Trams148;14;13;17270;17:41;{7477.508000001311,3581.729000000283,0.0}
Trams143;14;20;17271;17:41;{5058.904000002891,2546.714799998328,0.0}
Trams1410;14;3;17272;17:42;{5010.473492013262,2527.781076226536,0.0}
Trams181;18;8;17273;17:42;{6831.853600002825,3315.144899999723,0.0}
Trams183;18;5;17273;17:42;{2992.747200001031,1703.0900999996811,0.0}
Trams141;14;16;17275;17:42;{2808.1955000013113,1135.889900000766,0.0}
Trams141;14;15;17276;17:42;{2774.94460455129,1095.9101807449765,0.0}
Trams185;18;0;17279;17:43;{1782.5218000002205,1208.6106000002474,0.0}
Trams1410;14;2;17279;17:43;{4672.309900000691,2395.577299999073,0.0}
Trams143;14;19;17280;17:43;{4624.179771982149,2375.8925514936154,0.0}
Trams183;18;1;17282;17:43;{2589.0274000018835,1538.5219000000507,0.0}
Trams141;14;9;17282;17:43;{2569.3393000029027,869.8653000015765,0.0}
Trams149;14;22;17282;17:43;{6138.21238208538,2940.1058384544613,0.0}
Trams141;14;7;17283;17:43;{2567.6414284064917,825.1840510346515,0.0}
Trams147;14;15;17285;17:44;{7477.508000001311,3581.729000000283,0.0}
Trams185;18;1;17287;17:44;{2149.2538000009954,1363.784799998626,0.0}
Trams188;18;3;17288;17:44;{7477.508000001311,3581.729000000283,0.0}
Trams183;18;0;17293;17:45;{2064.0685709043055,1320.5282183098925,0.0}
Trams141;14;6;17293;17:45;{2894.896500002593,514.0241999980062,0.0}
Trams142;14;20;17293;17:45;{2808.1955000013113,1135.889900000766,0.0}
Trams143;14;18;17293;17:45;{4031.8555000014603,2128.9623999986798,0.0}
Trams147;14;16;17293;17:45;{7172.43200000003,3532.2607999984175,0.0}
Trams149;14;23;17293;17:45;{5634.466500002891,2784.006800001487,0.0}
Trams1411;14;9;17293;17:45;{2808.1955000013113,1135.889900000766,0.0}
Trams142;14;18;17294;17:45;{2774.94460455129,1095.9101807449765,0.0}
Trams142;14;12;17300;17:46;{2569.3393000029027,869.8653000015765,0.0}
Trams146;14;10;17300;17:46;{7477.508000001311,3581.729000000283,0.0}
Trams1411;14;8;17300;17:46;{2569.3393000029027,869.8653000015765,0.0}
Trams142;14;7;17301;17:46;{2567.6414284064917,825.1840510346515,0.0}
Trams1411;14;7;17301;17:46;{2567.6414284064917,825.1840510346515,0.0}
Trams185;18;2;17306;17:47;{3035.1652000024915,1729.7097000014037,0.0}
Trams149;14;20;17306;17:47;{5010.473492013262,2527.781076226536,0.0}
Trams184;18;2;17310;17:48;{2149.2538000009954,1363.784799998626,0.0}
Trams142;14;3;17311;17:48;{2894.896500002593,514.0241999980062,0.0}
Trams1411;14;0;17311;17:48;{2894.896500002593,514.0241999980062,0.0}
Trams181;18;9;17312;17:48;{5058.904000002891,2546.714799998328,0.0}
Trams149;14;19;17313;17:48;{4672.309900000691,2395.577299999073,0.0}
Trams145;14;22;17315;17:49;{7477.508000001311,3581.729000000283,0.0}
Trams147;14;13;17317;17:49;{6138.21238208538,2940.1058384544613,0.0}
Trams186;18;2;17318;17:49;{5108.905971347362,2577.745680309252,0.0}
Trams181;18;7;17320;17:50;{4672.309900000691,2395.577299999073,0.0}
Trams145;14;23;17323;17:50;{7172.43200000003,3532.2607999984175,0.0}
Trams141;14;8;17326;17:51;{3035.1652000024915,1729.7097000014037,0.0}
Trams143;14;13;17328;17:51;{2808.1955000013113,1135.889900000766,0.0}
Trams147;14;11;17328;17:51;{5634.466500002891,2784.006800001487,0.0}
Trams143;14;12;17329;17:51;{2774.94460455129,1095.9101807449765,0.0}
Trams142;14;4;17331;17:51;{2839.1857000030577,1180.8036000002176,0.0}
Trams148;14;12;17333;17:52;{4672.309900000691,2395.577299999073,0.0}
Trams148;14;11;17334;17:52;{4624.179771982149,2375.8925514936154,0.0}
Trams182;18;6;17335;17:52;{2110.2352000027895,1344.0613000001758,0.0}
Trams143;14;13;17335;17:52;{2569.3393000029027,869.8653000015765,0.0}
Trams144;14;13;17335;17:52;{7477.508000001311,3581.729000000283,0.0}
Trams182;18;4;17336;17:52;{2064.0685709043055,1320.5282183098925,0.0}
Trams143;14;11;17336;17:52;{2567.6414284064917,825.1840510346515,0.0}
Trams182;18;3;17343;17:53;{1740.6504000015557,1186.7970000002533,0.0}
Trams187;18;12;17343;17:53;{7477.508000001311,3581.729000000283,0.0}
Trams187;18;13;17344;17:54;{7446.12100000307,3545.9720000009984,0.0}
Trams143;14;12;17345;17:54;{2894.896500002593,514.0241999980062,0.0}
Trams143;14;8;17346;17:54;{2894.896500002593,514.0241999980062,0.0}
Trams1410;14;0;17346;17:54;{2894.896500002593,514.0241999980062,0.0}
Trams141;14;7;17348;17:54;{4084.1569000035524,2161.088000001386,0.0}
Trams147;14;10;17348;17:54;{4672.309900000691,2395.577299999073,0.0}
Trams184;18;3;17351;17:55;{4084.1569000035524,2161.088000001386,0.0}
Trams185;18;0;17351;17:55;{5123.508700001985,2583.745899999514,0.0}
Trams182;18;2;17354;17:55;{1213.7785956119094,964.194963392883,0.0}
Trams146;14;7;17356;17:56;{5010.473492013262,2527.781076226536,0.0}
Trams145;14;21;17357;17:56;{5641.738919684285,2786.998382666919,0.0}
Trams149;14;15;17362;17:57;{2808.1955000013113,1135.889900000766,0.0}
Trams146;14;5;17363;17:57;{4672.309900000691,2395.577299999073,0.0}
Trams149;14;14;17363;17:57;{2774.94460455129,1095.9101807449765,0.0}
Trams182;18;3;17364;17:57;{845.340600002557,806.1041999999434,0.0}
Trams181;18;6;17365;17:57;{2589.0274000018835,1538.5219000000507,0.0}
Trams184;18;2;17365;17:57;{4722.0763000026345,2426.624300001189,0.0}
Trams144;14;12;17367;17:57;{6138.21238208538,2940.1058384544613,0.0}
Trams149;14;12;17369;17:58;{2569.3393000029027,869.8653000015765,0.0}
Trams148;14;10;17370;17:58;{2952.0448504139104,1673.1693294131398,0.0}
Trams149;14;7;17370;17:58;{2567.6414284064917,825.1840510346515,0.0}
Trams145;14;18;17371;17:58;{5010.473492013262,2527.781076226536,0.0}
Trams186;18;13;17373;17:58;{7477.508000001311,3581.729000000283,0.0}
Trams186;18;16;17374;17:59;{7446.12100000307,3545.9720000009984,0.0}
Trams181;18;3;17376;17:59;{2064.0685709043055,1320.5282183098925,0.0}
Trams144;14;11;17377;17:59;{5641.738919684285,2786.998382666919,0.0}
Trams145;14;17;17378;17:59;{4672.309900000691,2395.577299999073,0.0}
Trams145;14;14;17379;17:59;{4624.179771982149,2375.8925514936154,0.0}
Trams142;14;3;17380;18:0;{4722.0763000026345,2426.624300001189,0.0}
Trams149;14;2;17380;18:0;{2894.896500002593,514.0241999980062,0.0}
Trams148;14;11;17382;18:0;{2808.1955000013113,1135.889900000766,0.0}
Trams141;14;6;17384;18:0;{5739.764803540053,2830.2159521656795,0.0}
Trams147;14;11;17384;18:0;{2992.747200001031,1703.0900999996811,0.0}
Trams187;18;12;17386;18:1;{5634.466500002891,2784.006800001487,0.0}
Trams184;18;1;17387;18:1;{5739.764803540053,2830.2159521656795,0.0}
Trams188;18;4;17387;18:1;{2992.747200001031,1703.0900999996811,0.0}
Trams148;14;8;17389;18:1;{2569.3393000029027,869.8653000015765,0.0}
Trams148;14;7;17390;18:1;{2567.6414284064917,825.1840510346515,0.0}
Trams145;14;15;17392;18:2;{4031.8555000014603,2128.9623999986798,0.0}
Trams149;14;3;17392;18:2;{2597.49450000003,904.9190000016242,0.0}
Trams182;18;2;17395;18:2;{2197.307743831217,1383.6548398164498,0.0}
Trams188;18;3;17396;18:2;{2589.0274000018835,1538.5219000000507,0.0}
Trams144;14;9;17398;18:3;{4672.309900000691,2395.577299999073,0.0}
Trams147;14;9;17398;18:3;{2774.94460455129,1095.9101807449765,0.0}
Trams148;14;1;17400;18:3;{2894.896500002593,514.0241999980062,0.0}
Trams143;14;9;17401;18:3;{4084.1569000035524,2161.088000001386,0.0}
Trams185;18;6;17405;18:4;{7477.508000001311,3581.729000000283,0.0}
Trams186;18;15;17405;18:4;{6138.21238208538,2940.1058384544613,0.0}
Trams147;14;5;17405;18:4;{2567.6414284064917,825.1840510346515,0.0}
Trams187;18;10;17406;18:4;{4672.309900000691,2395.577299999073,0.0}
Trams188;18;2;17406;18:4;{2110.2352000027895,1344.0613000001758,0.0}
Trams187;18;9;17407;18:4;{4624.179771982149,2375.8925514936154,0.0}
Trams144;14;10;17412;18:5;{4031.8555000014603,2128.9623999986798,0.0}
Trams146;14;4;17412;18:5;{2808.1955000013113,1135.889900000766,0.0}
Trams146;14;3;17413;18:5;{2774.94460455129,1095.9101807449765,0.0}
Trams188;18;0;17414;18:5;{1740.6504000015557,1186.7970000002533,0.0}
Trams147;14;6;17414;18:5;{2894.896500002593,514.0241999980062,0.0}
Trams147;14;4;17415;18:5;{2894.896500002593,514.0241999980062,0.0}
Trams186;18;14;17416;18:6;{5634.466500002891,2784.006800001487,0.0}
Trams187;18;10;17420;18:6;{4031.8555000014603,2128.9623999986798,0.0}
Trams146;14;2;17420;18:6;{2567.6414284064917,825.1840510346515,0.0}
Trams141;14;24;17425;18:7;{7477.508000001311,3581.729000000283,0.0}
Trams181;18;4;17426;18:7;{1782.5218000002205,1208.6106000002474,0.0}
Trams145;14;13;17427;18:7;{2808.1955000013113,1135.889900000766,0.0}
Trams184;18;5;17428;18:8;{7477.508000001311,3581.729000000283,0.0}
Trams186;18;13;17428;18:8;{5058.904000002891,2546.714799998328,0.0}
Trams145;14;12;17428;18:8;{2774.94460455129,1095.9101807449765,0.0}
Trams186;18;11;17429;18:8;{5010.473492013262,2527.781076226536,0.0}
Trams146;14;1;17430;18:8;{2894.896500002593,514.0241999980062,0.0}
Trams145;14;10;17434;18:9;{2569.3393000029027,869.8653000015765,0.0}
Trams188;18;1;17435;18:9;{845.340600002557,806.1041999999434,0.0}
Trams145;14;9;17435;18:9;{2567.6414284064917,825.1840510346515,0.0}
Trams185;18;7;17436;18:9;{6188.119100000709,2954.7112999986857,0.0}
Trams186;18;10;17436;18:9;{4672.309900000691,2395.577299999073,0.0}
Trams186;18;9;17437;18:9;{4624.179771982149,2375.8925514936154,0.0}
Trams142;14;20;17443;18:10;{7477.508000001311,3581.729000000283,0.0}
Trams145;14;10;17444;18:10;{2894.896500002593,514.0241999980062,0.0}
Trams145;14;5;17445;18:10;{2894.896500002593,514.0241999980062,0.0}
Trams185;18;6;17447;18:11;{5641.738919684285,2786.998382666919,0.0}
Trams143;14;8;17447;18:11;{6221.943900000304,2968.579499999061,0.0}
Trams144;14;7;17447;18:11;{2808.1955000013113,1135.889900000766,0.0}
Trams185;18;5;17448;18:11;{5634.466500002891,2784.006800001487,0.0}
Trams144;14;6;17448;18:11;{2774.94460455129,1095.9101807449765,0.0}
Trams147;14;5;17448;18:11;{3035.1652000024915,1729.7097000014037,0.0}
Trams186;18;7;17450;18:11;{4031.8555000014603,2128.9623999986798,0.0}
Trams187;18;8;17451;18:11;{2589.0274000018835,1538.5219000000507,0.0}
Trams142;14;21;17451;18:11;{7172.43200000003,3532.2607999984175,0.0}
Trams144;14;3;17454;18:12;{2569.3393000029027,869.8653000015765,0.0}
Trams144;14;2;17455;18:12;{2567.6414284064917,825.1840510346515,0.0}
Trams185;18;3;17460;18:13;{5058.904000002891,2546.714799998328,0.0}
Trams185;18;2;17461;18:13;{5010.473492013262,2527.781076226536,0.0}
Trams187;18;6;17461;18:13;{2110.2352000027895,1344.0613000001758,0.0}
Trams187;18;5;17462;18:13;{2064.0685709043055,1320.5282183098925,0.0}
Trams144;14;3;17464;18:14;{2894.896500002593,514.0241999980062,0.0}
Trams144;14;2;17465;18:14;{2894.896500002593,514.0241999980062,0.0}
Trams141;14;22;17467;18:14;{5641.738919684285,2786.998382666919,0.0}
Trams185;18;1;17468;18:14;{4672.309900000691,2395.577299999073,0.0}
Trams183;18;5;17469;18:14;{7477.508000001311,3581.729000000283,0.0}
Trams187;18;2;17469;18:14;{1740.6504000015557,1186.7970000002533,0.0}
Trams183;18;7;17470;18:15;{7446.12100000307,3545.9720000009984,0.0}
Trams147;14;6;17470;18:15;{4084.1569000035524,2161.088000001386,0.0}
Trams142;14;22;17474;18:15;{6188.119100000709,2954.7112999986857,0.0}
Trams188;18;0;17475;18:15;{2627.1466000005603,1561.507400000468,0.0}
Trams143;14;13;17478;18:16;{7477.508000001311,3581.729000000283,0.0}
Trams141;14;21;17480;18:16;{5058.904000002891,2546.714799998328,0.0}
Trams186;18;5;17481;18:16;{2589.0274000018835,1538.5219000000507,0.0}
Trams149;14;2;17481;18:16;{6221.943900000304,2968.579499999061,0.0}
Trams183;18;8;17485;18:17;{6831.853600002825,3315.144899999723,0.0}
Trams144;14;3;17485;18:17;{2839.1857000030577,1180.8036000002176,0.0}
Trams143;14;14;17486;18:17;{7172.43200000003,3532.2607999984175,0.0}
Trams187;18;3;17490;18:18;{845.340600002557,806.1041999999434,0.0}
Trams184;18;3;17491;18:18;{4672.309900000691,2395.577299999073,0.0}
Trams186;18;3;17491;18:18;{2110.2352000027895,1344.0613000001758,0.0}
Trams184;18;2;17492;18:18;{4624.179771982149,2375.8925514936154,0.0}
Trams147;14;5;17492;18:18;{5108.905971347362,2577.745680309252,0.0}
Trams142;14;21;17499;18:19;{5010.473492013262,2527.781076226536,0.0}
Trams183;18;9;17500;18:20;{6188.119100000709,2954.7112999986857,0.0}
Trams141;14;24;17502;18:20;{4031.8555000014603,2128.9623999986798,0.0}
Trams143;14;15;17509;18:21;{6188.119100000709,2954.7112999986857,0.0}
Trams181;18;3;17510;18:21;{5689.812200002372,2815.7713999990374,0.0}
Trams183;18;8;17511;18:21;{5641.738919684285,2786.998382666919,0.0}
Trams182;18;11;17512;18:22;{7477.508000001311,3581.729000000283,0.0}
Trams149;14;8;17512;18:22;{7477.508000001311,3581.729000000283,0.0}
Trams147;14;4;17516;18:22;{6221.943900000304,2968.579499999061,0.0}
Trams186;18;4;17520;18:23;{845.340600002557,806.1041999999434,0.0}
Trams187;18;4;17520;18:23;{2149.2538000009954,1363.784799998626,0.0}
Trams142;14;22;17520;18:23;{4031.8555000014603,2128.9623999986798,0.0}
Trams183;18;6;17524;18:24;{5058.904000002891,2546.714799998328,0.0}
Trams185;18;0;17531;18:25;{1740.6504000015557,1186.7970000002533,0.0}
Trams183;18;3;17532;18:25;{4672.309900000691,2395.577299999073,0.0}
Trams148;14;6;17532;18:25;{7477.508000001311,3581.729000000283,0.0}
Trams143;14;14;17534;18:25;{5010.473492013262,2527.781076226536,0.0}
Trams144;14;2;17534;18:25;{4722.0763000026345,2426.624300001189,0.0}
Trams184;18;1;17536;18:26;{2589.0274000018835,1538.5219000000507,0.0}
Trams141;14;20;17537;18:26;{2808.1955000013113,1135.889900000766,0.0}
Trams141;14;16;17538;18:26;{2774.94460455129,1095.9101807449765,0.0}
Trams142;14;23;17542;18:27;{2992.747200001031,1703.0900999996811,0.0}
Trams141;14;10;17544;18:27;{2569.3393000029027,869.8653000015765,0.0}
Trams141;14;9;17545;18:27;{2567.6414284064917,825.1840510346515,0.0}
Trams147;14;8;17547;18:27;{7477.508000001311,3581.729000000283,0.0}
Trams147;14;10;17548;18:28;{7446.12100000307,3545.9720000009984,0.0}
Trams186;18;3;17551;18:28;{2197.307743831217,1383.6548398164498,0.0}
Trams181;18;5;17552;18:28;{7477.508000001311,3581.729000000283,0.0}
Trams141;14;5;17555;18:29;{2894.896500002593,514.0241999980062,0.0}
Trams148;14;7;17555;18:29;{6563.806600000709,3123.2601999994367,0.0}
Trams142;14;22;17556;18:29;{2774.94460455129,1095.9101807449765,0.0}
Trams142;14;18;17562;18:30;{2569.3393000029027,869.8653000015765,0.0}
Trams146;14;3;17562;18:30;{7477.508000001311,3581.729000000283,0.0}
Trams142;14;17;17563;18:30;{2567.6414284064917,825.1840510346515,0.0}
Trams182;18;9;17567;18:31;{5058.904000002891,2546.714799998328,0.0}
Trams142;14;4;17573;18:32;{2894.896500002593,514.0241999980062,0.0}
Trams182;18;8;17575;18:32;{4672.309900000691,2395.577299999073,0.0}
Trams184;18;2;17575;18:32;{845.340600002557,806.1041999999434,0.0}
Trams187;18;3;17575;18:32;{4722.0763000026345,2426.624300001189,0.0}
Trams182;18;7;17576;18:32;{4624.179771982149,2375.8925514936154,0.0}
Trams183;18;2;17577;18:32;{2589.0274000018835,1538.5219000000507,0.0}
Trams145;14;6;17578;18:33;{7446.12100000307,3545.9720000009984,0.0}
Trams185;18;1;17582;18:33;{2149.2538000009954,1363.784799998626,0.0}
Trams187;18;2;17583;18:33;{5108.905971347362,2577.745680309252,0.0}
Trams188;18;5;17583;18:33;{7477.508000001311,3581.729000000283,0.0}
Trams188;18;6;17584;18:34;{7446.12100000307,3545.9720000009984,0.0}
Trams184;18;3;17585;18:34;{1241.924200002104,980.4126999992877,0.0}
Trams146;14;4;17585;18:34;{6563.806600000709,3123.2601999994367,0.0}
Trams183;18;1;17587;18:34;{2110.2352000027895,1344.0613000001758,0.0}
Trams148;14;5;17587;18:34;{5058.904000002891,2546.714799998328,0.0}
Trams148;14;4;17588;18:34;{5010.473492013262,2527.781076226536,0.0}
Trams147;14;9;17589;18:34;{5641.738919684285,2786.998382666919,0.0}
Trams143;14;13;17590;18:35;{2808.1955000013113,1135.889900000766,0.0}
Trams188;18;7;17591;18:35;{7172.43200000003,3532.2607999984175,0.0}
Trams143;14;12;17591;18:35;{2774.94460455129,1095.9101807449765,0.0}
Trams143;14;11;17597;18:36;{2569.3393000029027,869.8653000015765,0.0}
Trams144;14;12;17597;18:36;{7477.508000001311,3581.729000000283,0.0}
Trams143;14;10;17598;18:36;{2567.6414284064917,825.1840510346515,0.0}
Trams145;14;7;17600;18:36;{6563.806600000709,3123.2601999994367,0.0}
Trams144;14;13;17605;18:37;{7172.43200000003,3532.2607999984175,0.0}
Trams143;14;11;17607;18:37;{2894.896500002593,514.0241999980062,0.0}
Trams181;18;4;17608;18:38;{5010.473492013262,2527.781076226536,0.0}
Trams143;14;8;17608;18:38;{2894.896500002593,514.0241999980062,0.0}
Trams141;14;6;17610;18:38;{4084.1569000035524,2161.088000001386,0.0}
Trams147;14;8;17610;18:38;{4672.309900000691,2395.577299999073,0.0}
Trams184;18;2;17615;18:39;{2627.1466000005603,1561.507400000468,0.0}
Trams182;18;6;17620;18:40;{2589.0274000018835,1538.5219000000507,0.0}
Trams145;14;8;17620;18:40;{5634.466500002891,2784.006800001487,0.0}
Trams149;14;7;17624;18:40;{2808.1955000013113,1135.889900000766,0.0}
Trams146;14;3;17625;18:40;{4672.309900000691,2395.577299999073,0.0}
Trams149;14;6;17625;18:40;{2774.94460455129,1095.9101807449765,0.0}
Trams186;18;2;17627;18:41;{5739.764803540053,2830.2159521656795,0.0}
Trams144;14;14;17628;18:41;{6188.119100000709,2954.7112999986857,0.0}
Trams182;18;3;17630;18:41;{2110.2352000027895,1344.0613000001758,0.0}
Trams148;14;5;17631;18:41;{2992.747200001031,1703.0900999996811,0.0}
Trams149;14;4;17631;18:41;{2569.3393000029027,869.8653000015765,0.0}
Trams182;18;2;17638;18:43;{1740.6504000015557,1186.7970000002533,0.0}
Trams183;18;2;17638;18:43;{1782.5218000002205,1208.6106000002474,0.0}
Trams187;18;14;17638;18:43;{7477.508000001311,3581.729000000283,0.0}
Trams188;18;6;17638;18:43;{5058.904000002891,2546.714799998328,0.0}
Trams144;14;13;17639;18:43;{5641.738919684285,2786.998382666919,0.0}
Trams146;14;4;17639;18:43;{4031.8555000014603,2128.9623999986798,0.0}
Trams144;14;12;17640;18:43;{5634.466500002891,2784.006800001487,0.0}
Trams143;14;10;17641;18:43;{3035.1652000024915,1729.7097000014037,0.0}
Trams145;14;7;17641;18:43;{4624.179771982149,2375.8925514936154,0.0}
Trams149;14;2;17642;18:43;{2894.896500002593,514.0241999980062,0.0}
Trams148;14;4;17644;18:44;{2808.1955000013113,1135.889900000766,0.0}
Trams183;18;3;17646;18:44;{2149.2538000009954,1363.784799998626,0.0}
Trams184;18;3;17646;18:44;{4084.1569000035524,2161.088000001386,0.0}
Trams141;14;5;17646;18:44;{5739.764803540053,2830.2159521656795,0.0}
Trams148;14;2;17651;18:45;{2569.3393000029027,869.8653000015765,0.0}
Trams144;14;11;17652;18:45;{5058.904000002891,2546.714799998328,0.0}
Trams182;18;3;17659;18:46;{845.340600002557,806.1041999999434,0.0}
Trams147;14;6;17659;18:46;{2808.1955000013113,1135.889900000766,0.0}
Trams181;18;3;17660;18:46;{2589.0274000018835,1538.5219000000507,0.0}
Trams184;18;2;17660;18:46;{4722.0763000026345,2426.624300001189,0.0}
Trams144;14;10;17660;18:46;{4672.309900000691,2395.577299999073,0.0}
Trams148;14;1;17662;18:47;{2894.896500002593,514.0241999980062,0.0}
Trams147;14;4;17667;18:47;{2567.6414284064917,825.1840510346515,0.0}
Trams186;18;10;17668;18:48;{7477.508000001311,3581.729000000283,0.0}
Trams182;18;5;17669;18:48;{1241.924200002104,980.4126999992877,0.0}
Trams146;14;3;17675;18:49;{2774.94460455129,1095.9101807449765,0.0}
Trams147;14;3;17677;18:49;{2894.896500002593,514.0241999980062,0.0}
Trams181;18;2;17678;18:49;{1740.6504000015557,1186.7970000002533,0.0}
Trams187;18;13;17680;18:50;{5641.738919684285,2786.998382666919,0.0}
Trams184;18;1;17681;18:50;{5689.812200002372,2815.7713999990374,0.0}
Trams187;18;12;17681;18:50;{5634.466500002891,2784.006800001487,0.0}
Trams146;14;2;17681;18:50;{2569.3393000029027,869.8653000015765,0.0}
Trams146;14;1;17682;18:50;{2567.6414284064917,825.1840510346515,0.0}
Trams141;14;23;17687;18:51;{7477.508000001311,3581.729000000283,0.0}
Trams145;14;8;17689;18:51;{2808.1955000013113,1135.889900000766,0.0}
Trams187;18;11;17693;18:52;{5058.904000002891,2546.714799998328,0.0}
Trams181;18;3;17699;18:53;{845.340600002557,806.1041999999434,0.0}
Trams185;18;7;17700;18:53;{7477.508000001311,3581.729000000283,0.0}
Trams187;18;9;17701;18:53;{4672.309900000691,2395.577299999073,0.0}
Trams188;18;4;17701;18:53;{2110.2352000027895,1344.0613000001758,0.0}
Trams188;18;2;17702;18:53;{2064.0685709043055,1320.5282183098925,0.0}
Trams142;14;8;17705;18:54;{7477.508000001311,3581.729000000283,0.0}
Trams145;14;6;17707;18:54;{2894.896500002593,514.0241999980062,0.0}
Trams183;18;2;17709;18:54;{5108.905971347362,2577.745680309252,0.0}
Trams188;18;1;17709;18:54;{1740.6504000015557,1186.7970000002533,0.0}
Trams143;14;8;17709;18:54;{6221.943900000304,2968.579499999061,0.0}
Trams144;14;9;17709;18:54;{2808.1955000013113,1135.889900000766,0.0}
Trams186;18;9;17710;18:55;{5641.738919684285,2786.998382666919,0.0}
Trams141;14;24;17710;18:55;{6563.806600000709,3123.2601999994367,0.0}
Trams186;18;8;17711;18:55;{5634.466500002891,2784.006800001487,0.0}
Trams146;14;2;17712;18:55;{2839.1857000030577,1180.8036000002176,0.0}
Trams144;14;6;17717;18:56;{2567.6414284064917,825.1840510346515,0.0}
Trams184;18;5;17723;18:57;{7477.508000001311,3581.729000000283,0.0}
Trams144;14;2;17727;18:57;{2894.896500002593,514.0241999980062,0.0}
Trams181;18;5;17729;18:58;{2149.2538000009954,1363.784799998626,0.0}
Trams141;14;23;17729;18:58;{5641.738919684285,2786.998382666919,0.0}
Trams182;18;6;17730;18:58;{4084.1569000035524,2161.088000001386,0.0}
Trams188;18;2;17730;18:58;{845.340600002557,806.1041999999434,0.0}
Trams141;14;24;17730;18:58;{5634.466500002891,2784.006800001487,0.0}
Trams186;18;6;17731;18:58;{4672.309900000691,2395.577299999073,0.0}
Trams185;18;6;17732;18:58;{6138.21238208538,2940.1058384544613,0.0}
Trams186;18;5;17732;18:58;{4624.179771982149,2375.8925514936154,0.0}
Trams183;18;1;17733;18:58;{6221.943900000304,2968.579499999061,0.0}
Trams187;18;8;17737;18:59;{2992.747200001031,1703.0900999996811,0.0}
Trams143;14;18;17740;19:0;{7477.508000001311,3581.729000000283,0.0}
Trams185;18;5;17742;19:0;{5641.738919684285,2786.998382666919,0.0}
Trams141;14;23;17742;19:0;{5058.904000002891,2546.714799998328,0.0}
Trams182;18;4;17743;19:0;{4707.823850244834,2420.7529164061234,0.0}
Trams141;14;22;17743;19:0;{5010.473492013262,2527.781076226536,0.0}
Trams187;18;7;17746;19:1;{2589.0274000018835,1538.5219000000507,0.0}
Trams141;14;21;17750;19:1;{4672.309900000691,2395.577299999073,0.0}
Trams141;14;20;17751;19:1;{4624.179771982149,2375.8925514936154,0.0}
Trams182;18;3;17752;19:2;{5108.905971347362,2577.745680309252,0.0}
Trams182;18;2;17753;19:2;{5123.508700001985,2583.745899999514,0.0}
Trams187;18;4;17756;19:2;{2110.2352000027895,1344.0613000001758,0.0}
Trams187;18;3;17757;19:2;{2064.0685709043055,1320.5282183098925,0.0}
Trams183;18;2;17764;19:4;{7477.508000001311,3581.729000000283,0.0}
Trams185;18;4;17764;19:4;{4624.179771982149,2375.8925514936154,0.0}
Trams187;18;2;17764;19:4;{1740.6504000015557,1186.7970000002533,0.0}
Trams184;18;4;17765;19:4;{5641.738919684285,2786.998382666919,0.0}
Trams142;14;7;17768;19:4;{4672.309900000691,2395.577299999073,0.0}
Trams146;14;1;17769;19:4;{5108.905971347362,2577.745680309252,0.0}
Trams186;18;4;17776;19:6;{2589.0274000018835,1538.5219000000507,0.0}
Trams184;18;2;17779;19:6;{5010.473492013262,2527.781076226536,0.0}
Trams142;14;6;17781;19:6;{4048.297289360261,2135.7927898531034,0.0}
Trams181;18;4;17784;19:7;{4722.0763000026345,2426.624300001189,0.0}
Trams186;18;5;17786;19:7;{2110.2352000027895,1344.0613000001758,0.0}
Trams186;18;4;17787;19:7;{2064.0685709043055,1320.5282183098925,0.0}
Trams181;18;3;17792;19:8;{5108.905971347362,2577.745680309252,0.0}
Trams186;18;3;17794;19:9;{1740.6504000015557,1186.7970000002533,0.0}
Trams143;14;17;17795;19:9;{5058.904000002891,2546.714799998328,0.0}
Trams141;14;18;17799;19:9;{2808.1955000013113,1135.889900000766,0.0}
Trams184;18;1;17800;19:10;{4031.8555000014603,2128.9623999986798,0.0}
Trams141;14;12;17800;19:10;{2774.94460455129,1095.9101807449765,0.0}
Trams143;14;16;17804;19:10;{4624.179771982149,2375.8925514936154,0.0}
Trams181;18;2;17806;19:11;{5739.764803540053,2830.2159521656795,0.0}
Trams141;14;11;17807;19:11;{2567.6414284064917,825.1840510346515,0.0}
Trams185;18;2;17808;19:11;{2589.0274000018835,1538.5219000000507,0.0}
Trams186;18;2;17815;19:12;{845.340600002557,806.1041999999434,0.0}
Trams141;14;4;17817;19:12;{2894.896500002593,514.0241999980062,0.0}
Trams142;14;5;17825;19:14;{2567.6414284064917,825.1840510346515,0.0}
Trams183;18;3;17827;19:14;{4672.309900000691,2395.577299999073,0.0}
Trams142;14;6;17834;19:15;{2894.896500002593,514.0241999980062,0.0}
Trams142;14;5;17835;19:15;{2894.896500002593,514.0241999980062,0.0}
Trams188;18;1;17837;19:16;{5739.764803540053,2830.2159521656795,0.0}
Trams183;18;2;17841;19:16;{4031.8555000014603,2128.9623999986798,0.0}
Trams143;14;13;17859;19:19;{2569.3393000029027,869.8653000015765,0.0}
Trams143;14;12;17860;19:20;{2567.6414284064917,825.1840510346515,0.0}
Trams143;14;8;17870;19:21;{2894.896500002593,514.0241999980062,0.0}
Trams183;18;1;17872;19:22;{2589.0274000018835,1538.5219000000507,0.0}
Trams143;14;9;17882;19:23;{2597.49450000003,904.9190000016242,0.0}
Trams143;14;8;17904;19:27;{3084.0353342962862,1747.4296273253601,0.0}
Trams141;14;5;18012;19:45;{4672.309900000691,2395.577299999073,0.0}
Trams141;14;4;18026;19:47;{4031.8555000014603,2128.9623999986798,0.0}
