{
  "warnings": [
    {
      "file": "/mnt/c/Users/xoeseko/Documents/School/Outils formels/PetriNet/Sources/PetriNet/PetriNet.swift",
      "line": 45,
      "symbol": "PetriNet.ArcLabel",
      "symbol_kind": "source.lang.swift.decl.typealias",
      "warning": "undocumented"
    },
    {
      "file": "/mnt/c/Users/xoeseko/Documents/School/Outils formels/PetriNet/Sources/PetriNet/PetriNet.swift",
      "line": 62,
      "symbol": "PetriNet.ArcDescription.init(place:transition:label:isPre:)",
      "symbol_kind": "source.lang.swift.decl.function.method.instance",
      "warning": "undocumented"
    },
    {
      "file": "/mnt/c/Users/xoeseko/Documents/School/Outils formels/PetriNet/Sources/PetriNet/PetriNet.swift",
      "line": 186,
      "symbol": "Place.Content",
      "symbol_kind": "source.lang.swift.decl.associatedtype",
      "warning": "undocumented"
    }
  ],
  "source_directory": "/mnt/c/Users/xoeseko/Documents/School/Outils formels/PetriNet"
}