{
    "data": [
        {
            "title": "Applied Information and Data Science",
            "degree": "Master",
            "type": "HES",
            "location": {
                "institution": "Hochschule Luzern HSLU",
                "city": "Lucerne (LU)"
            },
            "domains": [
                "Sciences informatiques",
                "Sciences des données"
            ],
            "language": "anglais",
            "link": "orientation.ch/dyn/show/4009?lang=fr&idx=120&id=50522"
        },
        {
            "title": "Artificial Intelligence",
            "degree": "Master",
            "type": "HEU",
            "location": {
                "institution": "Università della Svizzera italiana (USI)",
                "city": "Lugano (TI)"
            },
            "domains": [
                "Intelligence artificielle"
            ],
            "language": "anglais",
            "link": "orientation.ch/dyn/show/4009?lang=fr&idx=120&id=48350"
        },
        {
            "title": "Artificial Intelligence & Machine Learning",
            "degree": "Bachelor",
            "type": "HES",
            "location": {
                "institution": "Hochschule Luzern HSLU",
                "city": "Rotkreuz (ZG)"
            },
            "domains": [
                "Intelligence artificielle",
                "Sciences des données"
            ],
            "language": "allemand",
            "link": "orientation.ch/dyn/show/4009?lang=fr&idx=120&id=66919"
        },
        {
            "title": "Artificial Intelligence / Intelligence artificielle",
            "degree": "Master",
            "type": "HEU",
            "location": {
                "institution": "UniDistance Suisse",
                "city": "A distance"
            },
            "domains": [
                "Intelligence artificielle"
            ],
            "language": "anglais",
            "link": "orientation.ch/dyn/show/4009?lang=fr&idx=120&id=60933"
        },
        {
            "title": "Artificial Intelligence in Medicine / Künstliche Intelligenz in der Medizin, Spezialisierter Master",
            "degree": "Master",
            "type": "HEU",
            "location": {
                "institution": "Universität Bern UNIBE",
                "city": "Berne (BE)"
            },
            "domains": [
                    "Intelligence artificielle",
                    "Informatique pour la médecine"
            ],
            "language": "anglais",
            "link": "orientation.ch/dyn/show/4009?lang=fr&idx=120&id=72639"
        },
        {
            "title": "Bi-disciplinaire en sciences",
            "degree": "Master",
            "type": "HEU",
            "location": {
                "institution": "Université de Genève (UNIGE)",
                "city": "Genève (GE)"
            },
            "domains": [
                "Sciences informatiques"
            ],
            "language": "français",
            "link": "orientation.ch/dyn/show/4009?lang=fr&idx=120&id=32386"
        },
        {
            "title": "Bioinformatics / Bioinformatik, Nur-Nebenfach",
            "degree": "Master",
            "type": "HEU",
            "location": {
                "institution": "Universität Zürich UZH",
                "city": "Zurich 57 (ZH)"
            },
            "domains": [
                "Bioinformatique"
            ],
            "language": "anglais",
            "link": "orientation.ch/dyn/show/4009?lang=fr&idx=120&id=33068"
        },
        {
            "title": "Bioinformatics and computational biology / bioinformatique et biologie computationnelle, Joint Master ",
            "degree": "Master",
            "type": "HEU",
            "location": {
                "institution": "Universität Bern UNIBE",
                "city": "Fribourg (FR) - Berne (BE)"
            },
            "domains": [
                "Bioinformatique",
                "Sciences informatiques"
            ],
            "language": "anglais",
            "link": "orientation.ch/dyn/show/4009?lang=fr&idx=120&id=33202"
        },
        {
            "title": "Bioinformatik, Nur-Nebenfach",
            "degree": "Bachelor",
            "type": "HEU",
            "location": {
                "institution": "Universität Zürich UZH",
                "city": "Zurich 57 (ZH)"
            },
            "domains": [
                "Bioinformatique"
            ],
            "language": "anglais",
            "link": "orientation.ch/dyn/show/4009?lang=fr&idx=120&id=32445"
        },
        {
            "title": "Communication Systems / Systèmes de communication",
            "degree": "Master",
            "type": "HEU",
            "location": {
                "institution": "Ecole polytechnique fédérale de Lausanne (EPFL)",
                "city": "Lausanne (VD)"
            },
            "domains": [
                "Systèmes d'information"
            ],
            "language": "anglais",
            "link": "orientation.ch/dyn/show/4009?lang=fr&idx=120&id=32233"
        },
        {
            "title": "Computational and Data Science",
            "degree": "Bachelor",
            "type": "HES",
            "location": {
                "institution": "Fachhochschule Graubünden FHGR",
                "city": "Coire (GR)"
            },
            "domains": [
                "Sciences informatiques",
                "Sciences des données"
            ],
            "language": "allemand",
            "link": "orientation.ch/dyn/show/4009?lang=fr&idx=120&id=71842"
        },
        {
            "title": "Computational Biology and Bioinformatics, Spezialisierter Joint Master",
            "degree": "Master",
            "type": "HEU",
            "location": {
                "institution": "Eidgenössische Technische Hochschule Zürich ETHZ",
                "city": "Bâle (BS) - Zurich (ZH)"
            },
            "domains": [
                "Bioinformatique",
                "Sciences informatiques"
            ],
            "language": "anglais",
            "link": "orientation.ch/dyn/show/4009?lang=fr&idx=120&id=32704"
        },
        {
            "title": "Computational Linguistics and Language Technology",
            "degree": "Master",
            "type": "HEU",
            "location": {
                "institution": "Universität Zürich UZH",
                "city": "Zurich 57 (ZH)"
            },
            "domains": [
                "Informatique pour la linguistique"
            ],
            "language": "anglais",
            "link": "orientation.ch/dyn/show/4009?lang=fr&idx=120&id=32649"
        },
        {
            "title": "Computational Social Sciences",
            "degree": "Master",
            "type": "HEU",
            "location": {
                "institution": "Universität Luzern UNILU",
                "city": "Lucerne 2 (LU)"
            },
            "domains": [
                "Systèmes d'information"
            ],
            "language": "anglais",
            "link": "orientation.ch/dyn/show/4009?lang=fr&idx=120&id=63433"
        },
        {
            "title": "Computer Science",
            "degree": "Master",
            "type": "HEU",
            "location": {
                "institution": "Universität St. Gallen HSG",
                "city": "St-Gall (SG)"
            },
            "domains": [
                "Sciences informatiques"
            ],
            "language": "anglais",
            "link": "orientation.ch/dyn/show/4009?lang=fr&idx=120&id=71317"
        },
        {
            "title": "Computer Science",
            "degree": "Master",
            "type": "HEU",
            "location": {
                "institution": "Universität Basel UNIBAS",
                "city": "Bâle (BS)"
            },
            "domains": [
                "Sciences informatiques"
            ],
            "language": "anglais",
            "link": "orientation.ch/dyn/show/4009?lang=fr&idx=120&id=32287"
        },
        {
            "title": "Computer Science",
            "degree": "Bachelor",
            "type": "HEU",
            "location": {
                "institution": "Universität St. Gallen HSG",
                "city": "St-Gall (SG)"
            },
            "domains": [
                "Sciences informatiques"
            ],
            "language": "Berne (BE)",
            "link": "orientation.ch/dyn/show/4009?lang=fr&idx=120&id=77253"
        },
        {
            "title": "Computer Science / Informatik",
            "degree": "Bachelor",
            "type": "HEU",
            "location": {
                "institution": "Universität Bern UNIBE",
                "city": "Berne (BE)"
            },
            "domains": [
                "Sciences informatiques"
            ],
            "language": "allemand",
            "link": "orientation.ch/dyn/show/4009?lang=fr&idx=120&id=32248"
        },
        {
            "title": "Computer Science / Informatik",
            "degree": "Bachelor",
            "type": "HEU",
            "location": {
                "institution": "Universität Basel UNIBAS",
                "city": "Bâle (BS)"
            },
            "domains": [
                "Sciences informatiques"
            ],
            "language": "allemand - anglais",
            "link": "orientation.ch/dyn/show/4009?lang=fr&idx=120&id=32145"
        },
        {
            "title": "Computer Science / Informatik",
            "degree": "Bachelor",
            "type": "HEU",
            "location": {
                "institution": "Eidgenössische Technische Hochschule Zürich ETHZ",
                "city": "Zurich (ZH)"
            },
            "domains": [
                "Sciences informatiques"
            ],
            "language": "allemand",
            "link": "orientation.ch/dyn/show/4009?lang=fr&idx=120&id=31983"
        },
        {
            "title": "Computer Science / Informatik",
            "degree": "Master",
            "type": "HEU",
            "location": {
                "institution": "Eidgenössische Technische Hochschule Zürich ETHZ",
                "city": "Zurich (ZH)"
            },
            "domains": [
                "Sciences informatiques"
            ],
            "language": "anglais",
            "link": "orientation.ch/dyn/show/4009?lang=fr&idx=120&id=32264"
        },
        {
            "title": "Computer Science / Informatique",
            "degree": "Master",
            "type": "HEU",
            "location": {
                "institution": "Ecole polytechnique fédérale de Lausanne (EPFL)",
                "city": "Lausanne (VD)"
            },
            "domains": [
                "Sciences informatiques"
            ],
            "language": "anglais",
            "link": "orientation.ch/dyn/show/4009?lang=fr&idx=120&id=32232"
        },
        {
            "title": "Computer Science / Informatique, Joint Master",
            "degree": "Master",
            "type": "HEU",
            "location": {
                "institution": "Universität Bern UNIBE",
                "city": "Fribourg (FR) - Neuchâtel (NE) - Berne (BE)"
            },
            "domains": [
                "Sciences informatiques"
            ],
            "language": "anglais",
            "link": "orientation.ch/dyn/show/4009?lang=fr&idx=120&id=32850"
        },
        {
            "title": "Computerlinguistik und Sprachtechnologie",
            "degree": "Bachelor",
            "type": "HEU",
            "location": {
                "institution": "Universität Zürich UZH",
                "city": "Zurich 57 (ZH)"
            },
            "domains": [
                "Informatique pour la linguistique"
            ],
            "language": "allemand",
            "link": "orientation.ch/dyn/show/4009?lang=fr&idx=120&id=32648"
        },
        {
            "title": "Data Science",
            "degree": "Master",
            "type": "HEU",
            "location": {
                "institution": "Ecole polytechnique fédérale de Lausanne (EPFL)",
                "city": "Lausanne (VD)"
            },
            "domains": [
                "Sciences des données"
            ],
            "language": "anglais",
            "link": "orientation.ch/dyn/show/4009?lang=fr&idx=120&id=47335"
        },
        {
            "title": "Data Science",
            "degree": "Bachelor",
            "type": "HES",
            "location": {
                "institution": "Zürcher Hochschule für Angewandte Wissenschaften ZHAW",
                "city": "Winterthur (ZH)"
            },
            "domains": [
                "Sciences des données"
            ],
            "language": "allemand - anglais",
            "link": "orientation.ch/dyn/show/4009?lang=fr&idx=120&id=71654"
        },
        {
            "title": "Data Science",
            "degree": "Bachelor",
            "type": "HES",
            "location": {
                "institution": "Fachhochschule Nordwestschweiz FHNW",
                "city": "Windisch (AG)"
            },
            "domains": [
                "Sciences des données"
            ],
            "language": "allemand - anglais",
            "link": "orientation.ch/dyn/show/4009?lang=fr&idx=120&id=60544"
        },
        {
            "title": "Data Science / Science des données",
            "degree": "Bachelor",
            "type": "HEU",
            "location": {
                "institution": "Université de Neuchâtel (UNINE)",
                "city": "Neuchâtel (NE)"
            },
            "domains": [
                "Sciences des données"
            ],
            "language": "français - anglais",
            "link": "orientation.ch/dyn/show/4009?lang=fr&idx=120&id=75638"
        },
        {
            "title": "Data Science and Artificial Intelligence",
            "degree": "Bachelor",
            "type": "HES",
            "location": {
                "institution": "Fachhochschule Südschweiz SUPSI",
                "city": "Viganello (TI)"
            },
            "domains": [
                "Intelligence artificielle",
                "Sciences des données"
            ],
            "language": "anglais",
            "link": "orientation.ch/dyn/show/4009?lang=fr&idx=120&id=69502"
        },
        {
            "title": "Data Science, Spezialisierter Master",
            "degree": "Master",
            "type": "HEU",
            "location": {
                "institution": "Eidgenössische Technische Hochschule Zürich ETHZ",
                "city": "Zurich (ZH)"
            },
            "domains": [
                "Sciences des données"
            ],
            "language": "anglais",
            "link": "orientation.ch/dyn/show/4009?lang=fr&idx=120&id=69126"
        },
        {
            "title": "Data Science, Spezialisierter Master",
            "degree": "Master",
            "type": "HEU",
            "location": {
                "institution": "Universität Basel UNIBAS",
                "city": "Bâle (BS)"
            },
            "domains": [
                "Sciences des données"
            ],
            "language": "anglais",
            "link": "orientation.ch/dyn/show/4009?lang=fr&idx=120&id=74915"
        },
        {
            "title": "Digital Engineering",
            "degree": "Bachelor",
            "type": "HES",
            "location": {
                "institution": "Hochschule Luzern HSLU",
                "city": "Horw (LU)"
            },
            "domains": [
                "Ingéniérie informatique"
            ],
            "language": "allemand",
            "link": "orientation.ch/dyn/show/4009?lang=fr&idx=120&id=68783"
        },
        {
            "title": "Digital Humanities",
            "degree": "Master",
            "type": "HEU",
            "location": {
                "institution": "Universität Basel UNIBAS",
                "city": "Bâle (BS)"
            },
            "domains": [
                "Informatique pour les sciences humaines"
            ],
            "language": "allemand - anglais",
            "link": "orientation.ch/dyn/show/4009?lang=fr&idx=120&id=61112"
        },
        {
            "title": "Digital Humanities / Humanités digitales, Master spécialisé",
            "degree": "Master",
            "type": "HEU",
            "location": {
                "institution": "Ecole polytechnique fédérale de Lausanne (EPFL)",
                "city": "Lausanne (VD)"
            },
            "domains": [
                "Informatique pour les sciences humaines"
            ],
            "language": "anglais",
            "link": "orientation.ch/dyn/show/4009?lang=fr&idx=120&id=39963"
        },
        {
            "title": "Digital Humanities / Humanités numériques",
            "degree": "Master",
            "type": "HEU",
            "location": {
                "institution": "Université de Lausanne (UNIL)",
                "city": "Lausanne (VD)"
            },
            "domains": [
                "Informatique pour les sciences humaines"
            ],
            "language": "français",
            "link": "orientation.ch/dyn/show/4009?lang=fr&idx=120&id=47822"
        },
        {
            "title": "Digital Humanities, Nur-Nebenfach",
            "degree": "Master",
            "type": "HEU",
            "location": {
                "institution": "Universität Bern UNIBE",
                "city": "Berne (BE)"
            },
            "domains": [
                "Informatique pour les sciences humaines"
            ],
            "language": "allemand - anglais",
            "link": "orientation.ch/dyn/show/4009?lang=fr&idx=120&id=73506"
        },
        {
            "title": "Digital Linguistics / Digitale Linguistik, Nur-Nebenfach",
            "degree": "Master",
            "type": "HEU",
            "location": {
                "institution": "Universität Zürich UZH",
                "city": "Zurich (ZH)"
            },
            "domains": [
                "Informatique pour la linguistique"
            ],
            "language": "allemand",
            "link": "orientation.ch/dyn/show/4009?lang=fr&idx=120&id=61632"
        },
        {
            "title": "Digital Neuroscience / Neurosciences digitales, Master spécialisé",
            "degree": "Master",
            "type": "HEU",
            "location": {
                "institution": "Université de Fribourg (UNIFR)",
                "city": "Fribourg (FR)"
            },
            "domains": [
                "Informatique pour la médecine"
            ],
            "language": "anglais",
            "link": "orientation.ch/dyn/show/4009?lang=fr&idx=120&id=74645"
        },
        {
            "title": "Engineering, Profil Computer Science",
            "degree": "Master",
            "type": "HES",
            "location": {
                "institution": "Hochschule Luzern HSLU",
                "city": "Horw (LU)"
            },
            "domains": [
                "Ingéniérie informatique"
            ],
            "language": "allemand - anglais",
            "link": "orientation.ch/dyn/show/4009?lang=fr&idx=120&id=74397"
        },
        {
            "title": "Engineering, Profil Computer Science",
            "degree": "Master",
            "type": "HES",
            "location": {
                "institution": "Haute école spécialisée de Suisse occidentale HES-SO",
                "city": "Lausanne (VD) - Genève (GE) - Yverdon-les-Bains (VD) - Fribourg (FR) - Sion (VS) - Neuchâtel (NE) - Zurich (ZH)"
            },
            "domains": [
                "Ingéniérie informatique"
            ],
            "language": "français",
            "link": "orientation.ch/dyn/show/4009?lang=fr&idx=120&id=75076"
        },
        {
            "title": "Engineering, Profil Computer Science",
            "degree": "Master",
            "type": "HES",
            "location": {
                "institution": "Haute école spécialisée bernoise (HESB)",
                "city": "Bienne (BE) - Berthoud (BE)"
            },
            "domains": [
                "Ingéniérie informatique"
            ],
            "language": "français - allemand - anglais",
            "link": "orientation.ch/dyn/show/4009?lang=fr&idx=120&id=73870"
        },
        {
            "title": "Engineering, Profil Computer Science",
            "degree": "Master",
            "type": "HES",
            "location": {
                "institution": "Fachhochschule Nordwestschweiz FHNW",
                "city": "Windisch (AG)"
            },
            "domains": [
                "Sciences informatiques",
                "Ingéniérie informatique"
            ],
            "language": "anglais",
            "link": "orientation.ch/dyn/show/4009?lang=fr&idx=120&id=73134"
        },
        {
            "title": "Engineering, Profil Computer Science",
            "degree": "Master",
            "type": "HES",
            "location": {
                "institution": "Zürcher Hochschule für Angewandte Wissenschaften ZHAW",
                "city": "Zurich (ZH) - Winterthur (ZH)"
            },
            "domains": [
                "Sciences informatiques",
                "Ingéniérie informatique"
            ],
            "language": "anglais",
            "link": "orientation.ch/dyn/show/4009?lang=fr&idx=120&id=73932"
        },
        {
            "title": "Engineering, Profil Computer Science",
            "degree": "Master",
            "type": "HES",
            "location": {
                "institution": "Fachhochschule Südschweiz SUPSI",
                "city": "Viganello (TI)"
            },
            "domains": [
                "Sciences informatiques",
                "Ingéniérie informatique"
            ],
            "language": "italien",
            "link": "orientation.ch/dyn/show/4009?lang=fr&idx=120&id=74060"
        },
        {
            "title": "Engineering, Profil Computer Science",
            "degree": "Master",
            "type": "HES",
            "location": {
                "institution": "OST - Ostschweizer Fachhochschule",
                "city": "Rapperswil SG (SG) - Buchs SG (SG) - Zurich (ZH)"
            },
            "domains": [
                "Sciences informatiques",
                "Ingéniérie informatique"
            ],
            "language": "allemand",
            "link": "orientation.ch/dyn/show/4009?lang=fr&idx=120&id=72001"
        },
        {
            "title": "Engineering, Profil Data Science",
            "degree": "Master",
            "type": "HES",
            "location": {
                "institution": "OST - Ostschweizer Fachhochschule",
                "city": "Rapperswil SG (SG) - St-Gall 1 (SG) - Buchs SG (SG) - Zurich (ZH)"
            },
            "domains":[
                "Sciences des données",
                "Ingéniérie informatique"
            ],
            "language": "allemand",
            "link": "orientation.ch/dyn/show/4009?lang=fr&idx=120&id=72039"
        },
        {
            "title": "Engineering, Profil Data Science",
            "degree": "Master",
            "type": "HES",
            "location": {
                "institution": "Fachhochschule Südschweiz SUPSI",
                "city": "Viganello (TI)"
            },
            "domains": [
                "Sciences des données",
                "Ingéniérie informatique"
            ],
            "language": "italien",
            "link": "orientation.ch/dyn/show/4009?lang=fr&idx=120&id=74061"
        },
        {
            "title": "Engineering, Profil Data Science",
            "degree": "Master",
            "type": "HES",
            "location": {
                "institution": "Zürcher Hochschule für Angewandte Wissenschaften ZHAW",
                "city": "Zurich (ZH) - Winterthur (ZH)"
            },
            "domains": [
                "Sciences des données",
                "Ingéniérie informatique"
            ],
            "language": "anglais",
            "link": "orientation.ch/dyn/show/4009?lang=fr&idx=120&id=73933"
        },
        {
            "title": "Engineering, Profil Data Science",
            "degree": "Master",
            "location": {
                "institution": "Fachhochschule Nordwestschweiz FHNW",
                "city": "Windisch (AG)"
            },
            "domains": [
                "Sciences des données",
                "Ingéniérie informatique"
            ],
            "language": "anglais",
            "link": "orientation.ch/dyn/show/4009?lang=fr&idx=120&id=73137"
        },
        {
            "title": "Engineering, Profil Data Science",
            "degree": "Master",
            "type": "HES",
            "location": {
                "institution": "Haute école spécialisée bernoise (HESB)",
                "city": "Bienne (BE) - Berthoud (BE)"
            },
            "domains": [
                "Sciences des données",
                "Ingéniérie informatique"
            ],
            "language": "français - allemand - anglais",
            "link": "orientation.ch/dyn/show/4009?lang=fr&idx=120&id=73874"
        },
        {
            "title": "Engineering, Profil Data Science",
            "degree": "Master",
            "type": "HES",
            "location": {
                "institution": "Haute école spécialisée de Suisse occidentale HES-SO",
                "city": "Lausanne (VD) - Genève (GE) - Yverdon-les-Bains (VD) - Fribourg (FR) - Sion (VS) - Neuchâtel (NE) - Zurich (ZH)"
            },
            "domains": [
                "Sciences des données",
                "Ingéniérie informatique"
            ],
            "language": "français",
            "link": "orientation.ch/dyn/show/4009?lang=fr&idx=120&id=75078"
        },
        {
            "title": "Engineering, Profil Data Science",
            "degree": "Master",
            "type": "HES",
            "location": {
                "institution": "Hochschule Luzern HSLU",
                "city": "Horw (LU)"
            },
            "domains": [
                "Sciences des données",
                "Ingéniérie informatique"
            ],
            "language": "allemand - anglais",
            "link": "orientation.ch/dyn/show/4009?lang=fr&idx=120&id=74396"
        },
        {
            "title": "Informatics",
            "degree": "Master",
            "type": "HEU",
            "location": {
                "institution": "Università della Svizzera italiana (USI)",
                "city": "Lugano (TI)"
            },
            "domains": [
                "Sciences informatiques"
            ],
            "language": "anglais",
            "link": "orientation.ch/dyn/show/4009?lang=fr&idx=120&id=33100"
        },
        {
            "title": "Informatics / Scienze informatiche",
            "degree": "Bachelor",
            "type": "HEU",
            "location": {
                "institution": "Università della Svizzera italiana (USI)",
                "city": "Lugano (TI)"
            },
            "domains": [
                "Sciences informatiques"
            ],
            "language": "anglais",
            "link": "orientation.ch/dyn/show/4009?lang=fr&idx=120&id=32259"
        },
        {
            "title": "Informatik",
            "degree": "Bachelor",
            "type": "HES",
            "location": {
                "institution": "Hochschule Luzern HSLU",
                "city": "Rotkreuz (ZG)"
            },
            "domains": [
                "Sciences informatiques"
            ],
            "language": "allemand",
            "link": "orientation.ch/dyn/show/4009?lang=fr&idx=120&id=4116"
        },
        {
            "title": "Informatik ",
            "degree": "Bachelor",
            "type": "HES",
            "location": {
                "institution": "Zürcher Hochschule für Angewandte Wissenschaften ZHAW",
                "city": "Zurich (ZH) - Winterthur (ZH)"
            },
            "domains": [
                "Sciences informatiques"
            ],
            "language": "allemand",
            "link": "orientation.ch/dyn/show/4009?lang=fr&idx=120&id=13592"
        },
        {
            "title": "Informatik",
            "degree": "Bachelor",
            "type": "HES",
            "location": {
                "institution": "Fachhochschule Nordwestschweiz FHNW",
                "city": "Windisch (AG)"
            },
            "domains": [
                "Sciences informatiques"
            ],
            "language": "allemand - anglais",
            "link": "orientation.ch/dyn/show/4009?lang=fr&idx=120&id=15851"
        },
        {
            "title": "Informatik ",
            "degree": "Bachelor",
            "type": "HES",
            "location": {
                "institution": "OST - Ostschweizer Fachhochschule",
                "city": "Rapperswil SG (SG) - St-Gall 1 (SG)"
            },
            "domains": [
                "Sciences informatiques"
            ],
            "language": "allemand",
            "link": "orientation.ch/dyn/show/4009?lang=fr&idx=120&id=23550"
        },
        {
            "title": "Informatik",
            "degree": "Bachelor",
            "type": "HEU",
            "location": {
                "institution": "Universität Zürich UZH",
                "city": "Zurich (ZH)"
            },
            "domains": [
                "Sciences informatiques"
            ],
            "language": "allemand",
            "link": "orientation.ch/dyn/show/4009?lang=fr&idx=120&id=32847"
        },
        {
            "title": "Informatik",
            "degree": "Master",
            "type": "HEU",
            "location": {
                "institution": "Universität Zürich UZH",
                "city": "Zurich (ZH)"
            },
            "domains": [
                "Sciences informatiques"
            ],
            "language": "anglais",
            "link": "orientation.ch/dyn/show/4009?lang=fr&idx=120&id=32848"
        },
        {
            "title": "Informatik",
            "degree": "Bachelor",
            "type": "HES",
            "location": {
                "institution": "Fernfachhochschule Schweiz FFHS",
                "city": "A distance"
            },
            "domains": [
                "Sciences informatiques"
            ],
            "language": "allemand",
            "link": "orientation.ch/dyn/show/4009?lang=fr&idx=120&id=44832"
        },
        {
            "title": "Information & Cyber Security",
            "degree": "Bachelor",
            "type": "HES",
            "location": {
                "institution": "Hochschule Luzern HSLU",
                "city": "Rotkreuz (ZG)"
            },
            "domains": [
                "Systèmes d'information",
                "Sécurité numérique"
            ],
            "language": "allemand",
            "link": "orientation.ch/dyn/show/4009?lang=fr&idx=120&id=59286"
        },
        {
            "title": "Information Systems and Digital Innovation / Systèmes d'information et innovation numérique",
            "degree": "Master",
            "type": "HEU",
            "location": {
                "institution": "Université de Lausanne (UNIL)",
                "city": "Lausanne (VD)"
            },
            "domains": [
                "Systèmes d'information"
            ],
            "language": "français - anglais",
            "link": "orientation.ch/dyn/show/4009?lang=fr&idx=120&id=32336"
        },
        {
            "title": "Informatique",
            "degree": "Bachelor",
            "type": "HEU",
            "location": {
                "institution": "Ecole polytechnique fédérale de Lausanne (EPFL)",
                "city": "Lausanne (VD)"
            },
            "domains": [
                "Ingéniérie informatique"
            ],
            "language": "français",
            "link": "orientation.ch/dyn/show/4009?lang=fr&idx=120&id=32124"
        },
        {
            "title": "Informatique",
            "degree": "Bachelor",
            "type": "HES",
            "location": {
                "institution": "Haute école spécialisée bernoise (HESB)",
                "city": "Bienne (BE) - Berne (BE)"
            },
            "domains": [
                "Ingéniérie informatique"
            ],
            "language": "français - allemand",
            "link": "orientation.ch/dyn/show/4009?lang=fr&idx=120&id=15527"
        },
        {
            "title": "Informatique",
            "degree": "Bachelor",
            "type": "HEU",
            "location": {
                "institution": "Université de Fribourg (UNIFR)",
                "city": "Fribourg (FR)"
            },
            "domains": [
                "Sciences informatiques"
            ],
            "language": "français - allemand",
            "link": "orientation.ch/dyn/show/4009?lang=fr&idx=120&id=32158"
        },
        {
            "title": "Informatique et systèmes de communication",
            "degree": "Bachelor",
            "type": "HES",
            "location": {
                "institution": "Haute école spécialisée de Suisse occidentale HES-SO",
                "city": "Genève (GE) - Yverdon-les-Bains (VD) - Fribourg (FR) - Sion (VS) - Neuchâtel (NE) - Delémont (JU)"
            },
            "domains": [
                "Systèmes d'information"
            ],
            "language": "français - allemand",
            "link": "orientation.ch/dyn/show/4009?lang=fr&idx=120&id=69148"
        },
        {
            "title": "Informatique pour les sciences humaines",
            "degree": "Bachelor",
            "type": "HEU",
            "location": {
                "institution": "Université de Genève (UNIGE)",
                "city": "Genève 4 (GE)"
            },
            "domains": [
                "Informatique pour les sciences humaines"
            ],
            "language": "français",
            "link": "orientation.ch/dyn/show/4009?lang=fr&idx=120&id=32606"
        },
        {
            "title": "Informatique pour les sciences humaines",
            "degree": "Master",
            "type": "HEU",
            "location": {
                "institution": "Université de Genève (UNIGE)",
                "city": "Genève 4 (GE)"
            },
            "domains": [
                "Informatique pour les sciences humaines"
            ],
            "language": "français",
            "link": "orientation.ch/dyn/show/4009?lang=fr&idx=120&id=32637"
        },
        {
            "title": "Informatique pour les sciences humaines (ISH)",
            "degree": "Master",
            "type": "HEU",
            "location": {
                "institution": "Université de Lausanne (UNIL)",
                "city": "Lausanne (VD)"
            },
            "domains": [
                "Informatique pour les sciences humaines"
            ],
            "language": "français",
            "link": "orientation.ch/dyn/show/4009?lang=fr&idx=120&id=32768"
        },
        {
            "title": "Informatique pour les sciences humaines (ISH)",
            "degree": "Bachelor",
            "type": "HEU",
            "location": {
                "institution": "Université de Lausanne (UNIL)",
                "city": "Lausanne (VD)"
            },
            "domains": [
                "Informatique pour les sciences humaines"
            ],
            "language": "français",
            "link": "orientation.ch/dyn/show/4009?lang=fr&idx=120&id=32112"
        },
        {
            "title": "Informatique, majeure en Cyber Security, Joint Master",
            "degree": "Master",
            "type": "HEU",
            "location": {
                "institution": "Ecole polytechnique fédérale de Lausanne (EPFL)",
                "city": "Lausanne (VD) - Zurich (ZH)"
            },
            "domains": [
                "Sécurité numérique"
            ],
            "language": "anglais",
            "link": "orientation.ch/dyn/show/4009?lang=fr&idx=120&id=63478"
        },
        {
            "title": "Ingegneria informatica",
            "degree": "Bachelor",
            "type": "HES",
            "location": {
                "institution": "Fachhochschule Südschweiz SUPSI",
                "city": "Viganello (TI)"
            },
            "domains": [
                "Ingéniérie informatique"
            ],
            "language": "italien",
            "link": "orientation.ch/dyn/show/4009?lang=fr&idx=120&id=31370"
        },
        {
            "title": "International IT Management",
            "degree": "Bachelor",
            "type": "HES",
            "location": {
                "institution": "Hochschule Luzern HSLU",
                "city": "Rotkreuz (ZG)"
            },
            "domains": [
                "Systèmes d'information"
            ],
            "language": "anglais",
            "link": "orientation.ch/dyn/show/4009?lang=fr&idx=120&id=58956"
        },
        {
            "title": "Law in Legal Issues, Crime and Security of Information Technologies / Droit, criminalité et sécurité des technologies de l'information",
            "degree": "Master",
            "type": "HEU",
            "location": {
                "institution": "Université de Lausanne (UNIL)",
                "city": "Lausanne (VD)"
            },
            "domains": [
                "Systèmes d'information",
                "Sécurité numérique"
            ],
            "language": "français",
            "link": "orientation.ch/dyn/show/4009?lang=fr&idx=120&id=32574"
        },
        {
            "title": "Life Sciences, Studienrichtung Medizininformatik",
            "degree": "Bachelor",
            "type": "HES",
            "location": {
                "institution": "Fachhochschule Nordwestschweiz FHNW",
                "city": "Muttenz (BL)"
            },
            "domains": [
                "Sciences informatiques",
                "Informatique pour la médecine"
            ],
            "language": "allemand",
            "link": "orientation.ch/dyn/show/4009?lang=fr&idx=120&id=74376"
        },
        {
            "title": "Mathématiques ou informatique, enseignement pour le degré secondaire II",
            "degree": "Master",
            "type": "HEU",
            "location": {
                "institution": "Ecole polytechnique fédérale de Lausanne (EPFL)",
                "city": "Lausanne (VD)"
            },
            "domains": [
                "Mathématiques",
                "Sciences informatiques"
            ],
            "language": "français - anglais",
            "link": "orientation.ch/dyn/show/4009?lang=fr&idx=120&id=75216"
        },
        {
            "title": "Mathématiques, informatique et sciences numériques",
            "degree": "Master",
            "type": "HEU",
            "location": {
                "institution": "Université de Genève (UNIGE)",
                "city": "Genève (GE) - Carouge GE (GE)"
            },
            "domains": [
                "Sciences informatiques",
                "Mathématiques"
            ],
            "language": "français - anglais",
            "link": "orientation.ch/dyn/show/4009?lang=fr&idx=120&id=32377"
        },
        {
            "title": "Mathématiques, informatique et sciences numériques",
            "degree": "Bachelor",
            "type": "HEU",
            "location": {
                "institution": "Université de Genève (UNIGE)",
                "city": "Genève (GE) - Carouge GE (GE)"
            },
            "domains": [
                "Sciences informatiques",
                "Mathématiques"
            ],
            "language": "français",
            "link": "orientation.ch/dyn/show/4009?lang=fr&idx=120&id=32309"
        },
        {
            "title": "Medical Informatics ",
            "degree": "Master",
            "type": "HES",
            "location": {
                "institution": "Fachhochschule Nordwestschweiz FHNW",
                "city": "Muttenz (BL)"
            },
            "domains": [
                "Informatique pour la médecine"
            ],
            "language": "anglais",
            "link": "orientation.ch/dyn/show/4009?lang=fr&idx=120&id=61849"
        },
        {
            "title": "Medizininformatik",
            "degree": "Bachelor",
            "type": "HES",
            "location": {
                "institution": "Haute école spécialisée bernoise (HESB)",
                "city": "Bienne 1 (BE)"
            },
            "domains": [
                "Informatique pour la médecine"
            ],
            "language": "allemand",
            "link": "orientation.ch/dyn/show/4009?lang=fr&idx=120&id=14290"
        },
        {
            "title": "Medizininformatik",
            "degree": "Bachelor",
            "type": "HES",
            "location": {
                "institution": "Zürcher Hochschule für Angewandte Wissenschaften ZHAW",
                "city": "Winterthur (ZH)"
            },
            "domains": [
                "Informatique pour la médecine"
            ],
            "language": "allemand",
            "link": "orientation.ch/dyn/show/4009?lang=fr&idx=120&id=77382"
        },
        {
            "title": "Neural Systems and Computation, Joint Master, Spezialisierter Master",
            "degree": "Master",
            "type": "HEU",
            "location": {
                "institution": "Eidgenössische Technische Hochschule Zürich ETHZ",
                "city": "Zurich 57 (ZH) - Zurich (ZH)"
            },
            "domains": [
                "Informatique pour la médecine"
            ],
            "language": "anglais",
            "link": "orientation.ch/dyn/show/4009?lang=fr&idx=120&id=32862"
        },
        {
            "title": "Neuroinformatik, Nur-Nebenfach",
            "degree": "Bachelor",
            "type": "HEU",
            "location": {
                "institution": "Universität Zürich UZH",
                "city": "Zurich 57 (ZH)"
            },
            "domains": [
                "Informatique pour la médecine"
            ],
            "language": "allemand - anglais",
            "link": "orientation.ch/dyn/show/4009?lang=fr&idx=120&id=32446"
        },
        {
            "title": "Robotics / Robotique",
            "degree": "Master",
            "type": "HEU",
            "location": {
                "institution": "Ecole polytechnique fédérale de Lausanne (EPFL)",
                "city": "Lausanne (VD)"
            },
            "domains": [
                "Robotique"
            ],
            "language": "anglais",
            "link": "orientation.ch/dyn/show/4009?lang=fr&idx=120&id=50663"
        },
        {
            "title": "Robotics, Systems and Control (Robotik), spezialisierter Master",
            "degree": "Master",
            "type": "HEU",
            "location": {
                "institution": "Eidgenössische Technische Hochschule Zürich ETHZ",
                "city": "Zurich (ZH)"
            },
            "domains": [
                "Robotique",
                "Systèmes d'information"
            ],
            "language": "anglais",
            "link": "orientation.ch/dyn/show/4009?lang=fr&idx=120&id=32939"
        },
        {
            "title": "Sciences informatiques",
            "degree": "Master",
            "type": "HEU",
            "location": {
                "institution": "Université de Genève (UNIGE)",
                "city": "Carouge GE (GE)"
            },
            "domains": [
                "Sciences informatiques"
            ],
            "language": "français - anglais",
            "link": "orientation.ch/dyn/show/4009?lang=fr&idx=120&id=32358"
        },
        {
            "title": "Sciences informatiques",
            "degree": "Bachelor",
            "type": "HEU",
            "location": {
                "institution": "Université de Genève (UNIGE)",
                "city": "Carouge GE (GE)"
            },
            "domains": [
                "Sciences informatiques"
            ],
            "language": "français",
            "link": "orientation.ch/dyn/show/4009?lang=fr&idx=120&id=32326"
        },
        {
            "title": "Software and Data Engineering",
            "degree": "Master",
            "type": "HEU",
            "location": {
                "institution": "Università della Svizzera italiana (USI)",
                "city": "Lugano (TI)"
            },
            "domains": [
                "Ingéniérie informatique"
            ],
            "language": "anglais",
            "link": "orientation.ch/dyn/show/4009?lang=fr&idx=120&id=48352"
        },
        {
            "title": "Statistics and Data Science / Statistik und Data Science",
            "degree": "Master",
            "type": "HEU",
            "location": {
                "institution": "Universität Bern UNIBE",
                "city": "Berne (BE)"
            },
            "domains": [
                "Sciences des données"
            ],
            "language": "anglais",
            "link": "orientation.ch/dyn/show/4009?lang=fr&idx=120&id=32450"
        },
        {
            "title": "Systèmes de communication",
            "degree": "Bachelor",
            "type": "HEU",
            "location": {
                "institution": "Ecole polytechnique fédérale de Lausanne (EPFL)",
                "city": "Lausanne (VD)"
            },
            "domains": [
                "Systèmes d'information"
            ],
            "language": "français",
            "link": "orientation.ch/dyn/show/4009?lang=fr&idx=120&id=32131"
        },
        {
            "title": "Systèmes d'information et science des services",
            "degree": "Bachelor",
            "type": "HEU",
            "location": {
                "institution": "Centre Universitaire d'informatique (CUI)",
                "city": "Carouge GE (GE)"
            },
            "domains": [
                "Systèmes d'information"
            ],
            "language": "français",
            "link": "orientation.ch/dyn/show/4009?lang=fr&idx=120&id=32475"
        },
        {
            "title": "Systèmes et services numériques",
            "degree": "Master",
            "type": "HEU",
            "location": {
                "institution": "Centre Universitaire d'informatique (CUI)",
                "city": "Carouge GE (GE)"
            },
            "domains": [
                "Systèmes d'information",
                "Ingéniérie informatique"
            ],
            "language": "français - anglais",
            "link": "orientation.ch/dyn/show/4009?lang=fr&idx=120&id=75055"
        },
        {
            "title": "Traitement informatique multilingue",
            "degree": "Master",
            "type": "HEU",
            "location": {
                "institution": "Université de Genève (UNIGE)",
                "city": "Genève (GE)"
            },
            "domains": [
                "Informatique pour la médecine"
            ],
            "language": "français - anglais",
            "link": "orientation.ch/dyn/show/4009?lang=fr&idx=120&id=43845"
        },
        {
            "title": "User Experience Design & Data Visualization",
            "degree": "Master",
            "type": "HES",
            "location": {
                "institution": "Fachhochschule Graubünden FHGR",
                "city": "Coire (GR)"
            },
            "domains": [
                "Sciences des données"
            ],
            "language": "allemand - anglais",
            "link": "orientation.ch/dyn/show/4009?lang=fr&idx=120&id=74269"
        }
    ]
}