[
  {
    "title": "Applied Information and Data Science",
    "domains": [
      "Sciences informatiques",
      "Sciences des données"
    ]
  },
  {
    "title": "Artificial Intelligence",
    "domains": [
      "Intelligence artificielle"
    ]
  },
  {
    "title": "Artificial Intelligence & Machine Learning",
    "domains": [
      "Intelligence artificielle",
      "Sciences des données"
    ]
  },
  {
    "title": "Artificial Intelligence / Intelligence artificielle",
    "domains": [
      "Intelligence artificielle"
    ]
  },
  {
    "title": "Artificial Intelligence in Medicine / Künstliche Intelligenz in der Medizin, Spezialisierter Master",
    "domains": [
      "Intelligence artificielle",
      "Informatique pour la médecine"
    ]
  },
  {
    "title": "Bi-disciplinaire en sciences",
    "domains": [
      "Sciences informatiques"
    ]
  },
  {
    "title": "Bioinformatics / Bioinformatik, Nur-Nebenfach",
    "domains": [
      "Bioinformatique"
    ]
  },
  {
    "title": "Bioinformatics and computational biology / bioinformatique et biologie computationnelle, Joint Master ",
    "domains": [
      "Bioinformatique",
      "Sciences informatiques"
    ]
  },
  {
    "title": "Bioinformatik, Nur-Nebenfach",
    "domains": [
      "Bioinformatique"
    ]
  },
  {
    "title": "Communication Systems / Systèmes de communication",
    "domains": [
      "Systèmes d'information"
    ]
  },
  {
    "title": "Computational and Data Science",
    "domains": [
      "Sciences informatiques",
      "Sciences des données"
    ]
  },
  {
    "title": "Computational Biology and Bioinformatics, Spezialisierter Joint Master",
    "domains": [
      "Bioinformatique",
      "Sciences informatiques"
    ]
  },
  {
    "title": "Computational Linguistics and Language Technology",
    "domains": [
      "Informatique pour la linguistique"
    ]
  },
  {
    "title": "Computational Social Sciences",
    "domains": [
      "Systèmes d'information"
    ]
  },
  {
    "title": "Computer Science",
    "domains": [
      "Sciences informatiques"
    ]
  },
  {
    "title": "Computer Science",
    "domains": [
      "Sciences informatiques"
    ]
  },
  {
    "title": "Computer Science",
    "domains": [
      "Sciences informatiques"
    ]
  },
  {
    "title": "Computer Science / Informatik",
    "domains": [
      "Sciences informatiques"
    ]
  },
  {
    "title": "Computer Science / Informatik",
    "domains": [
      "Sciences informatiques"
    ]
  },
  {
    "title": "Computer Science / Informatik",
    "domains": [
      "Sciences informatiques"
    ]
  },
  {
    "title": "Computer Science / Informatik",
    "domains": [
      "Sciences informatiques"
    ]
  },
  {
    "title": "Computer Science / Informatique",
    "domains": [
      "Sciences informatiques"
    ]
  },
  {
    "title": "Computer Science / Informatique, Joint Master",
    "domains": [
      "Sciences informatiques"
    ]
  },
  {
    "title": "Computerlinguistik und Sprachtechnologie",
    "domains": [
      "Informatique pour la linguistique"
    ]
  },
  {
    "title": "Data Science",
    "domains": [
      "Sciences des données"
    ]
  },
  {
    "title": "Data Science",
    "domains": [
      "Sciences des données"
    ]
  },
  {
    "title": "Data Science",
    "domains": [
      "Sciences des données"
    ]
  },
  {
    "title": "Data Science / Science des données",
    "domains": [
      "Sciences des données"
    ]
  },
  {
    "title": "Data Science and Artificial Intelligence",
    "domains": [
      "Intelligence artificielle",
      "Sciences des données"
    ]
  },
  {
    "title": "Data Science, Spezialisierter Master",
    "domains": [
      "Sciences des données"
    ]
  },
  {
    "title": "Data Science, Spezialisierter Master",
    "domains": [
      "Sciences des données"
    ]
  },
  {
    "title": "Digital Engineering",
    "domains": [
      "Ingéniérie informatique"
    ]
  },
  {
    "title": "Digital Humanities",
    "domains": [
      "Informatique pour les sciences humaines"
    ]
  },
  {
    "title": "Digital Humanities / Humanités digitales, Master spécialisé",
    "domains": [
      "Informatique pour les sciences humaines"
    ]
  },
  {
    "title": "Digital Humanities / Humanités numériques",
    "domains": [
      "Informatique pour les sciences humaines"
    ]
  },
  {
    "title": "Digital Humanities, Nur-Nebenfach",
    "domains": [
      "Informatique pour les sciences humaines"
    ]
  },
  {
    "title": "Digital Linguistics / Digitale Linguistik, Nur-Nebenfach",
    "domains": [
      "Informatique pour la linguistique"
    ]
  },
  {
    "title": "Digital Neuroscience / Neurosciences digitales, Master spécialisé",
    "domains": [
      "Informatique pour la médecine"
    ]
  },
  {
    "title": "Engineering, Profil Computer Science",
    "domains": [
      "Ingéniérie informatique"
    ]
  },
  {
    "title": "Engineering, Profil Computer Science",
    "domains": [
      "Ingéniérie informatique"
    ]
  },
  {
    "title": "Engineering, Profil Computer Science",
    "domains": [
      "Ingéniérie informatique"
    ]
  },
  {
    "title": "Engineering, Profil Computer Science",
    "domains": [
      "Sciences informatiques",
      "Ingéniérie informatique"
    ]
  },
  {
    "title": "Engineering, Profil Computer Science",
    "domains": [
      "Sciences informatiques",
      "Ingéniérie informatique"
    ]
  },
  {
    "title": "Engineering, Profil Computer Science",
    "domains": [
      "Sciences informatiques",
      "Ingéniérie informatique"
    ]
  },
  {
    "title": "Engineering, Profil Computer Science",
    "domains": [
      "Sciences informatiques",
      "Ingéniérie informatique"
    ]
  },
  {
    "title": "Engineering, Profil Data Science",
    "domains": [
      "Sciences des données",
      "Ingéniérie informatique"
    ]
  },
  {
    "title": "Engineering, Profil Data Science",
    "domains": [
      "Sciences des données",
      "Ingéniérie informatique"
    ]
  },
  {
    "title": "Engineering, Profil Data Science",
    "domains": [
      "Sciences des données",
      "Ingéniérie informatique"
    ]
  },
  {
    "title": "Engineering, Profil Data Science",
    "domains": [
      "Sciences des données",
      "Ingéniérie informatique"
    ]
  },
  {
    "title": "Engineering, Profil Data Science",
    "domains": [
      "Sciences des données",
      "Ingéniérie informatique"
    ]
  },
  {
    "title": "Engineering, Profil Data Science",
    "domains": [
      "Sciences des données",
      "Ingéniérie informatique"
    ]
  },
  {
    "title": "Engineering, Profil Data Science",
    "domains": [
      "Sciences des données",
      "Ingéniérie informatique"
    ]
  },
  {
    "title": "Informatics",
    "domains": [
      "Sciences informatiques"
    ]
  },
  {
    "title": "Informatics / Scienze informatiche",
    "domains": [
      "Sciences informatiques"
    ]
  },
  {
    "title": "Informatik",
    "domains": [
      "Sciences informatiques"
    ]
  },
  {
    "title": "Informatik ",
    "domains": [
      "Sciences informatiques"
    ]
  },
  {
    "title": "Informatik",
    "domains": [
      "Sciences informatiques"
    ]
  },
  {
    "title": "Informatik ",
    "domains": [
      "Sciences informatiques"
    ]
  },
  {
    "title": "Informatik",
    "domains": [
      "Sciences informatiques"
    ]
  },
  {
    "title": "Informatik",
    "domains": [
      "Sciences informatiques"
    ]
  },
  {
    "title": "Informatik",
    "domains": [
      "Sciences informatiques"
    ]
  },
  {
    "title": "Information & Cyber Security",
    "domains": [
      "Systèmes d'information",
      "Sécurité numérique"
    ]
  },
  {
    "title": "Information Systems and Digital Innovation / Systèmes d'information et innovation numérique",
    "domains": [
      "Systèmes d'information"
    ]
  },
  {
    "title": "Informatique",
    "domains": [
      "Ingéniérie informatique"
    ]
  },
  {
    "title": "Informatique",
    "domains": [
      "Ingéniérie informatique"
    ]
  },
  {
    "title": "Informatique",
    "domains": [
      "Sciences informatiques"
    ]
  },
  {
    "title": "Informatique et systèmes de communication",
    "domains": [
      "Systèmes d'information"
    ]
  },
  {
    "title": "Informatique pour les sciences humaines",
    "domains": [
      "Informatique pour les sciences humaines"
    ]
  },
  {
    "title": "Informatique pour les sciences humaines",
    "domains": [
      "Informatique pour les sciences humaines"
    ]
  },
  {
    "title": "Informatique pour les sciences humaines (ISH)",
    "domains": [
      "Informatique pour les sciences humaines"
    ]
  },
  {
    "title": "Informatique pour les sciences humaines (ISH)",
    "domains": [
      "Informatique pour les sciences humaines"
    ]
  },
  {
    "title": "Informatique, majeure en Cyber Security, Joint Master",
    "domains": [
      "Sécurité numérique"
    ]
  },
  {
    "title": "Ingegneria informatica",
    "domains": [
      "Ingéniérie informatique"
    ]
  },
  {
    "title": "International IT Management",
    "domains": [
      "Systèmes d'information"
    ]
  },
  {
    "title": "Law in Legal Issues, Crime and Security of Information Technologies / Droit, criminalité et sécurité des technologies de l'information",
    "domains": [
      "Systèmes d'information",
      "Sécurité numérique"
    ]
  },
  {
    "title": "Life Sciences, Studienrichtung Medizininformatik",
    "domains": [
      "Sciences informatiques",
      "Informatique pour la médecine"
    ]
  },
  {
    "title": "Mathématiques ou informatique, enseignement pour le degré secondaire II",
    "domains": [
      "Mathématiques",
      "Sciences informatiques"
    ]
  },
  {
    "title": "Mathématiques, informatique et sciences numériques",
    "domains": [
      "Sciences informatiques",
      "Mathématiques"
    ]
  },
  {
    "title": "Mathématiques, informatique et sciences numériques",
    "domains": [
      "Sciences informatiques",
      "Mathématiques"
    ]
  },
  {
    "title": "Medical Informatics ",
    "domains": [
      "Informatique pour la médecine"
    ]
  },
  {
    "title": "Medizininformatik",
    "domains": [
      "Informatique pour la médecine"
    ]
  },
  {
    "title": "Medizininformatik",
    "domains": [
      "Informatique pour la médecine"
    ]
  },
  {
    "title": "Neural Systems and Computation, Joint Master, Spezialisierter Master",
    "domains": [
      "Informatique pour la médecine"
    ]
  },
  {
    "title": "Neuroinformatik, Nur-Nebenfach",
    "domains": [
      "Informatique pour la médecine"
    ]
  },
  {
    "title": "Robotics / Robotique",
    "domains": [
      "Robotique"
    ]
  },
  {
    "title": "Robotics, Systems and Control (Robotik), spezialisierter Master",
    "domains": [
      "Robotique",
      "Systèmes d'information"
    ]
  },
  {
    "title": "Sciences informatiques",
    "domains": [
      "Sciences informatiques"
    ]
  },
  {
    "title": "Sciences informatiques",
    "domains": [
      "Sciences informatiques"
    ]
  },
  {
    "title": "Software and Data Engineering",
    "domains": [
      "Ingéniérie informatique"
    ]
  },
  {
    "title": "Statistics and Data Science / Statistik und Data Science",
    "domains": [
      "Sciences des données"
    ]
  },
  {
    "title": "Systèmes de communication",
    "domains": [
      "Systèmes d'information"
    ]
  },
  {
    "title": "Systèmes d'information et science des services",
    "domains": [
      "Systèmes d'information"
    ]
  },
  {
    "title": "Systèmes et services numériques",
    "domains": [
      "Systèmes d'information",
      "Ingéniérie informatique"
    ]
  },
  {
    "title": "Traitement informatique multilingue",
    "domains": [
      "Informatique pour la médecine"
    ]
  },
  {
    "title": "User Experience Design & Data Visualization",
    "domains": [
      "Sciences des données"
    ]
  }
]