epoch,R2_BL,loss,lr,val_R2_BL,val_loss
0,0.8091129,2.922725597906692e-05,0.001,0.9358027577400208,5.944003896729555e-06
1,0.94698185,5.122733511708441e-06,0.001,0.9496639966964722,5.785851135442499e-06
2,0.95674,4.167040559639076e-06,0.001,0.9558019638061523,4.136595498493989e-06
3,0.9608675,3.7609470042537055e-06,0.001,0.9591010808944702,3.703297011270479e-06
4,0.9632879,3.477517626755927e-06,0.001,0.962138295173645,3.243302171540563e-06
5,0.9649899,3.294691468266073e-06,0.001,0.9622734785079956,3.516269362080493e-06
6,0.96627915,3.1507461625726063e-06,0.001,0.9653393626213074,2.9711923389186267e-06
7,0.96725774,3.03150511764684e-06,0.001,0.9676480293273926,2.9721560849793603e-06
8,0.968138,2.9496187552826033e-06,0.001,0.9676289558410645,2.7888786917174e-06
9,0.96885794,2.853197309313412e-06,0.001,0.9687115550041199,2.9801571599819e-06
10,0.9694127,2.7836471463620046e-06,0.001,0.968846321105957,2.926017123172642e-06
11,0.9699377,2.7282259096487775e-06,0.001,0.9694904088973999,2.656891024344077e-06
12,0.97035426,2.682577968873301e-06,0.001,0.9702503085136414,2.6935907726510777e-06
13,0.97073025,2.634492102745321e-06,0.001,0.9701979756355286,2.5920779307853083e-06
14,0.9710454,2.6000153726235653e-06,0.001,0.9691287875175476,2.5455781042182935e-06
15,0.9713872,2.5549785270799695e-06,0.001,0.9712861180305481,2.5055309151866823e-06
16,0.971664,2.526460651676065e-06,0.001,0.9709882736206055,2.4487244218107663e-06
17,0.97188413,2.4999213776321296e-06,0.001,0.9700018167495728,2.5533025336699213e-06
18,0.9721144,2.474342626454826e-06,0.001,0.9701487421989441,2.4460469148834817e-06
19,0.9723321,2.4524712127017803e-06,0.001,0.971462070941925,2.4459751784888794e-06
20,0.9725431,2.4258902557807177e-06,0.001,0.9715597033500671,2.3730131488264304e-06
21,0.9726829,2.409439184013922e-06,0.001,0.9725408554077148,2.4124153242155446e-06
22,0.97285324,2.392269061487002e-06,0.001,0.9718950390815735,2.3763298258927533e-06
23,0.97303164,2.3589920764873504e-06,0.001,0.9730234146118164,2.318744441254239e-06
24,0.9731445,2.3599421723187645e-06,0.001,0.9732362627983093,2.295125432283385e-06
25,0.9732844,2.3353682853198597e-06,0.001,0.973418116569519,2.395090018580959e-06
26,0.97341305,2.3232546015946114e-06,0.001,0.9735811352729797,2.2920732135389698e-06
27,0.9735335,2.3099172019349433e-06,0.001,0.972870945930481,2.2999112616162163e-06
28,0.9736529,2.2932357335711724e-06,0.001,0.973002552986145,2.2491341042041314e-06
29,0.97374994,2.2864162171269225e-06,0.001,0.9727171063423157,2.2613386590819572e-06
