{"docno": "en.noclean.c4-train.07100-of-07168.25164", "label_index": [2, 1, 1, 1], "label_confidence": [0.886, 0.9976, 0.5606, 0.991], "label_score": [[0.003, 0.111, 0.886], [0.0013, 0.9976, 0.001], [0.0032, 0.5606, 0.4362], [0.0051, 0.991, 0.0038]]}
{"docno": "en.noclean.c4-train.06642-of-07168.56423", "label_index": [1, 1], "label_confidence": [0.9978, 0.9912], "label_score": [[0.0011, 0.9978, 0.0011], [0.0057, 0.9912, 0.0031]]}
{"docno": "en.noclean.c4-train.03987-of-07168.49413", "label_index": [1, 1], "label_confidence": [0.9952, 0.9926], "label_score": [[0.0015, 0.9952, 0.0033], [0.0019, 0.9926, 0.0054]]}
{"docno": "en.noclean.c4-train.05076-of-07168.112759", "label_index": [1, 1, 1, 1, 1, 1], "label_confidence": [0.9881, 0.9744, 0.9831, 0.9499, 0.9838, 0.9713], "label_score": [[0.0011, 0.9881, 0.0108], [0.0013, 0.9744, 0.0243], [0.0066, 0.9831, 0.0103], [0.0012, 0.9499, 0.0489], [0.0065, 0.9838, 0.0097], [0.0101, 0.9713, 0.0186]]}
{"docno": "en.noclean.c4-train.00275-of-07168.92757", "label_index": [1, 1, 1, 1, 1, 1, 1, 1, 1, 1, 1, 1, 1], "label_confidence": [0.9362, 0.9683, 0.9563, 0.8375, 0.9894, 0.7998, 0.965, 0.9705, 0.9713, 0.9786, 0.9909, 0.9803, 0.9571], "label_score": [[0.004, 0.9362, 0.0597], [0.0198, 0.9683, 0.012], [0.0059, 0.9563, 0.0378], [0.001, 0.8375, 0.1615], [0.0056, 0.9894, 0.005], [0.0015, 0.7998, 0.1987], [0.0102, 0.965, 0.0248], [0.0174, 0.9705, 0.0121], [0.0026, 0.9713, 0.0262], [0.0132, 0.9786, 0.0082], [0.004, 0.9909, 0.0051], [0.0059, 0.9803, 0.0138], [0.0042, 0.9571, 0.0387]]}
{"docno": "en.noclean.c4-train.02948-of-07168.49496", "label_index": [2, 1, 1, 1, 1, 1, 1, 1], "label_confidence": [0.7575, 0.9883, 0.9892, 0.976, 0.9893, 0.7761, 0.9979, 0.9734], "label_score": [[0.003, 0.2394, 0.7575], [0.0087, 0.9883, 0.0031], [0.0079, 0.9892, 0.0028], [0.022, 0.976, 0.0019], [0.009, 0.9893, 0.0016], [0.0046, 0.7761, 0.2193], [0.001, 0.9979, 0.001], [0.0139, 0.9734, 0.0127]]}
{"docno": "en.noclean.c4-train.01129-of-07168.18427", "label_index": [1, 1, 1], "label_confidence": [0.9901, 0.9796, 0.8577], "label_score": [[0.0023, 0.9901, 0.0076], [0.0122, 0.9796, 0.0082], [0.0253, 0.8577, 0.117]]}
{"docno": "en.noclean.c4-train.04685-of-07168.98078", "label_index": [1, 1, 1], "label_confidence": [0.9917, 0.9645, 0.967], "label_score": [[0.0044, 0.9917, 0.004], [0.0023, 0.9645, 0.0333], [0.005, 0.967, 0.0279]]}
{"docno": "en.noclean.c4-train.02916-of-07168.39636", "label_index": [1, 1, 2, 1, 1], "label_confidence": [0.952, 0.8961, 0.5727, 0.9897, 0.9946], "label_score": [[0.0005, 0.952, 0.0475], [0.004, 0.8961, 0.0998], [0.0088, 0.4185, 0.5727], [0.0011, 0.9897, 0.0093], [0.0007, 0.9946, 0.0047]]}
{"docno": "en.noclean.c4-train.01460-of-07168.4237", "label_index": [1, 1, 1, 2, 1], "label_confidence": [0.9366, 0.994, 0.9845, 0.6546, 0.9162], "label_score": [[0.0035, 0.9366, 0.0599], [0.0012, 0.994, 0.0048], [0.004, 0.9845, 0.0116], [0.0009, 0.3445, 0.6546], [0.0026, 0.9162, 0.0812]]}
{"docno": "en.noclean.c4-train.02089-of-07168.122043", "label_index": [1, 1, 1, 1, 1, 1, 1], "label_confidence": [0.9917, 0.9792, 0.9644, 0.9753, 0.9501, 0.9735, 0.9715], "label_score": [[0.0027, 0.9917, 0.0056], [0.0166, 0.9792, 0.0042], [0.0014, 0.9644, 0.0342], [0.0034, 0.9753, 0.0213], [0.0186, 0.9501, 0.0312], [0.0015, 0.9735, 0.0251], [0.0047, 0.9715, 0.0238]]}
{"docno": "en.noclean.c4-train.02797-of-07168.67183", "label_index": [1, 1, 1, 1], "label_confidence": [0.9395, 0.9807, 0.9888, 0.9636], "label_score": [[0.0003, 0.9395, 0.0602], [0.0056, 0.9807, 0.0137], [0.0038, 0.9888, 0.0074], [0.0041, 0.9636, 0.0322]]}
{"docno": "en.noclean.c4-train.04951-of-07168.146335", "label_index": [1, 1, 1, 1], "label_confidence": [0.9887, 0.9289, 0.9829, 0.996], "label_score": [[0.0009, 0.9887, 0.0104], [0.0023, 0.9289, 0.0689], [0.0009, 0.9829, 0.0162], [0.0017, 0.996, 0.0023]]}
{"docno": "en.noclean.c4-train.00409-of-07168.49828", "label_index": [1, 1, 1, 1, 1, 1, 1, 1, 1], "label_confidence": [0.9646, 0.9738, 0.9876, 0.9878, 0.9911, 0.9466, 0.9816, 0.9858, 0.9442], "label_score": [[0.0261, 0.9646, 0.0094], [0.0014, 0.9738, 0.0248], [0.008, 0.9876, 0.0044], [0.0012, 0.9878, 0.011], [0.008, 0.9911, 0.0009], [0.0416, 0.9466, 0.0118], [0.0136, 0.9816, 0.0048], [0.0041, 0.9858, 0.01], [0.0012, 0.9442, 0.0546]]}
{"docno": "en.noclean.c4-train.01080-of-07168.8311", "label_index": [1, 1, 1, 1, 1, 1, 1, 1, 1], "label_confidence": [0.8877, 0.9137, 0.9587, 0.9933, 0.9836, 0.9944, 0.9924, 0.9779, 0.961], "label_score": [[0.0073, 0.8877, 0.105], [0.023, 0.9137, 0.0633], [0.0012, 0.9587, 0.0401], [0.0041, 0.9933, 0.0026], [0.0025, 0.9836, 0.014], [0.0015, 0.9944, 0.0042], [0.0018, 0.9924, 0.0059], [0.0048, 0.9779, 0.0173], [0.001, 0.961, 0.038]]}
{"docno": "en.noclean.c4-train.03199-of-07168.15651", "label_index": [1, 1, 1, 1, 1, 1, 1, 1, 1, 1, 1, 1, 1, 1], "label_confidence": [0.9859, 0.9927, 0.9814, 0.9802, 0.9846, 0.9736, 0.9845, 0.9864, 0.9683, 0.9599, 0.9629, 0.9779, 0.9796, 0.9754], "label_score": [[0.0091, 0.9859, 0.005], [0.0022, 0.9927, 0.0051], [0.0059, 0.9814, 0.0128], [0.0169, 0.9802, 0.0028], [0.0119, 0.9846, 0.0036], [0.0237, 0.9736, 0.0026], [0.0093, 0.9845, 0.0062], [0.0067, 0.9864, 0.0069], [0.0162, 0.9683, 0.0155], [0.0098, 0.9599, 0.0303], [0.0109, 0.9629, 0.0262], [0.0117, 0.9779, 0.0104], [0.0098, 0.9796, 0.0105], [0.0183, 0.9754, 0.0063]]}
{"docno": "en.noclean.c4-train.06597-of-07168.521", "label_index": [1, 1, 1, 1, 1, 1, 1], "label_confidence": [0.5631, 0.996, 0.6717, 0.9614, 0.986, 0.9154, 0.9663], "label_score": [[0.0127, 0.5631, 0.4243], [0.0015, 0.996, 0.0026], [0.0028, 0.6717, 0.3255], [0.0018, 0.9614, 0.0368], [0.0021, 0.986, 0.0119], [0.0004, 0.9154, 0.0841], [0.0037, 0.9663, 0.03]]}
{"docno": "en.noclean.c4-train.01540-of-07168.63342", "label_index": [1, 1, 1, 1, 1], "label_confidence": [0.9876, 0.9333, 0.9866, 0.9838, 0.9713], "label_score": [[0.0072, 0.9876, 0.0052], [0.065, 0.9333, 0.0017], [0.001, 0.9866, 0.0124], [0.0065, 0.9838, 0.0097], [0.0101, 0.9713, 0.0186]]}
{"docno": "en.noclean.c4-train.03748-of-07168.42700", "label_index": [1, 1, 1, 1, 1, 1, 1, 1, 1, 1, 1, 1, 1, 1, 1, 1], "label_confidence": [0.8483, 0.9773, 0.9485, 0.951, 0.9917, 0.9922, 0.973, 0.9958, 0.9921, 0.9944, 0.9887, 0.5147, 0.9252, 0.7762, 0.9085, 0.9661], "label_score": [[0.0383, 0.8483, 0.1134], [0.0082, 0.9773, 0.0145], [0.0259, 0.9485, 0.0256], [0.004, 0.951, 0.0451], [0.0053, 0.9917, 0.003], [0.0047, 0.9922, 0.0031], [0.0035, 0.973, 0.0235], [0.0018, 0.9958, 0.0025], [0.0062, 0.9921, 0.0018], [0.0038, 0.9944, 0.0018], [0.0037, 0.9887, 0.0076], [0.0051, 0.5147, 0.4802], [0.0201, 0.9252, 0.0547], [0.1998, 0.7762, 0.024], [0.0333, 0.9085, 0.0582], [0.0281, 0.9661, 0.0058]]}
{"docno": "en.noclean.c4-train.00954-of-07168.92455", "label_index": [1, 1, 1, 1, 1, 1, 1, 1, 1, 1, 1, 1], "label_confidence": [0.9127, 0.9636, 0.9908, 0.947, 0.9714, 0.9772, 0.9796, 0.9773, 0.9786, 0.9814, 0.947, 0.982], "label_score": [[0.0051, 0.9127, 0.0822], [0.0327, 0.9636, 0.0037], [0.0087, 0.9908, 0.0005], [0.0503, 0.947, 0.0026], [0.0242, 0.9714, 0.0044], [0.0194, 0.9772, 0.0034], [0.0025, 0.9796, 0.0179], [0.0063, 0.9773, 0.0164], [0.0063, 0.9786, 0.0151], [0.0064, 0.9814, 0.0121], [0.0062, 0.947, 0.0468], [0.0078, 0.982, 0.0102]]}
{"docno": "en.noclean.c4-train.04439-of-07168.50731", "label_index": [1, 1, 1, 1], "label_confidence": [0.9883, 0.9862, 0.9757, 0.9882], "label_score": [[0.0048, 0.9883, 0.0069], [0.0117, 0.9862, 0.002], [0.0032, 0.9757, 0.0211], [0.0022, 0.9882, 0.0096]]}
{"docno": "en.noclean.c4-train.04028-of-07168.42270", "label_index": [1, 1, 1, 1, 1, 1, 1, 1, 1, 1, 1], "label_confidence": [0.9852, 0.9669, 0.9184, 0.9851, 0.9847, 0.9864, 0.8941, 0.965, 0.9765, 0.8404, 0.9932], "label_score": [[0.0077, 0.9852, 0.0071], [0.0027, 0.9669, 0.0304], [0.0065, 0.9184, 0.075], [0.0021, 0.9851, 0.0128], [0.0132, 0.9847, 0.0021], [0.0012, 0.9864, 0.0124], [0.0003, 0.8941, 0.1056], [0.0257, 0.965, 0.0093], [0.0013, 0.9765, 0.0222], [0.0495, 0.8404, 0.1102], [0.0022, 0.9932, 0.0046]]}
{"docno": "en.noclean.c4-train.02665-of-07168.4087", "label_index": [1, 1, 1, 1, 1, 1, 1, 1, 1, 1, 1, 1, 1, 1, 1, 1, 1, 1, 1, 1, 1, 1, 1, 1], "label_confidence": [0.9968, 0.9929, 0.9907, 0.9755, 0.951, 0.9664, 0.7717, 0.7469, 0.9648, 0.8889, 0.8655, 0.9668, 0.9554, 0.9293, 0.9382, 0.9766, 0.9787, 0.9793, 0.9623, 0.9646, 0.9657, 0.987, 0.9898, 0.863], "label_score": [[0.0017, 0.9968, 0.0015], [0.0036, 0.9929, 0.0035], [0.006, 0.9907, 0.0033], [0.0052, 0.9755, 0.0193], [0.0386, 0.951, 0.0104], [0.0195, 0.9664, 0.0141], [0.0031, 0.7717, 0.2253], [0.004, 0.7469, 0.2491], [0.0132, 0.9648, 0.0221], [0.0558, 0.8889, 0.0553], [0.0066, 0.8655, 0.1279], [0.0075, 0.9668, 0.0257], [0.0087, 0.9554, 0.0359], [0.0201, 0.9293, 0.0506], [0.0043, 0.9382, 0.0575], [0.0154, 0.9766, 0.008], [0.0107, 0.9787, 0.0106], [0.0169, 0.9793, 0.0038], [0.0228, 0.9623, 0.0149], [0.0097, 0.9646, 0.0257], [0.0028, 0.9657, 0.0314], [0.0013, 0.987, 0.0116], [0.0045, 0.9898, 0.0056], [0.0042, 0.863, 0.1328]]}
{"docno": "en.noclean.c4-train.02282-of-07168.27796", "label_index": [1, 1, 1, 1, 1, 1, 1], "label_confidence": [0.9608, 0.9424, 0.96, 0.9836, 0.9815, 0.9935, 0.9599], "label_score": [[0.0251, 0.9608, 0.0141], [0.0504, 0.9424, 0.0072], [0.0012, 0.96, 0.0388], [0.0013, 0.9836, 0.0151], [0.0029, 0.9815, 0.0156], [0.0021, 0.9935, 0.0045], [0.0029, 0.9599, 0.0372]]}
{"docno": "en.noclean.c4-train.00674-of-07168.103539", "label_index": [1], "label_confidence": [0.9573], "label_score": [[0.0109, 0.9573, 0.0317]]}
{"docno": "en.noclean.c4-train.06040-of-07168.30427", "label_index": [2, 1, 1, 1, 1, 1, 1, 1, 1, 1, 1, 1, 1, 1, 1, 1, 1], "label_confidence": [0.5247, 0.9659, 0.9533, 0.9948, 0.9808, 0.9924, 0.9933, 0.9956, 0.9937, 0.968, 0.9502, 0.9086, 0.989, 0.9691, 0.9531, 0.8958, 0.9857], "label_score": [[0.0061, 0.4691, 0.5247], [0.0283, 0.9659, 0.0058], [0.0087, 0.9533, 0.038], [0.0017, 0.9948, 0.0035], [0.0061, 0.9808, 0.0131], [0.0049, 0.9924, 0.0028], [0.0009, 0.9933, 0.0058], [0.0019, 0.9956, 0.0025], [0.0054, 0.9937, 0.0009], [0.0265, 0.968, 0.0056], [0.0327, 0.9502, 0.0171], [0.0856, 0.9086, 0.0058], [0.0086, 0.989, 0.0024], [0.0274, 0.9691, 0.0035], [0.0426, 0.9531, 0.0043], [0.0266, 0.8958, 0.0776], [0.0119, 0.9857, 0.0023]]}
{"docno": "en.noclean.c4-train.05116-of-07168.30102", "label_index": [1, 1, 1, 1, 1, 1, 1], "label_confidence": [0.9745, 0.9882, 0.9809, 0.9513, 0.975, 0.9902, 0.9881], "label_score": [[0.001, 0.9745, 0.0245], [0.0103, 0.9882, 0.0015], [0.0042, 0.9809, 0.0149], [0.0419, 0.9513, 0.0067], [0.005, 0.975, 0.0199], [0.0034, 0.9902, 0.0065], [0.0034, 0.9881, 0.0084]]}
{"docno": "en.noclean.c4-train.02447-of-07168.67375", "label_index": [1, 1, 1, 1, 1, 1, 1, 1], "label_confidence": [0.9464, 0.9594, 0.9834, 0.9911, 0.9397, 0.9474, 0.9863, 0.9848], "label_score": [[0.0143, 0.9464, 0.0393], [0.0344, 0.9594, 0.0062], [0.004, 0.9834, 0.0126], [0.0027, 0.9911, 0.0062], [0.0529, 0.9397, 0.0075], [0.0116, 0.9474, 0.041], [0.0024, 0.9863, 0.0112], [0.0031, 0.9848, 0.0121]]}
{"docno": "en.noclean.c4-train.03286-of-07168.133092", "label_index": [1, 1, 1, 1, 1, 1], "label_confidence": [0.9867, 0.9916, 0.9867, 0.8586, 0.9796, 0.9754], "label_score": [[0.0055, 0.9867, 0.0078], [0.0012, 0.9916, 0.0072], [0.0015, 0.9867, 0.0117], [0.0019, 0.8586, 0.1395], [0.0098, 0.9796, 0.0105], [0.0183, 0.9754, 0.0063]]}
{"docno": "en.noclean.c4-train.05571-of-07168.116949", "label_index": [1, 1], "label_confidence": [0.9928, 0.9841], "label_score": [[0.003, 0.9928, 0.0042], [0.0051, 0.9841, 0.0108]]}
{"docno": "en.noclean.c4-train.01592-of-07168.96718", "label_index": [1, 1, 1, 1, 1, 1, 1, 1, 1, 1, 1], "label_confidence": [0.9744, 0.9944, 0.9815, 0.9887, 0.9928, 0.9944, 0.9465, 0.9935, 0.9945, 0.9864, 0.9162], "label_score": [[0.022, 0.9744, 0.0035], [0.0044, 0.9944, 0.0012], [0.0082, 0.9815, 0.0103], [0.0061, 0.9887, 0.0052], [0.001, 0.9928, 0.0062], [0.0014, 0.9944, 0.0042], [0.0022, 0.9465, 0.0512], [0.001, 0.9935, 0.0054], [0.0028, 0.9945, 0.0027], [0.0032, 0.9864, 0.0104], [0.0026, 0.9162, 0.0812]]}
{"docno": "en.noclean.c4-train.04979-of-07168.109069", "label_index": [1, 1, 1, 1, 1, 1, 1, 1, 1, 1, 1, 1, 1, 1, 1, 1, 1, 1, 1, 1, 1, 1, 1, 1, 1], "label_confidence": [0.9754, 0.9779, 0.6745, 0.9657, 0.987, 0.9939, 0.9933, 0.9944, 0.9851, 0.9697, 0.9865, 0.965, 0.9907, 0.9892, 0.9842, 0.9864, 0.974, 0.986, 0.9791, 0.991, 0.9911, 0.9938, 0.8762, 0.9927, 0.9949], "label_score": [[0.0004, 0.9754, 0.0242], [0.0006, 0.9779, 0.0215], [0.0155, 0.6745, 0.31], [0.0071, 0.9657, 0.0272], [0.0069, 0.987, 0.0061], [0.0009, 0.9939, 0.0051], [0.0022, 0.9933, 0.0045], [0.002, 0.9944, 0.0036], [0.0084, 0.9851, 0.0065], [0.0013, 0.9697, 0.029], [0.0018, 0.9865, 0.0117], [0.0207, 0.965, 0.0143], [0.0053, 0.9907, 0.004], [0.0081, 0.9892, 0.0027], [0.009, 0.9842, 0.0068], [0.0006, 0.9864, 0.013], [0.0173, 0.974, 0.0087], [0.0086, 0.986, 0.0054], [0.0087, 0.9791, 0.0123], [0.0037, 0.991, 0.0053], [0.0048, 0.9911, 0.0041], [0.0036, 0.9938, 0.0026], [0.0947, 0.8762, 0.0291], [0.0039, 0.9927, 0.0034], [0.0037, 0.9949, 0.0014]]}
{"docno": "en.noclean.c4-train.04208-of-07168.117412", "label_index": [1, 1, 1, 1, 1, 1, 1, 1, 1, 1, 1, 1], "label_confidence": [0.9514, 0.9756, 0.9757, 0.9701, 0.9594, 0.9893, 0.9912, 0.9911, 0.9397, 0.9474, 0.9863, 0.9848], "label_score": [[0.0357, 0.9514, 0.013], [0.0074, 0.9756, 0.017], [0.0173, 0.9757, 0.0071], [0.0144, 0.9701, 0.0155], [0.0344, 0.9594, 0.0062], [0.0032, 0.9893, 0.0075], [0.0044, 0.9912, 0.0043], [0.0027, 0.9911, 0.0062], [0.0529, 0.9397, 0.0075], [0.0116, 0.9474, 0.041], [0.0024, 0.9863, 0.0112], [0.0031, 0.9848, 0.0121]]}
{"docno": "en.noclean.c4-train.00548-of-07168.131689", "label_index": [1, 1, 1, 1, 1, 1, 1, 1, 1, 1, 1, 1, 1, 1, 1, 1, 1, 1, 1], "label_confidence": [0.9602, 0.9934, 0.9478, 0.9737, 0.8809, 0.9858, 0.9804, 0.936, 0.9762, 0.9907, 0.9414, 0.8855, 0.9195, 0.9878, 0.9797, 0.9496, 0.9757, 0.9828, 0.9892], "label_score": [[0.0119, 0.9602, 0.0279], [0.0039, 0.9934, 0.0027], [0.0499, 0.9478, 0.0022], [0.02, 0.9737, 0.0062], [0.0057, 0.8809, 0.1134], [0.0016, 0.9858, 0.0126], [0.0057, 0.9804, 0.0139], [0.0063, 0.936, 0.0577], [0.001, 0.9762, 0.0228], [0.0013, 0.9907, 0.008], [0.0029, 0.9414, 0.0557], [0.0007, 0.8855, 0.1139], [0.0026, 0.9195, 0.0779], [0.0079, 0.9878, 0.0043], [0.0171, 0.9797, 0.0031], [0.0433, 0.9496, 0.0071], [0.0117, 0.9757, 0.0126], [0.0061, 0.9828, 0.0111], [0.0054, 0.9892, 0.0054]]}
{"docno": "en.noclean.c4-train.04581-of-07168.48367", "label_index": [1, 1, 1], "label_confidence": [0.9802, 0.7844, 0.9882], "label_score": [[0.0023, 0.9802, 0.0175], [0.0608, 0.7844, 0.1548], [0.0022, 0.9882, 0.0096]]}
{"docno": "en.noclean.c4-train.02667-of-07168.103958", "label_index": [1, 1, 1, 1, 1, 1, 1, 1, 1, 1, 1, 1], "label_confidence": [0.9452, 0.9724, 0.9635, 0.9784, 0.9052, 0.9936, 0.7697, 0.974, 0.991, 0.9775, 0.9714, 0.9956], "label_score": [[0.0173, 0.9452, 0.0375], [0.0063, 0.9724, 0.0213], [0.0007, 0.9635, 0.0357], [0.0007, 0.9784, 0.021], [0.0004, 0.9052, 0.0944], [0.0013, 0.9936, 0.0051], [0.0044, 0.7697, 0.2259], [0.0034, 0.974, 0.0225], [0.0006, 0.991, 0.0084], [0.0102, 0.9775, 0.0123], [0.0216, 0.9714, 0.007], [0.0015, 0.9956, 0.0029]]}
{"docno": "en.noclean.c4-train.00839-of-07168.83753", "label_index": [1, 1, 1, 1, 1, 1, 1, 1, 1], "label_confidence": [0.9775, 0.9897, 0.9899, 0.9872, 0.9777, 0.9902, 0.9863, 0.9913, 0.9308], "label_score": [[0.0178, 0.9775, 0.0047], [0.0075, 0.9897, 0.0028], [0.0078, 0.9899, 0.0024], [0.0008, 0.9872, 0.012], [0.0074, 0.9777, 0.0149], [0.0046, 0.9902, 0.0052], [0.0011, 0.9863, 0.0126], [0.0076, 0.9913, 0.0011], [0.0061, 0.9308, 0.0631]]}
{"docno": "en.noclean.c4-train.03981-of-07168.112362", "label_index": [1, 1, 1, 1, 1, 1], "label_confidence": [0.9943, 0.991, 0.992, 0.9906, 0.9892, 0.9261], "label_score": [[0.0013, 0.9943, 0.0045], [0.0012, 0.991, 0.0078], [0.0004, 0.992, 0.0076], [0.0026, 0.9906, 0.0068], [0.0019, 0.9892, 0.0089], [0.008, 0.9261, 0.0659]]}
{"docno": "en.noclean.c4-train.04893-of-07168.97644", "label_index": [1, 1, 1, 1, 1, 1, 1, 1, 1, 1, 1], "label_confidence": [0.8138, 0.9803, 0.9921, 0.9829, 0.9894, 0.9925, 0.9816, 0.965, 0.9765, 0.8404, 0.9932], "label_score": [[0.0982, 0.8138, 0.088], [0.0019, 0.9803, 0.0178], [0.0034, 0.9921, 0.0044], [0.0103, 0.9829, 0.0068], [0.001, 0.9894, 0.0096], [0.0015, 0.9925, 0.006], [0.0006, 0.9816, 0.0179], [0.0257, 0.965, 0.0093], [0.0013, 0.9765, 0.0222], [0.0495, 0.8404, 0.1102], [0.0022, 0.9932, 0.0046]]}
{"docno": "en.noclean.c4-train.01899-of-07168.39660", "label_index": [1], "label_confidence": [0.9761], "label_score": [[0.002, 0.9761, 0.0218]]}
{"docno": "en.noclean.c4-train.06184-of-07168.14253", "label_index": [2, 1, 1, 1, 1, 1], "label_confidence": [0.6721, 0.9832, 0.9897, 0.8619, 0.9759, 0.981], "label_score": [[0.0036, 0.3243, 0.6721], [0.0021, 0.9832, 0.0148], [0.0008, 0.9897, 0.0095], [0.0325, 0.8619, 0.1056], [0.0089, 0.9759, 0.0152], [0.0104, 0.981, 0.0086]]}
{"docno": "en.noclean.c4-train.03805-of-07168.51370", "label_index": [1, 1, 1, 1, 1, 1, 1, 1], "label_confidence": [0.938, 0.9926, 0.9848, 0.9552, 0.9513, 0.975, 0.9902, 0.9881], "label_score": [[0.0536, 0.938, 0.0084], [0.004, 0.9926, 0.0034], [0.0068, 0.9848, 0.0084], [0.0038, 0.9552, 0.041], [0.0419, 0.9513, 0.0067], [0.005, 0.975, 0.0199], [0.0034, 0.9902, 0.0065], [0.0034, 0.9881, 0.0084]]}
{"docno": "en.noclean.c4-train.00981-of-07168.64476", "label_index": [1, 1, 1], "label_confidence": [0.9942, 0.9792, 0.9875], "label_score": [[0.001, 0.9942, 0.0048], [0.0009, 0.9792, 0.0199], [0.0025, 0.9875, 0.01]]}
{"docno": "en.noclean.c4-train.02956-of-07168.25466", "label_index": [1, 1, 1, 1, 1, 1, 1, 1, 1, 1, 1, 1, 1, 1, 1, 1, 1, 1, 1, 1, 1, 1, 1, 1, 2, 1, 2, 1, 1, 1, 1, 1, 1, 1, 1, 1, 2, 2, 1, 1, 1, 1, 1, 1, 1, 1, 1, 1, 1, 1, 1, 1, 1, 1, 1, 1, 1, 1, 1, 1, 1, 1, 1, 1], "label_confidence": [0.9696, 0.9946, 0.9697, 0.9864, 0.9819, 0.9906, 0.9902, 0.9869, 0.7424, 0.9738, 0.743, 0.9701, 0.9299, 0.7769, 0.9898, 0.9753, 0.8464, 0.8786, 0.8156, 0.5128, 0.873, 0.9905, 0.988, 0.8344, 0.5249, 0.9457, 0.7381, 0.9473, 0.9824, 0.6284, 0.9645, 0.9469, 0.721, 0.9019, 0.9886, 0.6829, 0.5172, 0.4584, 0.9548, 0.9523, 0.97, 0.9473, 0.8969, 0.9836, 0.777, 0.9762, 0.933, 0.8882, 0.9541, 0.6156, 0.9951, 0.819, 0.9775, 0.9598, 0.7396, 0.976, 0.9919, 0.9889, 0.6359, 0.9542, 0.9923, 0.9821, 0.9821, 0.9671], "label_score": [[0.0016, 0.9696, 0.0288], [0.0035, 0.9946, 0.0019], [0.0173, 0.9697, 0.013], [0.0043, 0.9864, 0.0093], [0.0026, 0.9819, 0.0155], [0.0042, 0.9906, 0.0052], [0.001, 0.9902, 0.0088], [0.0013, 0.9869, 0.0118], [0.0136, 0.7424, 0.244], [0.0134, 0.9738, 0.0128], [0.0106, 0.743, 0.2464], [0.014, 0.9701, 0.016], [0.0269, 0.9299, 0.0432], [0.0375, 0.7769, 0.1856], [0.0012, 0.9898, 0.009], [0.0137, 0.9753, 0.011], [0.0742, 0.8464, 0.0794], [0.0928, 0.8786, 0.0286], [0.0124, 0.8156, 0.1719], [0.194, 0.5128, 0.2932], [0.0807, 0.873, 0.0463], [0.0002, 0.9905, 0.0094], [0.0006, 0.988, 0.0113], [0.0075, 0.8344, 0.158], [0.0935, 0.3816, 0.5249], [0.0004, 0.9457, 0.0539], [0.0676, 0.1943, 0.7381], [0.0224, 0.9473, 0.0304], [0.004, 0.9824, 0.0137], [0.0131, 0.6284, 0.3585], [0.0285, 0.9645, 0.007], [0.0292, 0.9469, 0.0238], [0.1389, 0.721, 0.1401], [0.0777, 0.9019, 0.0204], [0.0034, 0.9886, 0.008], [0.1349, 0.6829, 0.1822], [0.0215, 0.4612, 0.5172], [0.1038, 0.4378, 0.4584], [0.0314, 0.9548, 0.0138], [0.0426, 0.9523, 0.0051], [0.007, 0.97, 0.023], [0.0375, 0.9473, 0.0152], [0.0509, 0.8969, 0.0522], [0.0066, 0.9836, 0.0098], [0.0036, 0.777, 0.2194], [0.0008, 0.9762, 0.023], [0.0507, 0.933, 0.0163], [0.0025, 0.8882, 0.1093], [0.0056, 0.9541, 0.0403], [0.0183, 0.6156, 0.366], [0.0011, 0.9951, 0.0038], [0.1042, 0.819, 0.0767], [0.0202, 0.9775, 0.0023], [0.0004, 0.9598, 0.0398], [0.03, 0.7396, 0.2304], [0.0194, 0.976, 0.0046], [0.0012, 0.9919, 0.007], [0.0014, 0.9889, 0.0097], [0.0172, 0.6359, 0.3468], [0.0214, 0.9542, 0.0244], [0.0025, 0.9923, 0.0052], [0.0111, 0.9821, 0.0068], [0.0111, 0.9821, 0.0068], [0.0281, 0.9671, 0.0048]]}
{"docno": "en.noclean.c4-train.02426-of-07168.4846", "label_index": [1, 1, 1, 1, 1, 1, 1, 1, 1, 1, 1, 1], "label_confidence": [0.9668, 0.9446, 0.9836, 0.9902, 0.9897, 0.9894, 0.9918, 0.9945, 0.9808, 0.977, 0.8298, 0.9894], "label_score": [[0.0022, 0.9668, 0.031], [0.0022, 0.9446, 0.0532], [0.001, 0.9836, 0.0154], [0.0017, 0.9902, 0.0082], [0.0032, 0.9897, 0.0071], [0.0017, 0.9894, 0.0089], [0.0028, 0.9918, 0.0054], [0.0018, 0.9945, 0.0037], [0.015, 0.9808, 0.0041], [0.0014, 0.977, 0.0217], [0.1147, 0.8298, 0.0555], [0.0018, 0.9894, 0.0088]]}
{"docno": "en.noclean.c4-train.02989-of-07168.108382", "label_index": [1], "label_confidence": [0.9718], "label_score": [[0.0145, 0.9718, 0.0137]]}
{"docno": "en.noclean.c4-train.05664-of-07168.62656", "label_index": [1, 1, 1, 1], "label_confidence": [0.9819, 0.9453, 0.9904, 0.9915], "label_score": [[0.0037, 0.9819, 0.0145], [0.0014, 0.9453, 0.0533], [0.0037, 0.9904, 0.0059], [0.0022, 0.9915, 0.0063]]}
{"docno": "en.noclean.c4-train.02212-of-07168.99953", "label_index": [1, 1, 2], "label_confidence": [0.9928, 0.987, 0.5377], "label_score": [[0.0021, 0.9928, 0.0051], [0.0026, 0.987, 0.0104], [0.0043, 0.458, 0.5377]]}
{"docno": "en.noclean.c4-train.04257-of-07168.131441", "label_index": [1, 1, 1, 1], "label_confidence": [0.9917, 0.9648, 0.9768, 0.9261], "label_score": [[0.0071, 0.9917, 0.0013], [0.0117, 0.9648, 0.0235], [0.0111, 0.9768, 0.0121], [0.0022, 0.9261, 0.0717]]}
{"docno": "en.noclean.c4-train.00968-of-07168.15564", "label_index": [1, 1, 1, 1, 1], "label_confidence": [0.9737, 0.9902, 0.9848, 0.8214, 0.9782], "label_score": [[0.0254, 0.9737, 0.001], [0.002, 0.9902, 0.0079], [0.0024, 0.9848, 0.0129], [0.0058, 0.8214, 0.1729], [0.0024, 0.9782, 0.0194]]}
{"docno": "en.noclean.c4-train.05447-of-07168.144245", "label_index": [1, 1, 1, 1, 1, 1, 1, 1, 1, 1, 1, 1, 1, 1, 1, 2, 1, 1, 1, 1, 1, 1, 1, 1, 1, 1, 1, 1, 1, 1, 1, 1, 1, 1, 1, 1, 1, 1, 1, 1, 1, 1, 2, 1, 1, 1, 1, 1, 1, 1, 1, 1, 1, 1, 1, 1, 1, 1, 1, 1, 1, 1, 1, 1, 1, 1, 1, 1, 1, 1, 1], "label_confidence": [0.9872, 0.964, 0.9755, 0.9847, 0.957, 0.9894, 0.9865, 0.9663, 0.9905, 0.9927, 0.9818, 0.9116, 0.9928, 0.5105, 0.9553, 0.823, 0.9479, 0.945, 0.8062, 0.9776, 0.9602, 0.8483, 0.9028, 0.7077, 0.9688, 0.9604, 0.7299, 0.9714, 0.7007, 0.7997, 0.9835, 0.9846, 0.8073, 0.9633, 0.849, 0.9822, 0.9884, 0.9266, 0.7467, 0.9874, 0.9329, 0.7812, 0.501, 0.9697, 0.9107, 0.8822, 0.9476, 0.9568, 0.9913, 0.9185, 0.9892, 0.6788, 0.9718, 0.7174, 0.9758, 0.9421, 0.962, 0.9762, 0.9704, 0.812, 0.9723, 0.9915, 0.9811, 0.524, 0.9452, 0.9771, 0.9883, 0.9775, 0.9897, 0.9725, 0.9797], "label_score": [[0.0076, 0.9872, 0.0052], [0.012, 0.964, 0.024], [0.0187, 0.9755, 0.0059], [0.0112, 0.9847, 0.0041], [0.0069, 0.957, 0.0361], [0.0025, 0.9894, 0.0081], [0.0065, 0.9865, 0.007], [0.0175, 0.9663, 0.0162], [0.0045, 0.9905, 0.005], [0.005, 0.9927, 0.0023], [0.0025, 0.9818, 0.0157], [0.0019, 0.9116, 0.0865], [0.0009, 0.9928, 0.0064], [0.1433, 0.5105, 0.3462], [0.0232, 0.9553, 0.0216], [0.0119, 0.1651, 0.823], [0.0464, 0.9479, 0.0057], [0.0451, 0.945, 0.0099], [0.0382, 0.8062, 0.1557], [0.0155, 0.9776, 0.0069], [0.0015, 0.9602, 0.0383], [0.1379, 0.8483, 0.0139], [0.015, 0.9028, 0.0822], [0.0349, 0.7077, 0.2574], [0.0249, 0.9688, 0.0063], [0.003, 0.9604, 0.0365], [0.0181, 0.7299, 0.2521], [0.0005, 0.9714, 0.028], [0.0156, 0.7007, 0.2837], [0.0363, 0.7997, 0.164], [0.007, 0.9835, 0.0095], [0.0074, 0.9846, 0.008], [0.0213, 0.8073, 0.1714], [0.0298, 0.9633, 0.0069], [0.0732, 0.849, 0.0777], [0.0149, 0.9822, 0.0029], [0.0064, 0.9884, 0.0052], [0.005, 0.9266, 0.0683], [0.0093, 0.7467, 0.244], [0.0075, 0.9874, 0.005], [0.0342, 0.9329, 0.0328], [0.0625, 0.7812, 0.1563], [0.0536, 0.4453, 0.501], [0.0248, 0.9697, 0.0054], [0.0675, 0.9107, 0.0218], [0.0809, 0.8822, 0.0369], [0.0473, 0.9476, 0.0051], [0.0242, 0.9568, 0.0191], [0.0063, 0.9913, 0.0024], [0.0026, 0.9185, 0.0789], [0.001, 0.9892, 0.0098], [0.121, 0.6788, 0.2002], [0.0016, 0.9718, 0.0266], [0.0172, 0.7174, 0.2654], [0.0151, 0.9758, 0.0091], [0.0022, 0.9421, 0.0557], [0.0315, 0.962, 0.0065], [0.0026, 0.9762, 0.0212], [0.0005, 0.9704, 0.0291], [0.0628, 0.812, 0.1252], [0.006, 0.9723, 0.0217], [0.0023, 0.9915, 0.0062], [0.0008, 0.9811, 0.0181], [0.1356, 0.524, 0.3404], [0.048, 0.9452, 0.0067], [0.0032, 0.9771, 0.0197], [0.0079, 0.9883, 0.0038], [0.0086, 0.9775, 0.0139], [0.005, 0.9897, 0.0053], [0.0238, 0.9725, 0.0038], [0.0123, 0.9797, 0.008]]}
{"docno": "en.noclean.c4-train.04284-of-07168.74355", "label_index": [1, 1, 1], "label_confidence": [0.9764, 0.9427, 0.8943], "label_score": [[0.0178, 0.9764, 0.0059], [0.0528, 0.9427, 0.0046], [0.0622, 0.8943, 0.0435]]}
{"docno": "en.noclean.c4-train.05361-of-07168.13506", "label_index": [1, 1, 1, 1, 1, 1, 1, 1, 1, 1, 1, 1, 1, 1], "label_confidence": [0.9866, 0.7499, 0.9876, 0.9764, 0.6325, 0.9728, 0.9485, 0.9731, 0.9679, 0.89, 0.981, 0.9602, 0.9339, 0.8593], "label_score": [[0.0086, 0.9866, 0.0048], [0.2437, 0.7499, 0.0064], [0.0015, 0.9876, 0.0108], [0.0107, 0.9764, 0.0129], [0.0021, 0.6325, 0.3654], [0.0097, 0.9728, 0.0176], [0.007, 0.9485, 0.0445], [0.0063, 0.9731, 0.0206], [0.0174, 0.9679, 0.0147], [0.003, 0.89, 0.1071], [0.0126, 0.981, 0.0064], [0.0308, 0.9602, 0.0089], [0.0028, 0.9339, 0.0633], [0.0062, 0.8593, 0.1345]]}
{"docno": "en.noclean.c4-train.00900-of-07168.116609", "label_index": [1, 1, 1], "label_confidence": [0.9414, 0.9244, 0.9412], "label_score": [[0.0038, 0.9414, 0.0549], [0.0032, 0.9244, 0.0724], [0.0096, 0.9412, 0.0491]]}
{"docno": "en.noclean.c4-train.06768-of-07168.32863", "label_index": [1, 1, 1, 1, 1, 1, 1, 1, 1, 1], "label_confidence": [0.986, 0.9825, 0.9844, 0.9416, 0.934, 0.9926, 0.9849, 0.9785, 0.99, 0.9891], "label_score": [[0.0011, 0.986, 0.0129], [0.0023, 0.9825, 0.0151], [0.0085, 0.9844, 0.0072], [0.04, 0.9416, 0.0184], [0.0025, 0.934, 0.0635], [0.0035, 0.9926, 0.0039], [0.0024, 0.9849, 0.0127], [0.0055, 0.9785, 0.016], [0.0017, 0.99, 0.0083], [0.008, 0.9891, 0.0029]]}
{"docno": "en.noclean.c4-train.02500-of-07168.129293", "label_index": [1, 1, 1, 1], "label_confidence": [0.99, 0.9953, 0.7685, 0.9753], "label_score": [[0.0039, 0.99, 0.0061], [0.002, 0.9953, 0.0028], [0.0033, 0.7685, 0.2282], [0.0037, 0.9753, 0.021]]}
{"docno": "en.noclean.c4-train.06650-of-07168.72544", "label_index": [1, 1, 1, 1, 1, 1, 1, 1, 1], "label_confidence": [0.9717, 0.9914, 0.9923, 0.9898, 0.9874, 0.9035, 0.8905, 0.9802, 0.9845], "label_score": [[0.004, 0.9717, 0.0244], [0.0052, 0.9914, 0.0034], [0.002, 0.9923, 0.0057], [0.0062, 0.9898, 0.004], [0.0071, 0.9874, 0.0054], [0.0611, 0.9035, 0.0353], [0.0211, 0.8905, 0.0883], [0.0164, 0.9802, 0.0034], [0.013, 0.9845, 0.0025]]}
{"docno": "en.noclean.c4-train.00217-of-07168.108781", "label_index": [1, 1, 1, 1, 1], "label_confidence": [0.8846, 0.9938, 0.9915, 0.962, 0.9855], "label_score": [[0.1043, 0.8846, 0.0111], [0.0023, 0.9938, 0.0038], [0.0005, 0.9915, 0.0079], [0.0292, 0.962, 0.0088], [0.0087, 0.9855, 0.0058]]}
{"docno": "en.noclean.c4-train.01912-of-07168.127871", "label_index": [1, 1, 1], "label_confidence": [0.9813, 0.9672, 0.9884], "label_score": [[0.01, 0.9813, 0.0087], [0.0174, 0.9672, 0.0154], [0.0029, 0.9884, 0.0087]]}
{"docno": "en.noclean.c4-train.00988-of-07168.55842", "label_index": [1, 1, 1, 1, 1, 1, 1, 1, 1, 1, 1], "label_confidence": [0.9607, 0.9852, 0.9907, 0.9356, 0.9802, 0.934, 0.9711, 0.9545, 0.9693, 0.9835, 0.8767], "label_score": [[0.0219, 0.9607, 0.0174], [0.0011, 0.9852, 0.0137], [0.0017, 0.9907, 0.0077], [0.0013, 0.9356, 0.0631], [0.0018, 0.9802, 0.018], [0.0012, 0.934, 0.0648], [0.0021, 0.9711, 0.0268], [0.0005, 0.9545, 0.045], [0.022, 0.9693, 0.0087], [0.0134, 0.9835, 0.0031], [0.0018, 0.8767, 0.1215]]}
{"docno": "en.noclean.c4-train.01885-of-07168.104235", "label_index": [1, 1, 1, 1, 1, 1, 1, 1, 1, 1, 1, 1, 1, 1, 1, 1, 1, 1], "label_confidence": [0.9271, 0.9944, 0.8723, 0.9793, 0.9809, 0.9884, 0.9825, 0.992, 0.9801, 0.9349, 0.9928, 0.9909, 0.996, 0.9819, 0.973, 0.9616, 0.9819, 0.9829], "label_score": [[0.0286, 0.9271, 0.0444], [0.0016, 0.9944, 0.004], [0.1082, 0.8723, 0.0194], [0.0197, 0.9793, 0.001], [0.0124, 0.9809, 0.0066], [0.0017, 0.9884, 0.0099], [0.0079, 0.9825, 0.0097], [0.0015, 0.992, 0.0065], [0.0018, 0.9801, 0.0182], [0.0088, 0.9349, 0.0563], [0.0046, 0.9928, 0.0026], [0.0037, 0.9909, 0.0054], [0.0017, 0.996, 0.0023], [0.0133, 0.9819, 0.0048], [0.009, 0.973, 0.018], [0.0079, 0.9616, 0.0305], [0.002, 0.9819, 0.0161], [0.0105, 0.9829, 0.0065]]}
{"docno": "en.noclean.c4-train.00471-of-07168.15328", "label_index": [1, 1, 1, 1], "label_confidence": [0.9903, 0.9822, 0.9742, 0.9887], "label_score": [[0.0019, 0.9903, 0.0078], [0.0138, 0.9822, 0.004], [0.0097, 0.9742, 0.0161], [0.0068, 0.9887, 0.0046]]}
{"docno": "en.noclean.c4-train.00445-of-07168.41117", "label_index": [1, 1, 1], "label_confidence": [0.9816, 0.9942, 0.9915], "label_score": [[0.0012, 0.9816, 0.0172], [0.0017, 0.9942, 0.0041], [0.0022, 0.9915, 0.0063]]}
{"docno": "en.noclean.c4-train.06500-of-07168.9536", "label_index": [1, 1, 1], "label_confidence": [0.9816, 0.9942, 0.9915], "label_score": [[0.0012, 0.9816, 0.0172], [0.0017, 0.9942, 0.0041], [0.0022, 0.9915, 0.0063]]}
{"docno": "en.noclean.c4-train.02053-of-07168.25170", "label_index": [1, 1], "label_confidence": [0.8519, 0.9325], "label_score": [[0.0686, 0.8519, 0.0795], [0.0057, 0.9325, 0.0618]]}
{"docno": "en.noclean.c4-train.03678-of-07168.35469", "label_index": [1, 1], "label_confidence": [0.8519, 0.9325], "label_score": [[0.0686, 0.8519, 0.0795], [0.0057, 0.9325, 0.0618]]}
{"docno": "en.noclean.c4-train.00031-of-07168.115411", "label_index": [1, 1, 1, 1], "label_confidence": [0.9872, 0.9688, 0.9208, 0.9781], "label_score": [[0.0051, 0.9872, 0.0077], [0.0153, 0.9688, 0.0159], [0.0024, 0.9208, 0.0768], [0.0083, 0.9781, 0.0136]]}
{"docno": "en.noclean.c4-train.04175-of-07168.36641", "label_index": [1, 1, 1, 1, 1, 1, 2, 1], "label_confidence": [0.8275, 0.9888, 0.9884, 0.9894, 0.985, 0.9885, 0.6258, 0.9898], "label_score": [[0.1009, 0.8275, 0.0716], [0.0026, 0.9888, 0.0086], [0.0041, 0.9884, 0.0075], [0.0011, 0.9894, 0.0095], [0.0095, 0.985, 0.0055], [0.0076, 0.9885, 0.0039], [0.0027, 0.3714, 0.6258], [0.0018, 0.9898, 0.0084]]}
{"docno": "en.noclean.c4-train.07108-of-07168.107345", "label_index": [1, 1, 1], "label_confidence": [0.9863, 0.9696, 0.9896], "label_score": [[0.0022, 0.9863, 0.0115], [0.0035, 0.9696, 0.0269], [0.0024, 0.9896, 0.0079]]}
{"docno": "en.noclean.c4-train.01594-of-07168.105158", "label_index": [1, 1, 1, 1, 1], "label_confidence": [0.9799, 0.9913, 0.991, 0.9708, 0.9162], "label_score": [[0.014, 0.9799, 0.0061], [0.0034, 0.9913, 0.0053], [0.0058, 0.991, 0.0032], [0.0017, 0.9708, 0.0275], [0.0026, 0.9162, 0.0812]]}
{"docno": "en.noclean.c4-train.04331-of-07168.90917", "label_index": [1, 1, 1, 1, 2, 1, 1, 1], "label_confidence": [0.945, 0.9877, 0.9137, 0.7784, 0.5128, 0.9922, 0.9914, 0.942], "label_score": [[0.0034, 0.945, 0.0516], [0.003, 0.9877, 0.0093], [0.0136, 0.9137, 0.0727], [0.0071, 0.7784, 0.2145], [0.0046, 0.4826, 0.5128], [0.0052, 0.9922, 0.0026], [0.0028, 0.9914, 0.0058], [0.0023, 0.942, 0.0557]]}
{"docno": "en.noclean.c4-train.01828-of-07168.55740", "label_index": [1], "label_confidence": [0.74], "label_score": [[0.1127, 0.74, 0.1473]]}
{"docno": "en.noclean.c4-train.03889-of-07168.83858", "label_index": [1, 1, 1, 1, 1], "label_confidence": [0.9352, 0.9675, 0.9549, 0.9904, 0.9626], "label_score": [[0.0046, 0.9352, 0.0602], [0.006, 0.9675, 0.0265], [0.0037, 0.9549, 0.0414], [0.0007, 0.9904, 0.0089], [0.0017, 0.9626, 0.0356]]}
{"docno": "en.noclean.c4-train.05470-of-07168.131361", "label_index": [1, 1, 1, 1, 1, 1], "label_confidence": [0.9871, 0.9951, 0.9676, 0.9849, 0.9873, 0.9744], "label_score": [[0.0076, 0.9871, 0.0053], [0.0034, 0.9951, 0.0015], [0.0015, 0.9676, 0.031], [0.0013, 0.9849, 0.0138], [0.0105, 0.9873, 0.0022], [0.0244, 0.9744, 0.0012]]}
{"docno": "en.noclean.c4-train.05519-of-07168.111185", "label_index": [1, 1], "label_confidence": [0.9627, 0.9791], "label_score": [[0.0006, 0.9627, 0.0367], [0.0012, 0.9791, 0.0197]]}
{"docno": "en.noclean.c4-train.00793-of-07168.50616", "label_index": [1, 1], "label_confidence": [0.8713, 0.9588], "label_score": [[0.0061, 0.8713, 0.1226], [0.0063, 0.9588, 0.0349]]}
{"docno": "en.noclean.c4-train.03952-of-07168.53166", "label_index": [1, 1, 1, 1], "label_confidence": [0.8366, 0.9656, 0.9335, 0.9494], "label_score": [[0.1437, 0.8366, 0.0197], [0.0264, 0.9656, 0.008], [0.0613, 0.9335, 0.0052], [0.021, 0.9494, 0.0296]]}
{"docno": "en.noclean.c4-train.02512-of-07168.66198", "label_index": [1, 1, 1, 1], "label_confidence": [0.8569, 0.9544, 0.9644, 0.9855], "label_score": [[0.008, 0.8569, 0.1351], [0.0021, 0.9544, 0.0435], [0.004, 0.9644, 0.0316], [0.0055, 0.9855, 0.009]]}
{"docno": "en.noclean.c4-train.03324-of-07168.106685", "label_index": [1, 1, 1, 1, 1, 1, 1, 1, 2, 1, 1, 1, 1], "label_confidence": [0.9862, 0.9931, 0.9927, 0.9958, 0.9606, 0.8053, 0.9763, 0.9613, 0.6924, 0.9762, 0.8651, 0.987, 0.9095], "label_score": [[0.0008, 0.9862, 0.013], [0.0008, 0.9931, 0.0062], [0.0026, 0.9927, 0.0048], [0.0015, 0.9958, 0.0026], [0.003, 0.9606, 0.0364], [0.0433, 0.8053, 0.1514], [0.0212, 0.9763, 0.0025], [0.006, 0.9613, 0.0327], [0.0434, 0.2643, 0.6924], [0.007, 0.9762, 0.0168], [0.0354, 0.8651, 0.0994], [0.0015, 0.987, 0.0115], [0.0041, 0.9095, 0.0864]]}
{"docno": "en.noclean.c4-train.02000-of-07168.67742", "label_index": [1], "label_confidence": [0.9877], "label_score": [[0.0011, 0.9877, 0.0111]]}
{"docno": "en.noclean.c4-train.02802-of-07168.87547", "label_index": [1, 1, 1, 1, 1, 1], "label_confidence": [0.9946, 0.9139, 0.9874, 0.9893, 0.9759, 0.981], "label_score": [[0.0009, 0.9946, 0.0045], [0.0042, 0.9139, 0.0818], [0.0057, 0.9874, 0.0068], [0.0073, 0.9893, 0.0034], [0.0089, 0.9759, 0.0152], [0.0104, 0.981, 0.0086]]}
{"docno": "en.noclean.c4-train.01792-of-07168.54236", "label_index": [1], "label_confidence": [0.8716], "label_score": [[0.0441, 0.8716, 0.0843]]}
{"docno": "en.noclean.c4-train.02923-of-07168.70151", "label_index": [1], "label_confidence": [0.9648], "label_score": [[0.0007, 0.9648, 0.0345]]}
{"docno": "en.noclean.c4-train.00842-of-07168.147221", "label_index": [1], "label_confidence": [0.5974], "label_score": [[0.0105, 0.5974, 0.3921]]}
{"docno": "en.noclean.c4-train.02379-of-07168.5617", "label_index": [1, 1, 1, 1, 1, 1, 1], "label_confidence": [0.9557, 0.9932, 0.9808, 0.9605, 0.906, 0.9716, 0.8723], "label_score": [[0.0328, 0.9557, 0.0115], [0.0028, 0.9932, 0.004], [0.002, 0.9808, 0.0172], [0.0284, 0.9605, 0.0111], [0.0878, 0.906, 0.0062], [0.0226, 0.9716, 0.0058], [0.1133, 0.8723, 0.0144]]}
{"docno": "en.noclean.c4-train.03101-of-07168.110207", "label_index": [1, 1, 1, 1, 1, 1], "label_confidence": [0.988, 0.9953, 0.9356, 0.9596, 0.969, 0.9159], "label_score": [[0.0097, 0.988, 0.0023], [0.0027, 0.9953, 0.002], [0.0054, 0.9356, 0.059], [0.0214, 0.9596, 0.019], [0.008, 0.969, 0.023], [0.004, 0.9159, 0.0801]]}
{"docno": "en.noclean.c4-train.02906-of-07168.140393", "label_index": [1], "label_confidence": [0.9867], "label_score": [[0.0011, 0.9867, 0.0122]]}
{"docno": "en.noclean.c4-train.03104-of-07168.118822", "label_index": [1, 1, 1, 1], "label_confidence": [0.9948, 0.9947, 0.9592, 0.9444], "label_score": [[0.0011, 0.9948, 0.0041], [0.0014, 0.9947, 0.0039], [0.0028, 0.9592, 0.038], [0.0027, 0.9444, 0.0529]]}
{"docno": "en.noclean.c4-train.00430-of-07168.77465", "label_index": [1, 1], "label_confidence": [0.9671, 0.9669], "label_score": [[0.0034, 0.9671, 0.0295], [0.0038, 0.9669, 0.0293]]}
{"docno": "en.noclean.c4-train.04057-of-07168.50136", "label_index": [1], "label_confidence": [0.9467], "label_score": [[0.0035, 0.9467, 0.0499]]}
{"docno": "en.noclean.c4-train.03774-of-07168.57285", "label_index": [1, 1, 1, 1, 1, 1, 1], "label_confidence": [0.9847, 0.9858, 0.9552, 0.9513, 0.975, 0.9902, 0.9881], "label_score": [[0.0121, 0.9847, 0.0032], [0.0128, 0.9858, 0.0014], [0.0038, 0.9552, 0.041], [0.0419, 0.9513, 0.0067], [0.005, 0.975, 0.0199], [0.0034, 0.9902, 0.0065], [0.0034, 0.9881, 0.0084]]}
{"docno": "en.noclean.c4-train.02871-of-07168.79852", "label_index": [1, 1], "label_confidence": [0.9341, 0.9789], "label_score": [[0.0029, 0.9341, 0.0631], [0.0092, 0.9789, 0.0119]]}
{"docno": "en.noclean.c4-train.02904-of-07168.98051", "label_index": [1], "label_confidence": [0.9947], "label_score": [[0.0015, 0.9947, 0.0038]]}
{"docno": "en.noclean.c4-train.00755-of-07168.49099", "label_index": [1, 1, 1], "label_confidence": [0.9693, 0.9941, 0.9683], "label_score": [[0.0089, 0.9693, 0.0218], [0.0033, 0.9941, 0.0025], [0.0204, 0.9683, 0.0113]]}
{"docno": "en.noclean.c4-train.05809-of-07168.125702", "label_index": [1, 1], "label_confidence": [0.968, 0.9176], "label_score": [[0.0018, 0.968, 0.0303], [0.0017, 0.9176, 0.0807]]}
{"docno": "en.noclean.c4-train.04697-of-07168.36379", "label_index": [1, 1, 1, 1, 1, 1], "label_confidence": [0.9829, 0.9944, 0.9973, 0.9498, 0.9866, 0.9652], "label_score": [[0.0141, 0.9829, 0.003], [0.0024, 0.9944, 0.0032], [0.0005, 0.9973, 0.0022], [0.0339, 0.9498, 0.0163], [0.0062, 0.9866, 0.0072], [0.0038, 0.9652, 0.031]]}
{"docno": "en.noclean.c4-train.05701-of-07168.115874", "label_index": [1, 1, 1, 1], "label_confidence": [0.9688, 0.9528, 0.9901, 0.9481], "label_score": [[0.0281, 0.9688, 0.0031], [0.0371, 0.9528, 0.01], [0.0064, 0.9901, 0.0035], [0.0024, 0.9481, 0.0495]]}
{"docno": "en.noclean.c4-train.02008-of-07168.125168", "label_index": [1, 1, 1, 1, 1, 1], "label_confidence": [0.9782, 0.9763, 0.9554, 0.9046, 0.9423, 0.9877], "label_score": [[0.0016, 0.9782, 0.0202], [0.0018, 0.9763, 0.0219], [0.0022, 0.9554, 0.0424], [0.0047, 0.9046, 0.0907], [0.0054, 0.9423, 0.0524], [0.0045, 0.9877, 0.0078]]}
{"docno": "en.noclean.c4-train.02744-of-07168.59343", "label_index": [1], "label_confidence": [0.9644], "label_score": [[0.0083, 0.9644, 0.0274]]}
{"docno": "en.noclean.c4-train.06377-of-07168.89719", "label_index": [1], "label_confidence": [0.9483], "label_score": [[0.0109, 0.9483, 0.0409]]}
{"docno": "en.noclean.c4-train.03211-of-07168.81700", "label_index": [1, 1, 1], "label_confidence": [0.9789, 0.9938, 0.9906], "label_score": [[0.0013, 0.9789, 0.0198], [0.0034, 0.9938, 0.0028], [0.002, 0.9906, 0.0073]]}
{"docno": "en.noclean.c4-train.02536-of-07168.128103", "label_index": [1, 1, 1, 1, 1, 1, 1, 1], "label_confidence": [0.9784, 0.807, 0.9629, 0.9896, 0.9834, 0.9874, 0.9899, 0.9957], "label_score": [[0.0025, 0.9784, 0.0191], [0.0099, 0.807, 0.1831], [0.0048, 0.9629, 0.0323], [0.0029, 0.9896, 0.0075], [0.0038, 0.9834, 0.0129], [0.0037, 0.9874, 0.0089], [0.0039, 0.9899, 0.0061], [0.0032, 0.9957, 0.0011]]}
{"docno": "en.noclean.c4-train.05819-of-07168.10710", "label_index": [1, 1, 1, 1, 1, 1], "label_confidence": [0.9783, 0.98, 0.9727, 0.9665, 0.9807, 0.9959], "label_score": [[0.008, 0.9783, 0.0137], [0.0168, 0.98, 0.0033], [0.0138, 0.9727, 0.0134], [0.0164, 0.9665, 0.0171], [0.0104, 0.9807, 0.0088], [0.0021, 0.9959, 0.0019]]}
{"docno": "en.noclean.c4-train.05471-of-07168.7308", "label_index": [1, 1, 1, 1, 1], "label_confidence": [0.9682, 0.993, 0.9853, 0.962, 0.9855], "label_score": [[0.0268, 0.9682, 0.005], [0.0016, 0.993, 0.0054], [0.0025, 0.9853, 0.0123], [0.0292, 0.962, 0.0088], [0.0087, 0.9855, 0.0058]]}
{"docno": "en.noclean.c4-train.06641-of-07168.60241", "label_index": [1, 1, 1], "label_confidence": [0.977, 0.9809, 0.9829], "label_score": [[0.0092, 0.977, 0.0138], [0.0016, 0.9809, 0.0175], [0.0097, 0.9829, 0.0074]]}
{"docno": "en.noclean.c4-train.00026-of-07168.143526", "label_index": [1, 1, 1, 1, 1, 1, 1], "label_confidence": [0.9839, 0.9902, 0.9938, 0.9738, 0.9882, 0.9332, 0.9285], "label_score": [[0.0087, 0.9839, 0.0074], [0.0054, 0.9902, 0.0044], [0.0006, 0.9938, 0.0056], [0.0065, 0.9738, 0.0197], [0.0076, 0.9882, 0.0042], [0.0032, 0.9332, 0.0635], [0.0033, 0.9285, 0.0681]]}
