{"docno": "en.noclean.c4-train.07100-of-07168.25164", "label_index": [2, 1, 1, 1], "label_confidence": [0.6112, 0.9927, 0.9863, 0.994], "label_score": [[0.001, 0.3879, 0.6112], [0.0021, 0.9927, 0.0052], [0.0024, 0.9863, 0.0113], [0.002, 0.994, 0.004]]}
{"docno": "en.noclean.c4-train.06642-of-07168.56423", "label_index": [1, 1], "label_confidence": [0.9962, 0.9975], "label_score": [[0.0015, 0.9962, 0.0022], [0.0002, 0.9975, 0.0023]]}
{"docno": "en.noclean.c4-train.03987-of-07168.49413", "label_index": [1, 1], "label_confidence": [0.9987, 0.9902], "label_score": [[0.0005, 0.9987, 0.0008], [0.0007, 0.9902, 0.0092]]}
{"docno": "en.noclean.c4-train.05076-of-07168.112759", "label_index": [1, 1, 1, 1, 2, 1], "label_confidence": [0.9982, 0.9965, 0.9971, 0.9921, 0.9956, 0.9082], "label_score": [[0.0004, 0.9982, 0.0014], [0.001, 0.9965, 0.0025], [0.001, 0.9971, 0.0019], [0.0011, 0.9921, 0.0068], [0.0001, 0.0043, 0.9956], [0.0102, 0.9082, 0.0816]]}
{"docno": "en.noclean.c4-train.00275-of-07168.92757", "label_index": [2, 1, 1, 1, 1, 1, 2, 2, 2, 2, 2, 2, 1], "label_confidence": [0.9945, 0.9976, 0.9962, 0.9823, 0.9959, 0.9866, 0.9885, 0.9641, 0.9927, 0.9805, 0.8598, 0.9224, 0.8992], "label_score": [[0.0001, 0.0054, 0.9945], [0.0005, 0.9976, 0.002], [0.0008, 0.9962, 0.003], [0.0024, 0.9823, 0.0154], [0.0009, 0.9959, 0.0032], [0.0006, 0.9866, 0.0129], [0.0003, 0.0112, 0.9885], [0.0003, 0.0355, 0.9641], [0.0002, 0.0071, 0.9927], [0.0004, 0.0191, 0.9805], [0.0008, 0.1394, 0.8598], [0.0003, 0.0773, 0.9224], [0.0012, 0.8992, 0.0996]]}
{"docno": "en.noclean.c4-train.02948-of-07168.49496", "label_index": [1, 2, 2, 2, 1, 1, 1, 2], "label_confidence": [0.5932, 0.9706, 0.9924, 0.9502, 0.965, 0.9871, 0.9974, 0.9895], "label_score": [[0.0013, 0.5932, 0.4055], [0.0004, 0.029, 0.9706], [0.0002, 0.0074, 0.9924], [0.0009, 0.0489, 0.9502], [0.0003, 0.965, 0.0347], [0.0006, 0.9871, 0.0123], [0.0008, 0.9974, 0.0018], [0.0003, 0.0103, 0.9895]]}
{"docno": "en.noclean.c4-train.01129-of-07168.18427", "label_index": [1, 1, 2], "label_confidence": [0.9953, 0.9944, 0.9375], "label_score": [[0.001, 0.9953, 0.0037], [0.0012, 0.9944, 0.0043], [0.0003, 0.0622, 0.9375]]}
{"docno": "en.noclean.c4-train.04685-of-07168.98078", "label_index": [1, 1, 2], "label_confidence": [0.9974, 0.9946, 0.9871], "label_score": [[0.0009, 0.9974, 0.0017], [0.0012, 0.9946, 0.0042], [0.0003, 0.0126, 0.9871]]}
{"docno": "en.noclean.c4-train.02916-of-07168.39636", "label_index": [1, 1, 2, 1, 1], "label_confidence": [0.9802, 0.9896, 0.8875, 0.9957, 0.999], "label_score": [[0.0012, 0.9802, 0.0186], [0.0004, 0.9896, 0.01], [0.0005, 0.112, 0.8875], [0.0004, 0.9957, 0.0039], [0.0002, 0.999, 0.0008]]}
{"docno": "en.noclean.c4-train.01460-of-07168.4237", "label_index": [1, 1, 1, 1, 2], "label_confidence": [0.9734, 0.9928, 0.6906, 0.9893, 0.9831], "label_score": [[0.0023, 0.9734, 0.0243], [0.002, 0.9928, 0.0052], [0.0057, 0.6906, 0.3037], [0.0015, 0.9893, 0.0092], [0.0003, 0.0165, 0.9831]]}
{"docno": "en.noclean.c4-train.02089-of-07168.122043", "label_index": [1, 2, 1, 1, 1, 1, 1], "label_confidence": [0.9975, 0.528, 0.9514, 0.9952, 0.8734, 0.985, 0.8501], "label_score": [[0.0005, 0.9975, 0.0019], [0.0013, 0.4707, 0.528], [0.0039, 0.9514, 0.0447], [0.0004, 0.9952, 0.0044], [0.0017, 0.8734, 0.1249], [0.0006, 0.985, 0.0144], [0.019, 0.8501, 0.1309]]}
{"docno": "en.noclean.c4-train.02797-of-07168.67183", "label_index": [1, 1, 1, 1], "label_confidence": [0.9964, 0.9889, 0.9877, 0.9879], "label_score": [[0.0004, 0.9964, 0.0031], [0.0011, 0.9889, 0.0101], [0.0004, 0.9877, 0.0119], [0.0018, 0.9879, 0.0103]]}
{"docno": "en.noclean.c4-train.04951-of-07168.146335", "label_index": [1, 1, 1, 1], "label_confidence": [0.9978, 0.9979, 0.9989, 0.9944], "label_score": [[0.0007, 0.9978, 0.0015], [0.0005, 0.9979, 0.0016], [0.0002, 0.9989, 0.0009], [0.0005, 0.9944, 0.0051]]}
{"docno": "en.noclean.c4-train.00409-of-07168.49828", "label_index": [1, 1, 1, 1, 1, 1, 1, 1, 1], "label_confidence": [0.8681, 0.998, 0.995, 0.9977, 0.9948, 0.9849, 0.9953, 0.9986, 0.9973], "label_score": [[0.0016, 0.8681, 0.1304], [0.0002, 0.998, 0.0018], [0.0012, 0.995, 0.0038], [0.0008, 0.9977, 0.0015], [0.0009, 0.9948, 0.0043], [0.0031, 0.9849, 0.012], [0.0007, 0.9953, 0.0039], [0.0003, 0.9986, 0.0011], [0.0009, 0.9973, 0.0018]]}
{"docno": "en.noclean.c4-train.01080-of-07168.8311", "label_index": [2, 2, 1, 1, 1, 1, 1, 1, 1], "label_confidence": [0.974, 0.9935, 0.9959, 0.996, 0.9945, 0.9971, 0.998, 0.7398, 0.9573], "label_score": [[0.0003, 0.0257, 0.974], [0.0002, 0.0063, 0.9935], [0.0008, 0.9959, 0.0034], [0.0005, 0.996, 0.0035], [0.0003, 0.9945, 0.0053], [0.0009, 0.9971, 0.0021], [0.0005, 0.998, 0.0015], [0.003, 0.7398, 0.2572], [0.0005, 0.9573, 0.0422]]}
{"docno": "en.noclean.c4-train.03199-of-07168.15651", "label_index": [2, 1, 1, 1, 1, 1, 2, 2, 2, 2, 2, 2, 2, 1], "label_confidence": [0.9, 0.9983, 0.9526, 0.888, 0.6725, 0.8474, 0.8802, 0.9761, 0.656, 0.9433, 0.5435, 0.9678, 0.9977, 0.9714], "label_score": [[0.0006, 0.0994, 0.9], [0.0003, 0.9983, 0.0014], [0.0008, 0.9526, 0.0466], [0.0016, 0.888, 0.1104], [0.0011, 0.6725, 0.3264], [0.0019, 0.8474, 0.1507], [0.0003, 0.1195, 0.8802], [0.0001, 0.0239, 0.9761], [0.0003, 0.3437, 0.656], [0.0002, 0.0565, 0.9433], [0.0005, 0.456, 0.5435], [0.0001, 0.0321, 0.9678], [0.0001, 0.0022, 0.9977], [0.004, 0.9714, 0.0247]]}
{"docno": "en.noclean.c4-train.06597-of-07168.521", "label_index": [1, 1, 1, 1, 1, 1, 2], "label_confidence": [0.9909, 0.9945, 0.9256, 0.9676, 0.998, 0.9907, 0.9785], "label_score": [[0.0003, 0.9909, 0.0087], [0.0007, 0.9945, 0.0049], [0.0022, 0.9256, 0.0722], [0.001, 0.9676, 0.0314], [0.0005, 0.998, 0.0015], [0.001, 0.9907, 0.0083], [0.0002, 0.0213, 0.9785]]}
{"docno": "en.noclean.c4-train.01540-of-07168.63342", "label_index": [1, 1, 1, 2, 1], "label_confidence": [0.998, 0.9978, 0.9968, 0.9956, 0.9082], "label_score": [[0.0007, 0.998, 0.0014], [0.0007, 0.9978, 0.0016], [0.0005, 0.9968, 0.0027], [0.0001, 0.0043, 0.9956], [0.0102, 0.9082, 0.0816]]}
{"docno": "en.noclean.c4-train.03748-of-07168.42700", "label_index": [2, 2, 2, 1, 1, 1, 1, 1, 1, 1, 1, 1, 1, 2, 2, 1], "label_confidence": [0.9934, 0.96, 0.9876, 0.9833, 0.9976, 0.9984, 0.9893, 0.9972, 0.9988, 0.9987, 0.9962, 0.9776, 0.9764, 0.9933, 0.999, 0.9609], "label_score": [[0.0003, 0.0063, 0.9934], [0.0004, 0.0395, 0.96], [0.0003, 0.0121, 0.9876], [0.0015, 0.9833, 0.0152], [0.0012, 0.9976, 0.0012], [0.0007, 0.9984, 0.001], [0.0011, 0.9893, 0.0095], [0.0009, 0.9972, 0.0019], [0.0005, 0.9988, 0.0007], [0.0004, 0.9987, 0.0009], [0.0002, 0.9962, 0.0036], [0.0035, 0.9776, 0.0189], [0.0012, 0.9764, 0.0224], [0.0003, 0.0064, 0.9933], [0.0001, 0.0009, 0.999], [0.0088, 0.9609, 0.0303]]}
{"docno": "en.noclean.c4-train.00954-of-07168.92455", "label_index": [1, 1, 1, 1, 1, 1, 1, 1, 2, 1, 2, 2], "label_confidence": [0.9871, 0.9933, 0.992, 0.9579, 0.9911, 0.9707, 0.9896, 0.9977, 0.9844, 0.9938, 0.8765, 0.9683], "label_score": [[0.001, 0.9871, 0.0119], [0.0013, 0.9933, 0.0055], [0.0007, 0.992, 0.0073], [0.0012, 0.9579, 0.0409], [0.0014, 0.9911, 0.0075], [0.0015, 0.9707, 0.0277], [0.0015, 0.9896, 0.0089], [0.0005, 0.9977, 0.0019], [0.0012, 0.0145, 0.9844], [0.0016, 0.9938, 0.0047], [0.0004, 0.1231, 0.8765], [0.0003, 0.0314, 0.9683]]}
{"docno": "en.noclean.c4-train.04439-of-07168.50731", "label_index": [1, 1, 1, 1], "label_confidence": [0.9992, 0.9987, 0.9969, 0.9978], "label_score": [[0.0002, 0.9992, 0.0006], [0.0003, 0.9987, 0.0009], [0.0005, 0.9969, 0.0026], [0.0008, 0.9978, 0.0014]]}
{"docno": "en.noclean.c4-train.04028-of-07168.42270", "label_index": [1, 1, 1, 1, 1, 1, 1, 2, 1, 2, 1], "label_confidence": [0.9964, 0.9236, 0.9491, 0.9969, 0.993, 0.9816, 0.9917, 0.5114, 0.9573, 0.9056, 0.9978], "label_score": [[0.0004, 0.9964, 0.0032], [0.0005, 0.9236, 0.0759], [0.0012, 0.9491, 0.0497], [0.0011, 0.9969, 0.0019], [0.0011, 0.993, 0.0058], [0.0008, 0.9816, 0.0176], [0.0007, 0.9917, 0.0075], [0.0005, 0.4881, 0.5114], [0.0013, 0.9573, 0.0414], [0.0005, 0.0939, 0.9056], [0.0003, 0.9978, 0.0019]]}
{"docno": "en.noclean.c4-train.02665-of-07168.4087", "label_index": [1, 1, 1, 2, 2, 2, 2, 2, 2, 2, 2, 2, 2, 2, 2, 2, 2, 2, 2, 2, 1, 1, 1, 1], "label_confidence": [0.9968, 0.9988, 0.996, 0.9619, 0.9887, 0.9979, 0.9905, 0.9916, 0.9898, 0.993, 0.9969, 0.9988, 0.9951, 0.9683, 0.9937, 0.9971, 0.9953, 0.9899, 0.9981, 0.9928, 0.9872, 0.5606, 0.9655, 0.9696], "label_score": [[0.0006, 0.9968, 0.0026], [0.0003, 0.9988, 0.0009], [0.0009, 0.996, 0.0031], [0.0004, 0.0377, 0.9619], [0.0008, 0.0105, 0.9887], [0.0001, 0.0021, 0.9979], [0.0002, 0.0093, 0.9905], [0.0004, 0.008, 0.9916], [0.0004, 0.0098, 0.9898], [0.0003, 0.0067, 0.993], [0.0001, 0.003, 0.9969], [0.0001, 0.0011, 0.9988], [0.0001, 0.0048, 0.9951], [0.0004, 0.0314, 0.9683], [0.0002, 0.0061, 0.9937], [0.0001, 0.0028, 0.9971], [0.0002, 0.0044, 0.9953], [0.0002, 0.0099, 0.9899], [0.0001, 0.0018, 0.9981], [0.0002, 0.0071, 0.9928], [0.0027, 0.9872, 0.0101], [0.008, 0.5606, 0.4314], [0.002, 0.9655, 0.0325], [0.0057, 0.9696, 0.0247]]}
{"docno": "en.noclean.c4-train.02282-of-07168.27796", "label_index": [2, 1, 1, 1, 1, 1, 1], "label_confidence": [0.994, 0.9985, 0.998, 0.9994, 0.9854, 0.9933, 0.8739], "label_score": [[0.0002, 0.0058, 0.994], [0.0004, 0.9985, 0.0011], [0.0005, 0.998, 0.0015], [0.0003, 0.9994, 0.0003], [0.0007, 0.9854, 0.0139], [0.0009, 0.9933, 0.0059], [0.0052, 0.8739, 0.1208]]}
{"docno": "en.noclean.c4-train.00674-of-07168.103539", "label_index": [1], "label_confidence": [0.9922], "label_score": [[0.001, 0.9922, 0.0069]]}
{"docno": "en.noclean.c4-train.06040-of-07168.30427", "label_index": [1, 2, 1, 1, 1, 1, 1, 1, 1, 1, 1, 1, 1, 1, 1, 1, 1], "label_confidence": [0.9598, 0.9931, 0.9864, 0.9982, 0.998, 0.9959, 0.9976, 0.9989, 0.9982, 0.9859, 0.9629, 0.9375, 0.9789, 0.9807, 0.9854, 0.9965, 0.9881], "label_score": [[0.0065, 0.9598, 0.0337], [0.0005, 0.0064, 0.9931], [0.0005, 0.9864, 0.0132], [0.0004, 0.9982, 0.0013], [0.0005, 0.998, 0.0015], [0.0005, 0.9959, 0.0036], [0.001, 0.9976, 0.0015], [0.0003, 0.9989, 0.0008], [0.0011, 0.9982, 0.0007], [0.0009, 0.9859, 0.0131], [0.0009, 0.9629, 0.0363], [0.0032, 0.9375, 0.0592], [0.0004, 0.9789, 0.0206], [0.0015, 0.9807, 0.0178], [0.0013, 0.9854, 0.0133], [0.0004, 0.9965, 0.003], [0.0012, 0.9881, 0.0107]]}
{"docno": "en.noclean.c4-train.05116-of-07168.30102", "label_index": [1, 1, 1, 1, 1, 1, 1], "label_confidence": [0.992, 0.9918, 0.9322, 0.9607, 0.7849, 0.9957, 0.9566], "label_score": [[0.0008, 0.992, 0.0072], [0.002, 0.9918, 0.0062], [0.0026, 0.9322, 0.0652], [0.0014, 0.9607, 0.0379], [0.0005, 0.7849, 0.2146], [0.0003, 0.9957, 0.0039], [0.0037, 0.9566, 0.0398]]}
{"docno": "en.noclean.c4-train.02447-of-07168.67375", "label_index": [1, 1, 1, 1, 2, 1, 1, 2], "label_confidence": [0.9518, 0.9923, 0.9963, 0.9879, 0.7744, 0.8244, 0.9965, 0.5497], "label_score": [[0.0003, 0.9518, 0.0479], [0.0006, 0.9923, 0.0071], [0.0008, 0.9963, 0.0029], [0.0013, 0.9879, 0.0108], [0.0017, 0.224, 0.7744], [0.0005, 0.8244, 0.1751], [0.0005, 0.9965, 0.0029], [0.0031, 0.4471, 0.5497]]}
{"docno": "en.noclean.c4-train.03286-of-07168.133092", "label_index": [1, 1, 1, 1, 2, 1], "label_confidence": [0.9933, 0.9961, 0.998, 0.9974, 0.9977, 0.9714], "label_score": [[0.0007, 0.9933, 0.006], [0.0007, 0.9961, 0.0032], [0.0006, 0.998, 0.0014], [0.0005, 0.9974, 0.0021], [0.0001, 0.0022, 0.9977], [0.004, 0.9714, 0.0247]]}
{"docno": "en.noclean.c4-train.05571-of-07168.116949", "label_index": [1, 1], "label_confidence": [0.9985, 0.9923], "label_score": [[0.0005, 0.9985, 0.001], [0.0012, 0.9923, 0.0065]]}
{"docno": "en.noclean.c4-train.01592-of-07168.96718", "label_index": [1, 1, 1, 1, 1, 1, 1, 1, 1, 1, 2], "label_confidence": [0.9831, 0.9933, 0.9778, 0.9972, 0.9961, 0.9714, 0.973, 0.994, 0.9935, 0.9821, 0.9831], "label_score": [[0.0016, 0.9831, 0.0152], [0.0014, 0.9933, 0.0053], [0.0007, 0.9778, 0.0215], [0.0006, 0.9972, 0.0022], [0.0008, 0.9961, 0.0031], [0.0011, 0.9714, 0.0276], [0.0023, 0.973, 0.0247], [0.0009, 0.994, 0.0051], [0.0007, 0.9935, 0.0059], [0.0025, 0.9821, 0.0154], [0.0003, 0.0165, 0.9831]]}
{"docno": "en.noclean.c4-train.04979-of-07168.109069", "label_index": [1, 1, 2, 1, 1, 1, 1, 1, 1, 1, 1, 1, 1, 1, 1, 1, 1, 1, 1, 1, 1, 1, 2, 1, 1], "label_confidence": [0.9978, 0.9914, 0.9302, 0.9651, 0.9944, 0.9958, 0.9947, 0.992, 0.9968, 0.9936, 0.9907, 0.9383, 0.9575, 0.9967, 0.9922, 0.9974, 0.993, 0.9966, 0.9974, 0.9485, 0.9893, 0.9747, 0.997, 0.9987, 0.9983], "label_score": [[0.0008, 0.9978, 0.0014], [0.0007, 0.9914, 0.0079], [0.001, 0.0688, 0.9302], [0.0019, 0.9651, 0.0329], [0.0008, 0.9944, 0.0048], [0.001, 0.9958, 0.0032], [0.001, 0.9947, 0.0043], [0.0004, 0.992, 0.0076], [0.0002, 0.9968, 0.003], [0.0004, 0.9936, 0.006], [0.0009, 0.9907, 0.0084], [0.0032, 0.9383, 0.0585], [0.0027, 0.9575, 0.0398], [0.001, 0.9967, 0.0023], [0.0015, 0.9922, 0.0063], [0.0006, 0.9974, 0.0021], [0.0005, 0.993, 0.0065], [0.001, 0.9966, 0.0023], [0.0007, 0.9974, 0.0019], [0.0005, 0.9485, 0.0509], [0.0008, 0.9893, 0.0098], [0.0002, 0.9747, 0.0251], [0.0002, 0.0029, 0.997], [0.0003, 0.9987, 0.001], [0.0005, 0.9983, 0.0013]]}
{"docno": "en.noclean.c4-train.04208-of-07168.117412", "label_index": [1, 1, 1, 1, 1, 1, 1, 1, 2, 1, 1, 2], "label_confidence": [0.9867, 0.9859, 0.9835, 0.9947, 0.9923, 0.9974, 0.9941, 0.9879, 0.7744, 0.8244, 0.9965, 0.5497], "label_score": [[0.0007, 0.9867, 0.0126], [0.0013, 0.9859, 0.0128], [0.0006, 0.9835, 0.0159], [0.0011, 0.9947, 0.0042], [0.0006, 0.9923, 0.0071], [0.0007, 0.9974, 0.0018], [0.0008, 0.9941, 0.0051], [0.0013, 0.9879, 0.0108], [0.0017, 0.224, 0.7744], [0.0005, 0.8244, 0.1751], [0.0005, 0.9965, 0.0029], [0.0031, 0.4471, 0.5497]]}
{"docno": "en.noclean.c4-train.00548-of-07168.131689", "label_index": [1, 1, 1, 1, 1, 1, 1, 1, 1, 1, 1, 1, 1, 1, 1, 2, 2, 2, 1], "label_confidence": [0.9848, 0.998, 0.9537, 0.8562, 0.5386, 0.9918, 0.9945, 0.9897, 0.9885, 0.998, 0.9912, 0.9003, 0.9974, 0.9905, 0.9932, 0.6071, 0.8051, 0.9308, 0.9831], "label_score": [[0.0007, 0.9848, 0.0145], [0.0005, 0.998, 0.0015], [0.0023, 0.9537, 0.044], [0.0015, 0.8562, 0.1423], [0.0024, 0.5386, 0.459], [0.0004, 0.9918, 0.0078], [0.0009, 0.9945, 0.0046], [0.0014, 0.9897, 0.0089], [0.0002, 0.9885, 0.0113], [0.0002, 0.998, 0.0018], [0.0003, 0.9912, 0.0085], [0.0003, 0.9003, 0.0994], [0.0003, 0.9974, 0.0024], [0.0016, 0.9905, 0.0079], [0.0015, 0.9932, 0.0053], [0.0026, 0.3902, 0.6071], [0.0005, 0.1943, 0.8051], [0.0007, 0.0685, 0.9308], [0.0029, 0.9831, 0.0141]]}
{"docno": "en.noclean.c4-train.04581-of-07168.48367", "label_index": [1, 1, 1], "label_confidence": [0.996, 0.9539, 0.9978], "label_score": [[0.0014, 0.996, 0.0026], [0.0009, 0.9539, 0.0452], [0.0008, 0.9978, 0.0014]]}
{"docno": "en.noclean.c4-train.02667-of-07168.103958", "label_index": [2, 1, 1, 1, 1, 1, 1, 1, 1, 2, 2, 1], "label_confidence": [0.9181, 0.9934, 0.9972, 0.9978, 0.9936, 0.9869, 0.9794, 0.9686, 0.9991, 0.9907, 0.974, 0.9939], "label_score": [[0.0003, 0.0815, 0.9181], [0.0011, 0.9934, 0.0055], [0.0004, 0.9972, 0.0024], [0.0001, 0.9978, 0.0021], [0.0003, 0.9936, 0.006], [0.0011, 0.9869, 0.012], [0.0011, 0.9794, 0.0195], [0.0027, 0.9686, 0.0287], [0.0001, 0.9991, 0.0008], [0.0001, 0.0092, 0.9907], [0.0004, 0.0257, 0.974], [0.0009, 0.9939, 0.0052]]}
{"docno": "en.noclean.c4-train.00839-of-07168.83753", "label_index": [1, 1, 1, 1, 1, 1, 1, 1, 1], "label_confidence": [0.9782, 0.9955, 0.9897, 0.9933, 0.993, 0.8575, 0.9931, 0.9956, 0.8299], "label_score": [[0.0022, 0.9782, 0.0196], [0.0015, 0.9955, 0.003], [0.0011, 0.9897, 0.0092], [0.001, 0.9933, 0.0057], [0.0011, 0.993, 0.0059], [0.003, 0.8575, 0.1395], [0.0008, 0.9931, 0.0061], [0.0012, 0.9956, 0.0032], [0.0014, 0.8299, 0.1687]]}
{"docno": "en.noclean.c4-train.03981-of-07168.112362", "label_index": [1, 1, 1, 1, 1, 1], "label_confidence": [0.9938, 0.9871, 0.9965, 0.9936, 0.9926, 0.8553], "label_score": [[0.0009, 0.9938, 0.0053], [0.0016, 0.9871, 0.0113], [0.0008, 0.9965, 0.0027], [0.002, 0.9936, 0.0044], [0.0012, 0.9926, 0.0062], [0.0018, 0.8553, 0.1429]]}
{"docno": "en.noclean.c4-train.04893-of-07168.97644", "label_index": [2, 1, 1, 1, 1, 1, 1, 2, 1, 2, 1], "label_confidence": [0.9908, 0.9949, 0.7947, 0.9952, 0.9982, 0.9543, 0.9909, 0.5114, 0.9573, 0.9056, 0.9978], "label_score": [[0.0001, 0.0091, 0.9908], [0.0008, 0.9949, 0.0043], [0.0002, 0.7947, 0.2051], [0.0007, 0.9952, 0.0041], [0.0003, 0.9982, 0.0014], [0.0008, 0.9543, 0.045], [0.0004, 0.9909, 0.0087], [0.0005, 0.4881, 0.5114], [0.0013, 0.9573, 0.0414], [0.0005, 0.0939, 0.9056], [0.0003, 0.9978, 0.0019]]}
{"docno": "en.noclean.c4-train.01899-of-07168.39660", "label_index": [1], "label_confidence": [0.9982], "label_score": [[0.0003, 0.9982, 0.0015]]}
{"docno": "en.noclean.c4-train.06184-of-07168.14253", "label_index": [2, 1, 1, 1, 2, 1], "label_confidence": [0.9503, 0.9944, 0.9955, 0.8977, 0.9985, 0.9846], "label_score": [[0.0002, 0.0496, 0.9503], [0.0019, 0.9944, 0.0037], [0.0008, 0.9955, 0.0037], [0.0006, 0.8977, 0.1017], [0.0001, 0.0014, 0.9985], [0.0032, 0.9846, 0.0123]]}
{"docno": "en.noclean.c4-train.03805-of-07168.51370", "label_index": [1, 1, 1, 1, 1, 1, 1, 1], "label_confidence": [0.9688, 0.9961, 0.9964, 0.9716, 0.9607, 0.7849, 0.9957, 0.9566], "label_score": [[0.0011, 0.9688, 0.0301], [0.0005, 0.9961, 0.0034], [0.0008, 0.9964, 0.0027], [0.0015, 0.9716, 0.0269], [0.0014, 0.9607, 0.0379], [0.0005, 0.7849, 0.2146], [0.0003, 0.9957, 0.0039], [0.0037, 0.9566, 0.0398]]}
{"docno": "en.noclean.c4-train.00981-of-07168.64476", "label_index": [1, 1, 1], "label_confidence": [0.994, 0.9983, 0.976], "label_score": [[0.0009, 0.994, 0.0051], [0.0004, 0.9983, 0.0013], [0.0032, 0.976, 0.0208]]}
{"docno": "en.noclean.c4-train.02956-of-07168.25466", "label_index": [1, 1, 1, 1, 1, 1, 1, 1, 1, 1, 1, 1, 2, 1, 1, 1, 2, 1, 1, 2, 1, 1, 1, 1, 2, 1, 2, 2, 1, 2, 1, 1, 2, 1, 1, 1, 1, 2, 2, 1, 1, 1, 2, 1, 2, 1, 2, 1, 1, 2, 1, 1, 1, 1, 2, 1, 1, 1, 2, 1, 1, 2, 2, 2], "label_confidence": [0.9861, 0.7167, 0.8786, 0.9223, 0.7962, 0.9031, 0.9896, 0.9922, 0.8448, 0.8682, 0.9523, 0.9721, 0.8787, 0.9244, 0.9936, 0.9796, 0.981, 0.769, 0.6868, 0.9626, 0.7895, 0.9727, 0.9974, 0.8363, 0.9819, 0.9609, 0.9984, 0.5579, 0.9064, 0.9778, 0.9375, 0.9918, 0.8677, 0.9836, 0.9421, 0.9286, 0.8665, 0.9937, 0.9611, 0.7298, 0.9905, 0.9471, 0.955, 0.915, 0.6725, 0.9737, 0.9921, 0.9537, 0.9542, 0.9993, 0.9958, 0.8747, 0.992, 0.997, 0.941, 0.9854, 0.9981, 0.998, 0.9919, 0.9511, 0.9986, 0.977, 0.977, 0.9823], "label_score": [[0.0007, 0.9861, 0.0131], [0.0041, 0.7167, 0.2792], [0.0032, 0.8786, 0.1183], [0.004, 0.9223, 0.0737], [0.0277, 0.7962, 0.1761], [0.013, 0.9031, 0.0839], [0.0013, 0.9896, 0.0091], [0.0008, 0.9922, 0.007], [0.0015, 0.8448, 0.1538], [0.0046, 0.8682, 0.1272], [0.0014, 0.9523, 0.0463], [0.0005, 0.9721, 0.0275], [0.0052, 0.116, 0.8787], [0.0026, 0.9244, 0.073], [0.0015, 0.9936, 0.0049], [0.0005, 0.9796, 0.02], [0.0008, 0.0182, 0.981], [0.0038, 0.769, 0.2272], [0.0044, 0.6868, 0.3088], [0.0017, 0.0357, 0.9626], [0.0013, 0.7895, 0.2092], [0.0008, 0.9727, 0.0265], [0.0002, 0.9974, 0.0024], [0.0023, 0.8363, 0.1614], [0.0007, 0.0174, 0.9819], [0.0003, 0.9609, 0.0388], [0.0003, 0.0014, 0.9984], [0.0027, 0.4394, 0.5579], [0.0009, 0.9064, 0.0928], [0.0033, 0.0189, 0.9778], [0.0012, 0.9375, 0.0613], [0.0006, 0.9918, 0.0076], [0.0045, 0.1277, 0.8677], [0.0008, 0.9836, 0.0156], [0.0011, 0.9421, 0.0569], [0.0026, 0.9286, 0.0688], [0.0031, 0.8665, 0.1304], [0.0003, 0.0059, 0.9937], [0.0007, 0.0382, 0.9611], [0.0031, 0.7298, 0.2671], [0.0019, 0.9905, 0.0076], [0.0019, 0.9471, 0.051], [0.0013, 0.0437, 0.955], [0.0011, 0.915, 0.0839], [0.001, 0.3265, 0.6725], [0.0024, 0.9737, 0.024], [0.0004, 0.0075, 0.9921], [0.0014, 0.9537, 0.0449], [0.0009, 0.9542, 0.0449], [0.0001, 0.0007, 0.9993], [0.0006, 0.9958, 0.0037], [0.0069, 0.8747, 0.1184], [0.0008, 0.992, 0.0072], [0.0004, 0.997, 0.0026], [0.0026, 0.0563, 0.941], [0.0014, 0.9854, 0.0131], [0.0002, 0.9981, 0.0017], [0.0002, 0.998, 0.0018], [0.0004, 0.0077, 0.9919], [0.0024, 0.9511, 0.0465], [0.0007, 0.9986, 0.0007], [0.0007, 0.0223, 0.977], [0.0007, 0.0223, 0.977], [0.0002, 0.0175, 0.9823]]}
{"docno": "en.noclean.c4-train.02426-of-07168.4846", "label_index": [1, 1, 1, 1, 1, 1, 1, 1, 1, 1, 2, 1], "label_confidence": [0.9814, 0.992, 0.9945, 0.996, 0.9986, 0.7619, 0.9832, 0.9975, 0.9701, 0.9055, 0.9634, 0.9971], "label_score": [[0.0017, 0.9814, 0.0168], [0.0008, 0.992, 0.0072], [0.0017, 0.9945, 0.0037], [0.0001, 0.996, 0.0039], [0.0003, 0.9986, 0.0011], [0.0004, 0.7619, 0.2377], [0.001, 0.9832, 0.0158], [0.0004, 0.9975, 0.0021], [0.0011, 0.9701, 0.0288], [0.0015, 0.9055, 0.0929], [0.0004, 0.0362, 0.9634], [0.0003, 0.9971, 0.0026]]}
{"docno": "en.noclean.c4-train.02989-of-07168.108382", "label_index": [1], "label_confidence": [0.917], "label_score": [[0.0039, 0.917, 0.0792]]}
{"docno": "en.noclean.c4-train.05664-of-07168.62656", "label_index": [1, 1, 1, 1], "label_confidence": [0.9965, 0.9922, 0.9968, 0.9889], "label_score": [[0.0015, 0.9965, 0.002], [0.0006, 0.9922, 0.0071], [0.0006, 0.9968, 0.0026], [0.0019, 0.9889, 0.0093]]}
{"docno": "en.noclean.c4-train.02212-of-07168.99953", "label_index": [1, 1, 2], "label_confidence": [0.9984, 0.9986, 0.9913], "label_score": [[0.0003, 0.9984, 0.0013], [0.0005, 0.9986, 0.0009], [0.0002, 0.0086, 0.9913]]}
{"docno": "en.noclean.c4-train.04257-of-07168.131441", "label_index": [1, 2, 2, 2], "label_confidence": [0.9981, 0.9703, 0.9794, 0.9933], "label_score": [[0.0006, 0.9981, 0.0013], [0.0003, 0.0293, 0.9703], [0.0007, 0.02, 0.9794], [0.0002, 0.0066, 0.9933]]}
{"docno": "en.noclean.c4-train.00968-of-07168.15564", "label_index": [1, 1, 1, 2, 2], "label_confidence": [0.9986, 0.9989, 0.9964, 0.9297, 0.9341], "label_score": [[0.0004, 0.9986, 0.001], [0.0002, 0.9989, 0.0009], [0.0005, 0.9964, 0.0031], [0.0006, 0.0696, 0.9297], [0.0013, 0.0646, 0.9341]]}
{"docno": "en.noclean.c4-train.05447-of-07168.144245", "label_index": [2, 2, 2, 1, 2, 1, 2, 1, 1, 1, 1, 1, 1, 2, 1, 2, 1, 2, 1, 1, 1, 1, 2, 2, 1, 1, 1, 1, 1, 1, 2, 1, 2, 1, 1, 1, 2, 1, 1, 1, 1, 1, 1, 1, 1, 1, 1, 1, 1, 2, 1, 2, 1, 1, 1, 1, 1, 1, 1, 1, 1, 1, 1, 2, 1, 1, 1, 2, 1, 2, 2], "label_confidence": [0.7861, 0.9902, 0.9473, 0.6939, 0.9482, 0.9871, 0.8998, 0.9012, 0.9815, 0.9681, 0.9469, 0.8599, 0.9969, 0.9643, 0.8387, 0.999, 0.9602, 0.5254, 0.9652, 0.8266, 0.9916, 0.5492, 0.5549, 0.8264, 0.9029, 0.9839, 0.5919, 0.9962, 0.8053, 0.8792, 0.8278, 0.9946, 0.6342, 0.5718, 0.8647, 0.9878, 0.5827, 0.9961, 0.8659, 0.9888, 0.8418, 0.8749, 0.8211, 0.6418, 0.5679, 0.7521, 0.9653, 0.5007, 0.9885, 0.5735, 0.9923, 0.9816, 0.9885, 0.9591, 0.9377, 0.9499, 0.9764, 0.9933, 0.9934, 0.9498, 0.9736, 0.9987, 0.9969, 0.9758, 0.7615, 0.997, 0.9888, 0.9741, 0.9385, 0.8902, 0.6311], "label_score": [[0.0016, 0.2123, 0.7861], [0.0001, 0.0098, 0.9902], [0.0006, 0.0521, 0.9473], [0.0017, 0.6939, 0.3043], [0.0001, 0.0517, 0.9482], [0.0007, 0.9871, 0.0123], [0.0003, 0.0999, 0.8998], [0.0037, 0.9012, 0.0951], [0.0007, 0.9815, 0.0179], [0.002, 0.9681, 0.0299], [0.0026, 0.9469, 0.0506], [0.0048, 0.8599, 0.1353], [0.0006, 0.9969, 0.0026], [0.002, 0.0337, 0.9643], [0.0023, 0.8387, 0.159], [0.0002, 0.0009, 0.999], [0.0027, 0.9602, 0.0372], [0.0039, 0.4708, 0.5254], [0.0014, 0.9652, 0.0333], [0.0031, 0.8266, 0.1704], [0.0004, 0.9916, 0.008], [0.0012, 0.5492, 0.4497], [0.0013, 0.4438, 0.5549], [0.0009, 0.1727, 0.8264], [0.0265, 0.9029, 0.0706], [0.0007, 0.9839, 0.0154], [0.0015, 0.5919, 0.4065], [0.0004, 0.9962, 0.0035], [0.0023, 0.8053, 0.1924], [0.0022, 0.8792, 0.1186], [0.0033, 0.169, 0.8278], [0.0003, 0.9946, 0.0051], [0.0005, 0.3652, 0.6342], [0.0032, 0.5718, 0.425], [0.0024, 0.8647, 0.1329], [0.0013, 0.9878, 0.0109], [0.0017, 0.4155, 0.5827], [0.0008, 0.9961, 0.0031], [0.0009, 0.8659, 0.1332], [0.0005, 0.9888, 0.0107], [0.0026, 0.8418, 0.1557], [0.0045, 0.8749, 0.1205], [0.0014, 0.8211, 0.1775], [0.0046, 0.6418, 0.3537], [0.0015, 0.5679, 0.4306], [0.0025, 0.7521, 0.2454], [0.0034, 0.9653, 0.0313], [0.0039, 0.5007, 0.4954], [0.0008, 0.9885, 0.0107], [0.002, 0.4245, 0.5735], [0.0015, 0.9923, 0.0062], [0.0004, 0.018, 0.9816], [0.0006, 0.9885, 0.0109], [0.0009, 0.9591, 0.04], [0.0015, 0.9377, 0.0608], [0.0011, 0.9499, 0.049], [0.0018, 0.9764, 0.0218], [0.0004, 0.9933, 0.0063], [0.001, 0.9934, 0.0056], [0.0045, 0.9498, 0.0456], [0.0025, 0.9736, 0.0238], [0.0002, 0.9987, 0.0011], [0.0005, 0.9969, 0.0026], [0.0008, 0.0234, 0.9758], [0.0015, 0.7615, 0.237], [0.0008, 0.997, 0.0022], [0.0012, 0.9888, 0.01], [0.0005, 0.0254, 0.9741], [0.0013, 0.9385, 0.0602], [0.0005, 0.1093, 0.8902], [0.0008, 0.3681, 0.6311]]}
{"docno": "en.noclean.c4-train.04284-of-07168.74355", "label_index": [1, 2, 2], "label_confidence": [0.9981, 0.9356, 0.8901], "label_score": [[0.0005, 0.9981, 0.0014], [0.0008, 0.0636, 0.9356], [0.0002, 0.1097, 0.8901]]}
{"docno": "en.noclean.c4-train.05361-of-07168.13506", "label_index": [1, 1, 1, 1, 2, 2, 2, 2, 2, 2, 2, 2, 2, 2], "label_confidence": [0.9883, 0.9978, 0.9971, 0.9937, 0.9975, 0.9969, 0.9966, 0.9898, 0.9789, 0.9903, 0.9762, 0.9924, 0.9966, 0.9988], "label_score": [[0.0017, 0.9883, 0.0101], [0.0013, 0.9978, 0.0008], [0.0013, 0.9971, 0.0017], [0.001, 0.9937, 0.0053], [0.0002, 0.0023, 0.9975], [0.0001, 0.0029, 0.9969], [0.0001, 0.0032, 0.9966], [0.0004, 0.0097, 0.9898], [0.0004, 0.0207, 0.9789], [0.0009, 0.0088, 0.9903], [0.0005, 0.0233, 0.9762], [0.0003, 0.0073, 0.9924], [0.0002, 0.0032, 0.9966], [0.0, 0.0011, 0.9988]]}
{"docno": "en.noclean.c4-train.00900-of-07168.116609", "label_index": [2, 2, 1], "label_confidence": [0.9776, 0.9381, 0.7826], "label_score": [[0.0006, 0.0218, 0.9776], [0.0019, 0.06, 0.9381], [0.0172, 0.7826, 0.2001]]}
{"docno": "en.noclean.c4-train.06768-of-07168.32863", "label_index": [1, 1, 1, 1, 1, 1, 1, 1, 1, 2], "label_confidence": [0.9962, 0.9989, 0.9988, 0.9937, 0.9899, 0.9973, 0.993, 0.9982, 0.9968, 0.8238], "label_score": [[0.0008, 0.9962, 0.003], [0.0004, 0.9989, 0.0007], [0.0005, 0.9988, 0.0007], [0.0007, 0.9937, 0.0056], [0.0008, 0.9899, 0.0093], [0.0005, 0.9973, 0.0023], [0.0016, 0.993, 0.0054], [0.0004, 0.9982, 0.0014], [0.0006, 0.9968, 0.0026], [0.0006, 0.1756, 0.8238]]}
{"docno": "en.noclean.c4-train.02500-of-07168.129293", "label_index": [1, 1, 1, 1], "label_confidence": [0.998, 0.9987, 0.9883, 0.9978], "label_score": [[0.0005, 0.998, 0.0015], [0.0005, 0.9987, 0.0008], [0.0011, 0.9883, 0.0106], [0.0005, 0.9978, 0.0017]]}
{"docno": "en.noclean.c4-train.06650-of-07168.72544", "label_index": [1, 1, 1, 1, 1, 2, 2, 1, 1], "label_confidence": [0.9913, 0.9977, 0.9964, 0.9973, 0.9929, 0.9696, 0.9869, 0.9896, 0.98], "label_score": [[0.001, 0.9913, 0.0076], [0.0004, 0.9977, 0.0019], [0.0009, 0.9964, 0.0027], [0.0006, 0.9973, 0.0021], [0.0025, 0.9929, 0.0046], [0.0007, 0.0297, 0.9696], [0.0004, 0.0128, 0.9869], [0.0013, 0.9896, 0.009], [0.001, 0.98, 0.019]]}
{"docno": "en.noclean.c4-train.00217-of-07168.108781", "label_index": [1, 1, 1, 2, 1], "label_confidence": [0.9912, 0.9979, 0.9965, 0.9983, 0.9213], "label_score": [[0.0006, 0.9912, 0.0081], [0.0007, 0.9979, 0.0015], [0.0005, 0.9965, 0.003], [0.0001, 0.0016, 0.9983], [0.0094, 0.9213, 0.0693]]}
{"docno": "en.noclean.c4-train.01912-of-07168.127871", "label_index": [1, 1, 2], "label_confidence": [0.9978, 0.8951, 0.9939], "label_score": [[0.0005, 0.9978, 0.0017], [0.0005, 0.8951, 0.1044], [0.0001, 0.006, 0.9939]]}
{"docno": "en.noclean.c4-train.00988-of-07168.55842", "label_index": [1, 1, 1, 1, 1, 1, 1, 1, 1, 2, 2], "label_confidence": [0.9879, 0.9945, 0.9658, 0.9484, 0.9935, 0.929, 0.9904, 0.9885, 0.9668, 0.8766, 0.9825], "label_score": [[0.0006, 0.9879, 0.0116], [0.0013, 0.9945, 0.0042], [0.0009, 0.9658, 0.0332], [0.0007, 0.9484, 0.0508], [0.0007, 0.9935, 0.0057], [0.0007, 0.929, 0.0702], [0.0009, 0.9904, 0.0087], [0.0003, 0.9885, 0.0111], [0.0003, 0.9668, 0.0329], [0.0003, 0.1231, 0.8766], [0.0002, 0.0173, 0.9825]]}
{"docno": "en.noclean.c4-train.01885-of-07168.104235", "label_index": [1, 1, 2, 1, 1, 1, 1, 1, 1, 1, 1, 1, 1, 2, 2, 2, 1, 2], "label_confidence": [0.7997, 0.9981, 0.8017, 0.9833, 0.9583, 0.9946, 0.9979, 0.9991, 0.9908, 0.9541, 0.9262, 0.9542, 0.9781, 0.7464, 0.9572, 0.9058, 0.9519, 0.9929], "label_score": [[0.0042, 0.7997, 0.1961], [0.0009, 0.9981, 0.001], [0.0016, 0.1967, 0.8017], [0.002, 0.9833, 0.0147], [0.0026, 0.9583, 0.0391], [0.0011, 0.9946, 0.0043], [0.0005, 0.9979, 0.0016], [0.0003, 0.9991, 0.0006], [0.0004, 0.9908, 0.0088], [0.0014, 0.9541, 0.0446], [0.0011, 0.9262, 0.0727], [0.0027, 0.9542, 0.0431], [0.0017, 0.9781, 0.0202], [0.0006, 0.2529, 0.7464], [0.0009, 0.0419, 0.9572], [0.0015, 0.0927, 0.9058], [0.0021, 0.9519, 0.046], [0.0002, 0.0069, 0.9929]]}
{"docno": "en.noclean.c4-train.00471-of-07168.15328", "label_index": [1, 1, 2, 2], "label_confidence": [0.9982, 0.9387, 0.981, 0.9773], "label_score": [[0.0004, 0.9982, 0.0014], [0.0095, 0.9387, 0.0518], [0.0002, 0.0188, 0.981], [0.0002, 0.0225, 0.9773]]}
{"docno": "en.noclean.c4-train.00445-of-07168.41117", "label_index": [1, 1, 1], "label_confidence": [0.9856, 0.9969, 0.9889], "label_score": [[0.0001, 0.9856, 0.0143], [0.0008, 0.9969, 0.0023], [0.0019, 0.9889, 0.0093]]}
{"docno": "en.noclean.c4-train.06500-of-07168.9536", "label_index": [1, 1, 1], "label_confidence": [0.9856, 0.9969, 0.9889], "label_score": [[0.0001, 0.9856, 0.0143], [0.0008, 0.9969, 0.0023], [0.0019, 0.9889, 0.0093]]}
{"docno": "en.noclean.c4-train.02053-of-07168.25170", "label_index": [1, 1], "label_confidence": [0.9916, 0.9862], "label_score": [[0.0018, 0.9916, 0.0066], [0.0012, 0.9862, 0.0126]]}
{"docno": "en.noclean.c4-train.03678-of-07168.35469", "label_index": [1, 1], "label_confidence": [0.9916, 0.9862], "label_score": [[0.0018, 0.9916, 0.0066], [0.0012, 0.9862, 0.0126]]}
{"docno": "en.noclean.c4-train.00031-of-07168.115411", "label_index": [1, 1, 1, 2], "label_confidence": [0.9979, 0.9236, 0.9963, 0.8722], "label_score": [[0.0005, 0.9979, 0.0015], [0.0324, 0.9236, 0.044], [0.001, 0.9963, 0.0026], [0.002, 0.1258, 0.8722]]}
{"docno": "en.noclean.c4-train.04175-of-07168.36641", "label_index": [2, 1, 1, 1, 1, 1, 1, 1], "label_confidence": [0.9913, 0.9972, 0.9968, 0.9887, 0.9021, 0.638, 0.8049, 0.9979], "label_score": [[0.0001, 0.0086, 0.9913], [0.0005, 0.9972, 0.0022], [0.0006, 0.9968, 0.0026], [0.0007, 0.9887, 0.0106], [0.0016, 0.9021, 0.0963], [0.0018, 0.638, 0.3602], [0.0006, 0.8049, 0.1945], [0.0003, 0.9979, 0.0017]]}
{"docno": "en.noclean.c4-train.07108-of-07168.107345", "label_index": [1, 1, 1], "label_confidence": [0.995, 0.9908, 0.9921], "label_score": [[0.0014, 0.995, 0.0037], [0.0006, 0.9908, 0.0086], [0.0023, 0.9921, 0.0055]]}
{"docno": "en.noclean.c4-train.01594-of-07168.105158", "label_index": [1, 1, 1, 1, 2], "label_confidence": [0.8465, 0.9773, 0.9974, 0.994, 0.9831], "label_score": [[0.0011, 0.8465, 0.1524], [0.0064, 0.9773, 0.0163], [0.0006, 0.9974, 0.002], [0.0013, 0.994, 0.0048], [0.0003, 0.0165, 0.9831]]}
{"docno": "en.noclean.c4-train.04331-of-07168.90917", "label_index": [1, 1, 2, 2, 2, 2, 1, 2], "label_confidence": [0.9911, 0.9933, 0.9767, 0.9417, 0.917, 0.5688, 0.9825, 0.9861], "label_score": [[0.0005, 0.9911, 0.0084], [0.0008, 0.9933, 0.006], [0.0003, 0.0229, 0.9767], [0.0031, 0.0552, 0.9417], [0.0015, 0.0815, 0.917], [0.0013, 0.4299, 0.5688], [0.0005, 0.9825, 0.017], [0.0004, 0.0135, 0.9861]]}
{"docno": "en.noclean.c4-train.01828-of-07168.55740", "label_index": [1], "label_confidence": [0.7724], "label_score": [[0.0123, 0.7724, 0.2153]]}
{"docno": "en.noclean.c4-train.03889-of-07168.83858", "label_index": [2, 2, 2, 1, 2], "label_confidence": [0.9635, 0.9645, 0.9824, 0.9975, 0.9961], "label_score": [[0.0003, 0.0361, 0.9635], [0.0006, 0.0348, 0.9645], [0.0005, 0.017, 0.9824], [0.0004, 0.9975, 0.0021], [0.0001, 0.0038, 0.9961]]}
{"docno": "en.noclean.c4-train.05470-of-07168.131361", "label_index": [1, 1, 1, 1, 1, 2], "label_confidence": [0.9808, 0.9986, 0.9961, 0.9879, 0.9758, 0.9224], "label_score": [[0.0007, 0.9808, 0.0184], [0.0006, 0.9986, 0.0008], [0.0006, 0.9961, 0.0033], [0.001, 0.9879, 0.0111], [0.001, 0.9758, 0.0232], [0.0006, 0.077, 0.9224]]}
{"docno": "en.noclean.c4-train.05519-of-07168.111185", "label_index": [1, 1], "label_confidence": [0.9976, 0.9966], "label_score": [[0.0004, 0.9976, 0.002], [0.0006, 0.9966, 0.0028]]}
{"docno": "en.noclean.c4-train.00793-of-07168.50616", "label_index": [1, 2], "label_confidence": [0.9896, 0.9816], "label_score": [[0.0021, 0.9896, 0.0083], [0.0002, 0.0182, 0.9816]]}
{"docno": "en.noclean.c4-train.03952-of-07168.53166", "label_index": [2, 1, 1, 2], "label_confidence": [0.9891, 0.9114, 0.9036, 0.7001], "label_score": [[0.0002, 0.0108, 0.9891], [0.0015, 0.9114, 0.0871], [0.0043, 0.9036, 0.0921], [0.0004, 0.2994, 0.7001]]}
{"docno": "en.noclean.c4-train.02512-of-07168.66198", "label_index": [2, 1, 1, 2], "label_confidence": [0.9892, 0.9965, 0.9896, 0.9951], "label_score": [[0.0001, 0.0107, 0.9892], [0.0003, 0.9965, 0.0031], [0.0004, 0.9896, 0.0099], [0.0009, 0.004, 0.9951]]}
{"docno": "en.noclean.c4-train.03324-of-07168.106685", "label_index": [1, 1, 1, 1, 1, 2, 1, 1, 2, 1, 2, 1, 2], "label_confidence": [0.9873, 0.9986, 0.9973, 0.9994, 0.9957, 0.9041, 0.9921, 0.9758, 0.9952, 0.9432, 0.7554, 0.992, 0.9976], "label_score": [[0.0005, 0.9873, 0.0122], [0.0003, 0.9986, 0.0011], [0.0009, 0.9973, 0.0018], [0.0002, 0.9994, 0.0004], [0.0003, 0.9957, 0.004], [0.0007, 0.0953, 0.9041], [0.0012, 0.9921, 0.0067], [0.001, 0.9758, 0.0232], [0.0002, 0.0046, 0.9952], [0.0043, 0.9432, 0.0526], [0.0007, 0.244, 0.7554], [0.0024, 0.992, 0.0056], [0.0001, 0.0023, 0.9976]]}
{"docno": "en.noclean.c4-train.02000-of-07168.67742", "label_index": [1], "label_confidence": [0.9964], "label_score": [[0.0012, 0.9964, 0.0024]]}
{"docno": "en.noclean.c4-train.02802-of-07168.87547", "label_index": [1, 1, 1, 1, 2, 1], "label_confidence": [0.9975, 0.9843, 0.9915, 0.9753, 0.9985, 0.9846], "label_score": [[0.0005, 0.9975, 0.002], [0.0028, 0.9843, 0.0129], [0.0008, 0.9915, 0.0078], [0.0011, 0.9753, 0.0236], [0.0001, 0.0014, 0.9985], [0.0032, 0.9846, 0.0123]]}
{"docno": "en.noclean.c4-train.01792-of-07168.54236", "label_index": [2], "label_confidence": [0.9711], "label_score": [[0.0006, 0.0283, 0.9711]]}
{"docno": "en.noclean.c4-train.02923-of-07168.70151", "label_index": [1], "label_confidence": [0.9983], "label_score": [[0.0002, 0.9983, 0.0014]]}
{"docno": "en.noclean.c4-train.00842-of-07168.147221", "label_index": [1], "label_confidence": [0.5619], "label_score": [[0.0023, 0.5619, 0.4359]]}
{"docno": "en.noclean.c4-train.02379-of-07168.5617", "label_index": [2, 1, 1, 1, 1, 1, 2], "label_confidence": [0.9503, 0.9978, 0.998, 0.9912, 0.9774, 0.9091, 0.666], "label_score": [[0.0002, 0.0494, 0.9503], [0.0009, 0.9978, 0.0013], [0.0008, 0.998, 0.0013], [0.0007, 0.9912, 0.0081], [0.0069, 0.9774, 0.0157], [0.0015, 0.9091, 0.0894], [0.0018, 0.3322, 0.666]]}
{"docno": "en.noclean.c4-train.03101-of-07168.110207", "label_index": [1, 1, 1, 2, 1, 1], "label_confidence": [0.9881, 0.9989, 0.9945, 0.6891, 0.9968, 0.9752], "label_score": [[0.001, 0.9881, 0.0109], [0.0003, 0.9989, 0.0008], [0.0004, 0.9945, 0.005], [0.0006, 0.3103, 0.6891], [0.0012, 0.9968, 0.0021], [0.0033, 0.9752, 0.0216]]}
{"docno": "en.noclean.c4-train.02906-of-07168.140393", "label_index": [1], "label_confidence": [0.9964], "label_score": [[0.0009, 0.9964, 0.0027]]}
{"docno": "en.noclean.c4-train.03104-of-07168.118822", "label_index": [1, 1, 1, 2], "label_confidence": [0.994, 0.9953, 0.995, 0.9924], "label_score": [[0.0013, 0.994, 0.0047], [0.0016, 0.9953, 0.0031], [0.001, 0.995, 0.0041], [0.0001, 0.0075, 0.9924]]}
{"docno": "en.noclean.c4-train.00430-of-07168.77465", "label_index": [1, 2], "label_confidence": [0.9958, 0.9146], "label_score": [[0.0007, 0.9958, 0.0035], [0.0005, 0.0849, 0.9146]]}
{"docno": "en.noclean.c4-train.04057-of-07168.50136", "label_index": [1], "label_confidence": [0.9896], "label_score": [[0.0009, 0.9896, 0.0095]]}
{"docno": "en.noclean.c4-train.03774-of-07168.57285", "label_index": [1, 1, 1, 1, 1, 1, 1], "label_confidence": [0.9935, 0.9948, 0.9716, 0.9607, 0.7849, 0.9957, 0.9566], "label_score": [[0.0009, 0.9935, 0.0056], [0.0008, 0.9948, 0.0044], [0.0015, 0.9716, 0.0269], [0.0014, 0.9607, 0.0379], [0.0005, 0.7849, 0.2146], [0.0003, 0.9957, 0.0039], [0.0037, 0.9566, 0.0398]]}
{"docno": "en.noclean.c4-train.02871-of-07168.79852", "label_index": [1, 2], "label_confidence": [0.997, 0.9594], "label_score": [[0.0004, 0.997, 0.0026], [0.0002, 0.0404, 0.9594]]}
{"docno": "en.noclean.c4-train.02904-of-07168.98051", "label_index": [1], "label_confidence": [0.9976], "label_score": [[0.0009, 0.9976, 0.0014]]}
{"docno": "en.noclean.c4-train.00755-of-07168.49099", "label_index": [1, 1, 2], "label_confidence": [0.9745, 0.9972, 0.8462], "label_score": [[0.0013, 0.9745, 0.0243], [0.0005, 0.9972, 0.0024], [0.0008, 0.1531, 0.8462]]}
{"docno": "en.noclean.c4-train.05809-of-07168.125702", "label_index": [1, 2], "label_confidence": [0.994, 0.6836], "label_score": [[0.0012, 0.994, 0.0049], [0.0057, 0.3107, 0.6836]]}
{"docno": "en.noclean.c4-train.04697-of-07168.36379", "label_index": [1, 1, 1, 2, 1, 1], "label_confidence": [0.9767, 0.996, 0.9985, 0.9738, 0.6971, 0.7567], "label_score": [[0.0007, 0.9767, 0.0225], [0.0007, 0.996, 0.0033], [0.0005, 0.9985, 0.0011], [0.0003, 0.026, 0.9738], [0.0027, 0.6971, 0.3002], [0.0355, 0.7567, 0.2077]]}
{"docno": "en.noclean.c4-train.05701-of-07168.115874", "label_index": [1, 1, 1, 2], "label_confidence": [0.9666, 0.9509, 0.9976, 0.9944], "label_score": [[0.0029, 0.9666, 0.0305], [0.0026, 0.9509, 0.0464], [0.0005, 0.9976, 0.0019], [0.0002, 0.0055, 0.9944]]}
{"docno": "en.noclean.c4-train.02008-of-07168.125168", "label_index": [1, 1, 1, 2, 2, 1], "label_confidence": [0.993, 0.9974, 0.998, 0.9903, 0.988, 0.7939], "label_score": [[0.0007, 0.993, 0.0063], [0.0004, 0.9974, 0.0022], [0.0004, 0.998, 0.0016], [0.0001, 0.0096, 0.9903], [0.0003, 0.0117, 0.988], [0.0034, 0.7939, 0.2028]]}
{"docno": "en.noclean.c4-train.02744-of-07168.59343", "label_index": [2], "label_confidence": [0.9926], "label_score": [[0.0002, 0.0073, 0.9926]]}
{"docno": "en.noclean.c4-train.06377-of-07168.89719", "label_index": [2], "label_confidence": [0.9942], "label_score": [[0.0001, 0.0057, 0.9942]]}
{"docno": "en.noclean.c4-train.03211-of-07168.81700", "label_index": [1, 1, 1], "label_confidence": [0.997, 0.9982, 0.9844], "label_score": [[0.0009, 0.997, 0.0021], [0.0005, 0.9982, 0.0013], [0.0014, 0.9844, 0.0142]]}
{"docno": "en.noclean.c4-train.02536-of-07168.128103", "label_index": [1, 1, 1, 1, 1, 1, 1, 1], "label_confidence": [0.9992, 0.9433, 0.9931, 0.9912, 0.9972, 0.994, 0.9977, 0.9939], "label_score": [[0.0002, 0.9992, 0.0007], [0.0031, 0.9433, 0.0536], [0.001, 0.9931, 0.0059], [0.0009, 0.9912, 0.0079], [0.0009, 0.9972, 0.0019], [0.0015, 0.994, 0.0044], [0.0007, 0.9977, 0.0016], [0.001, 0.9939, 0.0051]]}
{"docno": "en.noclean.c4-train.05819-of-07168.10710", "label_index": [1, 1, 2, 2, 2, 2], "label_confidence": [0.9968, 0.9977, 0.9958, 0.9913, 0.6247, 0.8243], "label_score": [[0.0007, 0.9968, 0.0025], [0.001, 0.9977, 0.0014], [0.0002, 0.004, 0.9958], [0.0003, 0.0084, 0.9913], [0.004, 0.3713, 0.6247], [0.0005, 0.1753, 0.8243]]}
{"docno": "en.noclean.c4-train.05471-of-07168.7308", "label_index": [1, 1, 1, 2, 1], "label_confidence": [0.9966, 0.9973, 0.9946, 0.9983, 0.9213], "label_score": [[0.0008, 0.9966, 0.0025], [0.0007, 0.9973, 0.002], [0.0008, 0.9946, 0.0046], [0.0001, 0.0016, 0.9983], [0.0094, 0.9213, 0.0693]]}
{"docno": "en.noclean.c4-train.06641-of-07168.60241", "label_index": [2, 1, 1], "label_confidence": [0.9983, 0.9834, 0.8538], "label_score": [[0.0001, 0.0015, 0.9983], [0.0005, 0.9834, 0.016], [0.0032, 0.8538, 0.143]]}
{"docno": "en.noclean.c4-train.00026-of-07168.143526", "label_index": [2, 1, 1, 1, 1, 1, 2], "label_confidence": [0.9584, 0.9933, 0.9905, 0.9866, 0.9973, 0.7029, 0.9976], "label_score": [[0.0002, 0.0414, 0.9584], [0.001, 0.9933, 0.0057], [0.0023, 0.9905, 0.0072], [0.0006, 0.9866, 0.0128], [0.0012, 0.9973, 0.0015], [0.0033, 0.7029, 0.2937], [0.0001, 0.0023, 0.9976]]}
