%ASSEMBLET  Evaluate matrix-valued function T.
%
%   T = ASSEMBLET(LAMBDA, MESH, GAUSS) delivers a three-dimensional array T
%   such that T(:, :, k) is equal to the function value of T at LAMBDA(k).
%   The parameter MESH specifies the underlying boundary mesh of the geometry.
%   The row and column dimensions of T are equal to the number of triangles
%   in MESH.  GAUSS controls the number of Gauss-Legendre nodes utilized to
%   numerically evaluate the boundary integrals by Gauss-Legendre quadrature.

% Cedric Effenberger and Michael Steinlechner
% ETH Zurich, October 2011.
function T = assembleT(lambda, mesh, gauss)

% define Gauss-Legendre quadrature points and weights
switch gauss
	
	case 3
		% points
		pt = [2/3, 1/6, 1/6;...
			  1/6, 2/3, 1/6;...
			  1/6, 1/6, 2/3];

		% weights
        wg = [1/3;...
              1/3;...
              1/3];

	case 7
		% points
		pt = [0.33333333333333333, 0.33333333333333333, 0.33333333333333333;...
			  0.79742698535308700, 0.10128650732345600, 0.10128650732345600;...
			  0.10128650732345600, 0.79742698535308700, 0.10128650732345600;...
			  0.10128650732345600, 0.10128650732345600, 0.79742698535308700;...
			  0.47014206410511500, 0.47014206410511500, 0.05971587178977000;...
			  0.47014206410511500, 0.05971587178977000, 0.47014206410511500;...
			  0.05971587178977000, 0.47014206410511500, 0.47014206410511500];

		% weights
        wg = [0.22503300003300000;...
              0.12593918054482700;...
              0.12593918054482700;...
              0.12593918054482700;...
              0.13239415278850600;...
              0.13239415278850600;...
              0.13239415278850600];

	case 13
		% points
		pt = [0.33333333333333333, 0.33333333333333333, 0.33333333333333333;...
			  0.47930806784192300, 0.26034596607903800, 0.26034596607903800;...
			  0.26034596607903800, 0.47930806784192300, 0.26034596607903800;...
			  0.26034596607903800, 0.26034596607903800, 0.47930806784192300;...
			  0.86973979419556800, 0.06513010290221600, 0.06513010290221600;...
			  0.06513010290221600, 0.86973979419556800, 0.06513010290221600;...
			  0.06513010290221600, 0.06513010290221600, 0.86973979419556800;...
			  0.63844418856980900, 0.31286549600487500, 0.04869031542531600;...
			  0.63844418856980900, 0.04869031542531600, 0.31286549600487500;...
			  0.31286549600487500, 0.63844418856980900, 0.04869031542531600;...
			  0.31286549600487500, 0.04869031542531600, 0.63844418856980900;...
			  0.04869031542531600, 0.63844418856980900, 0.31286549600487500;...
			  0.04869031542531600, 0.31286549600487500, 0.63844418856980900];

		% weights
        wg = [-.14957004446767000;...
              0.17561525743320400;...
              0.17561525743320400;...
              0.17561525743320400;...
              0.05334723560883900;...
              0.05334723560883900;...
              0.05334723560883900;...
              0.07711376089025700;...
              0.07711376089025700;...
              0.07711376089025700;...
              0.07711376089025700;...
              0.07711376089025700;...
              0.07711376089025700];

	otherwise
		error('GAUSS must be one of 3, 7, 13.  Different numbers of Gauss-Legendre nodes are not supported at the moment.')
end

% make sure that lambda is a column vector
lambda = lambda(:);

% determine number of triangles in the mesh
nTri = length(mesh);

% allocate memory for the results
T = zeros(nTri, nTri, numel(lambda));

% prepare auxiliary vectors
rowind = reshape(repmat(1:gauss, gauss, 1), 1, []);
colind = repmat(1:gauss, 1, gauss);

% compute Gauss-Legendre nodes for all triangles
for id = 1:nTri
	
	VK = [mesh(id).P1'; mesh(id).P2'; mesh(id).P3'];
	mesh(id).gaussP = transpose(pt * VK);
	mesh(id).gaussW = mesh(id).area * wg;
end

% compute lower triangle of T
for row = 1:nTri
	
	% compute Gauss-Legendre nodes for current triangle
% 	VK = [mesh(row).P1'; mesh(row).P2'; mesh(row).P3'];
% 	mesh(row).gaussP = transpose(pt * VK);
% 	mesh(row).gaussW = mesh(row).area * wg;
	
	for col = row:nTri%1:row
		
		% compute (row, col)-entry of T
		dist = sqrt(sum((mesh(row).gaussP(:, rowind) - mesh(col).gaussP(:, colind)).^2, 1));
		idx = (dist == 0);
		dist(idx) = 1;
		E = exp((1i * lambda) * dist) - 1;
		E(:, idx) = 1i * lambda(:, ones(1, nnz(idx)));
		T(row, col, :) = (E * (mesh(row).gaussW(rowind) .* (mesh(col).gaussW(colind) ./ dist.')) ...
					   + deHoop(mesh(row).gaussP, mesh(col)) * mesh(row).gaussW) / (4 * pi);
		
		% mirror along the diagonal
		T(col, row, :) = T(row, col, :);
	end
end