%!PS-Adobe-3.0 EPSF-3.0
%%Creator: (MATLAB, The Mathworks, Inc. Version 23.2.0.2409890 \(R2023b\) Update 3. Operating System: Mac OS X)
%%Title: figures/nice_example_g.eps
%%CreationDate: 2023-11-29T14:34:49
%%Pages: (atend)
%%BoundingBox:    15     3   735   525
%%LanguageLevel: 3
%%EndComments
%%BeginProlog
%%BeginResource: procset (Apache XML Graphics Std ProcSet) 1.2 0
%%Version: 1.2 0
%%Copyright: (Copyright 2001-2003,2010 The Apache Software Foundation. License terms: http://www.apache.org/licenses/LICENSE-2.0)
/bd{bind def}bind def
/ld{load def}bd
/GR/grestore ld
/GS/gsave ld
/RM/rmoveto ld
/C/curveto ld
/t/show ld
/L/lineto ld
/ML/setmiterlimit ld
/CT/concat ld
/f/fill ld
/N/newpath ld
/S/stroke ld
/CC/setcmykcolor ld
/A/ashow ld
/cp/closepath ld
/RC/setrgbcolor ld
/LJ/setlinejoin ld
/GC/setgray ld
/LW/setlinewidth ld
/M/moveto ld
/re {4 2 roll M
1 index 0 rlineto
0 exch rlineto
neg 0 rlineto
cp } bd
/_ctm matrix def
/_tm matrix def
/BT { _ctm currentmatrix pop matrix _tm copy pop 0 0 moveto } bd
/ET { _ctm setmatrix } bd
/iTm { _ctm setmatrix _tm concat } bd
/Tm { _tm astore pop iTm 0 0 moveto } bd
/ux 0.0 def
/uy 0.0 def
/F {
  /Tp exch def
  /Tf exch def
  Tf findfont Tp scalefont setfont
  /cf Tf def  /cs Tp def
} bd
/ULS {currentpoint /uy exch def /ux exch def} bd
/ULE {
  /Tcx currentpoint pop def
  gsave
  newpath
  cf findfont cs scalefont dup
  /FontMatrix get 0 get /Ts exch def /FontInfo get dup
  /UnderlinePosition get Ts mul /To exch def
  /UnderlineThickness get Ts mul /Tt exch def
  ux uy To add moveto  Tcx uy To add lineto
  Tt setlinewidth stroke
  grestore
} bd
/OLE {
  /Tcx currentpoint pop def
  gsave
  newpath
  cf findfont cs scalefont dup
  /FontMatrix get 0 get /Ts exch def /FontInfo get dup
  /UnderlinePosition get Ts mul /To exch def
  /UnderlineThickness get Ts mul /Tt exch def
  ux uy To add cs add moveto Tcx uy To add cs add lineto
  Tt setlinewidth stroke
  grestore
} bd
/SOE {
  /Tcx currentpoint pop def
  gsave
  newpath
  cf findfont cs scalefont dup
  /FontMatrix get 0 get /Ts exch def /FontInfo get dup
  /UnderlinePosition get Ts mul /To exch def
  /UnderlineThickness get Ts mul /Tt exch def
  ux uy To add cs 10 mul 26 idiv add moveto Tcx uy To add cs 10 mul 26 idiv add lineto
  Tt setlinewidth stroke
  grestore
} bd
/QT {
/Y22 exch store
/X22 exch store
/Y21 exch store
/X21 exch store
currentpoint
/Y21 load 2 mul add 3 div exch
/X21 load 2 mul add 3 div exch
/X21 load 2 mul /X22 load add 3 div
/Y21 load 2 mul /Y22 load add 3 div
/X22 load /Y22 load curveto
} bd
/SSPD {
dup length /d exch dict def
{
/v exch def
/k exch def
currentpagedevice k known {
/cpdv currentpagedevice k get def
v cpdv ne {
/upd false def
/nullv v type /nulltype eq def
/nullcpdv cpdv type /nulltype eq def
nullv nullcpdv or
{
/upd true def
} {
/sametype v type cpdv type eq def
sametype {
v type /arraytype eq {
/vlen v length def
/cpdvlen cpdv length def
vlen cpdvlen eq {
0 1 vlen 1 sub {
/i exch def
/obj v i get def
/cpdobj cpdv i get def
obj cpdobj ne {
/upd true def
exit
} if
} for
} {
/upd true def
} ifelse
} {
v type /dicttype eq {
v {
/dv exch def
/dk exch def
/cpddv cpdv dk get def
dv cpddv ne {
/upd true def
exit
} if
} forall
} {
/upd true def
} ifelse
} ifelse
} if
} ifelse
upd true eq {
d k v put
} if
} if
} if
} forall
d length 0 gt {
d setpagedevice
} if
} bd
/RE { % /NewFontName [NewEncodingArray] /FontName RE -
  findfont dup length dict begin
  {
    1 index /FID ne
    {def} {pop pop} ifelse
  } forall
  /Encoding exch def
  /FontName 1 index def
  currentdict definefont pop
  end
} bind def
%%EndResource
%%BeginResource: procset (Apache XML Graphics EPS ProcSet) 1.0 0
%%Version: 1.0 0
%%Copyright: (Copyright 2002-2003 The Apache Software Foundation. License terms: http://www.apache.org/licenses/LICENSE-2.0)
/BeginEPSF { %def
/b4_Inc_state save def         % Save state for cleanup
/dict_count countdictstack def % Count objects on dict stack
/op_count count 1 sub def      % Count objects on operand stack
userdict begin                 % Push userdict on dict stack
/showpage { } def              % Redefine showpage, { } = null proc
0 setgray 0 setlinecap         % Prepare graphics state
1 setlinewidth 0 setlinejoin
10 setmiterlimit [ ] 0 setdash newpath
/languagelevel where           % If level not equal to 1 then
{pop languagelevel             % set strokeadjust and
1 ne                           % overprint to their defaults.
{false setstrokeadjust false setoverprint
} if
} if
} bd
/EndEPSF { %def
count op_count sub {pop} repeat            % Clean up stacks
countdictstack dict_count sub {end} repeat
b4_Inc_state restore
} bd
%%EndResource
%FOPBeginFontDict
%%IncludeResource: font Courier-Oblique
%%IncludeResource: font Courier-BoldOblique
%%IncludeResource: font Courier-Bold
%%IncludeResource: font ZapfDingbats
%%IncludeResource: font Symbol
%%IncludeResource: font Helvetica
%%IncludeResource: font Helvetica-Oblique
%%IncludeResource: font Helvetica-Bold
%%IncludeResource: font Helvetica-BoldOblique
%%IncludeResource: font Times-Roman
%%IncludeResource: font Times-Italic
%%IncludeResource: font Times-Bold
%%IncludeResource: font Times-BoldItalic
%%IncludeResource: font Courier
%FOPEndFontDict
%%BeginResource: encoding WinAnsiEncoding
/WinAnsiEncoding [
/.notdef /.notdef /.notdef /.notdef /.notdef
/.notdef /.notdef /.notdef /.notdef /.notdef
/.notdef /.notdef /.notdef /.notdef /.notdef
/.notdef /.notdef /.notdef /.notdef /.notdef
/.notdef /.notdef /.notdef /.notdef /.notdef
/.notdef /.notdef /.notdef /.notdef /.notdef
/.notdef /.notdef /space /exclam /quotedbl
/numbersign /dollar /percent /ampersand /quotesingle
/parenleft /parenright /asterisk /plus /comma
/hyphen /period /slash /zero /one
/two /three /four /five /six
/seven /eight /nine /colon /semicolon
/less /equal /greater /question /at
/A /B /C /D /E
/F /G /H /I /J
/K /L /M /N /O
/P /Q /R /S /T
/U /V /W /X /Y
/Z /bracketleft /backslash /bracketright /asciicircum
/underscore /quoteleft /a /b /c
/d /e /f /g /h
/i /j /k /l /m
/n /o /p /q /r
/s /t /u /v /w
/x /y /z /braceleft /bar
/braceright /asciitilde /bullet /Euro /bullet
/quotesinglbase /florin /quotedblbase /ellipsis /dagger
/daggerdbl /circumflex /perthousand /Scaron /guilsinglleft
/OE /bullet /Zcaron /bullet /bullet
/quoteleft /quoteright /quotedblleft /quotedblright /bullet
/endash /emdash /asciitilde /trademark /scaron
/guilsinglright /oe /bullet /zcaron /Ydieresis
/space /exclamdown /cent /sterling /currency
/yen /brokenbar /section /dieresis /copyright
/ordfeminine /guillemotleft /logicalnot /sfthyphen /registered
/macron /degree /plusminus /twosuperior /threesuperior
/acute /mu /paragraph /middot /cedilla
/onesuperior /ordmasculine /guillemotright /onequarter /onehalf
/threequarters /questiondown /Agrave /Aacute /Acircumflex
/Atilde /Adieresis /Aring /AE /Ccedilla
/Egrave /Eacute /Ecircumflex /Edieresis /Igrave
/Iacute /Icircumflex /Idieresis /Eth /Ntilde
/Ograve /Oacute /Ocircumflex /Otilde /Odieresis
/multiply /Oslash /Ugrave /Uacute /Ucircumflex
/Udieresis /Yacute /Thorn /germandbls /agrave
/aacute /acircumflex /atilde /adieresis /aring
/ae /ccedilla /egrave /eacute /ecircumflex
/edieresis /igrave /iacute /icircumflex /idieresis
/eth /ntilde /ograve /oacute /ocircumflex
/otilde /odieresis /divide /oslash /ugrave
/uacute /ucircumflex /udieresis /yacute /thorn
/ydieresis
] def
%%EndResource
%FOPBeginFontReencode
/Courier-Oblique findfont
dup length dict begin
  {1 index /FID ne {def} {pop pop} ifelse} forall
  /Encoding WinAnsiEncoding def
  currentdict
end
/Courier-Oblique exch definefont pop
/Courier-BoldOblique findfont
dup length dict begin
  {1 index /FID ne {def} {pop pop} ifelse} forall
  /Encoding WinAnsiEncoding def
  currentdict
end
/Courier-BoldOblique exch definefont pop
/Courier-Bold findfont
dup length dict begin
  {1 index /FID ne {def} {pop pop} ifelse} forall
  /Encoding WinAnsiEncoding def
  currentdict
end
/Courier-Bold exch definefont pop
/Helvetica findfont
dup length dict begin
  {1 index /FID ne {def} {pop pop} ifelse} forall
  /Encoding WinAnsiEncoding def
  currentdict
end
/Helvetica exch definefont pop
/Helvetica-Oblique findfont
dup length dict begin
  {1 index /FID ne {def} {pop pop} ifelse} forall
  /Encoding WinAnsiEncoding def
  currentdict
end
/Helvetica-Oblique exch definefont pop
/Helvetica-Bold findfont
dup length dict begin
  {1 index /FID ne {def} {pop pop} ifelse} forall
  /Encoding WinAnsiEncoding def
  currentdict
end
/Helvetica-Bold exch definefont pop
/Helvetica-BoldOblique findfont
dup length dict begin
  {1 index /FID ne {def} {pop pop} ifelse} forall
  /Encoding WinAnsiEncoding def
  currentdict
end
/Helvetica-BoldOblique exch definefont pop
/Times-Roman findfont
dup length dict begin
  {1 index /FID ne {def} {pop pop} ifelse} forall
  /Encoding WinAnsiEncoding def
  currentdict
end
/Times-Roman exch definefont pop
/Times-Italic findfont
dup length dict begin
  {1 index /FID ne {def} {pop pop} ifelse} forall
  /Encoding WinAnsiEncoding def
  currentdict
end
/Times-Italic exch definefont pop
/Times-Bold findfont
dup length dict begin
  {1 index /FID ne {def} {pop pop} ifelse} forall
  /Encoding WinAnsiEncoding def
  currentdict
end
/Times-Bold exch definefont pop
/Times-BoldItalic findfont
dup length dict begin
  {1 index /FID ne {def} {pop pop} ifelse} forall
  /Encoding WinAnsiEncoding def
  currentdict
end
/Times-BoldItalic exch definefont pop
/Courier findfont
dup length dict begin
  {1 index /FID ne {def} {pop pop} ifelse} forall
  /Encoding WinAnsiEncoding def
  currentdict
end
/Courier exch definefont pop
%FOPEndFontReencode
%%EndProlog
%%Page: 1 1
%%PageBoundingBox: 0 0 800 533
%%BeginPageSetup
N
   15     3 M
  750     3 L
  750   528 L
   15   528 L
cp
clip
[1 0 0 -1 0 533] CT
%%EndPageSetup
GS
[1 0 0 1.00063 0 -0.33331] CT
1 GC
N
0 0 800 533 re
f
GR
GS
[1 0 0 1.00063 0 -0.33331] CT
1 GC
N
0 0 800 533 re
f
GR
GS
[1 0 0 1.00063 0 -0.33331] CT
1 GC
N
104 471 M
724 471 L
724 40 L
104 40 L
cp
f
GR
GS
[1 0 0 1.00063 0 -0.33331] CT
0.149 GC
2 setlinecap
1 LJ
2 LW
N
104 471 M
724 471 L
S
GR
GS
[1 0 0 1.00063 0 -0.33331] CT
0.149 GC
2 setlinecap
1 LJ
2 LW
N
104 40 M
724 40 L
S
GR
GS
[1 0 0 1.00063 0 -0.33331] CT
0.149 GC
2 setlinecap
1 LJ
2 LW
N
104 471 M
104 464.8 L
S
GR
GS
[1 0 0 1.00063 0 -0.33331] CT
0.149 GC
2 setlinecap
1 LJ
2 LW
N
228 471 M
228 464.8 L
S
GR
GS
[1 0 0 1.00063 0 -0.33331] CT
0.149 GC
2 setlinecap
1 LJ
2 LW
N
352 471 M
352 464.8 L
S
GR
GS
[1 0 0 1.00063 0 -0.33331] CT
0.149 GC
2 setlinecap
1 LJ
2 LW
N
476 471 M
476 464.8 L
S
GR
GS
[1 0 0 1.00063 0 -0.33331] CT
0.149 GC
2 setlinecap
1 LJ
2 LW
N
600 471 M
600 464.8 L
S
GR
GS
[1 0 0 1.00063 0 -0.33331] CT
0.149 GC
2 setlinecap
1 LJ
2 LW
N
724 471 M
724 464.8 L
S
GR
GS
[1 0 0 1.00063 0 -0.33331] CT
0.149 GC
2 setlinecap
1 LJ
2 LW
N
104 40 M
104 46.2 L
S
GR
GS
[1 0 0 1.00063 0 -0.33331] CT
0.149 GC
2 setlinecap
1 LJ
2 LW
N
228 40 M
228 46.2 L
S
GR
GS
[1 0 0 1.00063 0 -0.33331] CT
0.149 GC
2 setlinecap
1 LJ
2 LW
N
352 40 M
352 46.2 L
S
GR
GS
[1 0 0 1.00063 0 -0.33331] CT
0.149 GC
2 setlinecap
1 LJ
2 LW
N
476 40 M
476 46.2 L
S
GR
GS
[1 0 0 1.00063 0 -0.33331] CT
0.149 GC
2 setlinecap
1 LJ
2 LW
N
600 40 M
600 46.2 L
S
GR
GS
[1 0 0 1.00063 0 -0.33331] CT
0.149 GC
2 setlinecap
1 LJ
2 LW
N
724 40 M
724 46.2 L
S
GR
GS
[1 0 0 1.00063 104 477.36522] CT
0.149 GC
/Helvetica 22 F
GS
[1 0 0 1 0 0] CT
-6.5 21 moveto 
1 -1 scale
(0) t 
GR
GR
GS
[1 0 0 1.00063 228 477.36522] CT
0.149 GC
/Helvetica 22 F
GS
[1 0 0 1 0 0] CT
-12.5 21 moveto 
1 -1 scale
(10) t 
GR
GR
GS
[1 0 0 1.00063 352 477.36522] CT
0.149 GC
/Helvetica 22 F
GS
[1 0 0 1 0 0] CT
-12.5 21 moveto 
1 -1 scale
(20) t 
GR
GR
GS
[1 0 0 1.00063 476 477.36522] CT
0.149 GC
/Helvetica 22 F
GS
[1 0 0 1 0 0] CT
-12.5 21 moveto 
1 -1 scale
(30) t 
GR
GR
GS
[1 0 0 1.00063 600 477.36522] CT
0.149 GC
/Helvetica 22 F
GS
[1 0 0 1 0 0] CT
-12.5 21 moveto 
1 -1 scale
(40) t 
GR
GR
GS
[1 0 0 1.00063 724 477.36522] CT
0.149 GC
/Helvetica 22 F
GS
[1 0 0 1 0 0] CT
-12.5 21 moveto 
1 -1 scale
(50) t 
GR
GR
GS
[1 0 0 1.00063 414.00031 504.38211] CT
0.149 GC
N
-38.07 20.594 M
-39.507 20.594 -40.695 19.828 QT
-41.867 19.047 -42.523 17.797 QT
-43.179 16.531 -43.179 15.109 QT
-43.179 13.64 -42.46 12.39 QT
-41.742 11.125 -40.523 10.39 QT
-39.288 9.64 -37.804 9.64 QT
-36.929 9.64 -36.132 10.015 QT
-35.335 10.39 -34.757 11.047 QT
-34.757 6.015 L
-34.757 5.359 -34.96 5.078 QT
-35.148 4.781 -35.507 4.719 QT
-35.867 4.656 -36.648 4.656 QT
-36.648 3.812 L
-33.07 3.547 L
-33.07 18.125 L
-33.07 18.765 -32.882 19.062 QT
-32.679 19.344 -32.32 19.422 QT
-31.96 19.484 -31.179 19.484 QT
-31.179 20.328 L
-34.835 20.594 L
-34.835 19.078 L
-35.46 19.797 -36.32 20.203 QT
-37.179 20.594 -38.07 20.594 QT
cp
-40.538 18.219 M
-40.132 19.015 -39.445 19.5 QT
-38.742 19.969 -37.929 19.969 QT
-36.929 19.969 -36.085 19.39 QT
-35.242 18.797 -34.835 17.89 QT
-34.835 12.078 L
-35.117 11.547 -35.554 11.14 QT
-35.976 10.719 -36.523 10.5 QT
-37.054 10.265 -37.663 10.265 QT
-38.913 10.265 -39.695 10.984 QT
-40.46 11.687 -40.773 12.812 QT
-41.07 13.922 -41.07 15.125 QT
-41.07 16.094 -40.976 16.828 QT
-40.867 17.547 -40.538 18.219 QT
cp
f
GR
GS
[1 0 0 1.00063 414.00031 504.38211] CT
0.149 GC
N
-24.516 20.594 M
-25.985 20.594 -27.219 19.828 QT
-28.453 19.047 -29.156 17.765 QT
-29.86 16.469 -29.86 15.031 QT
-29.86 13.609 -29.219 12.344 QT
-28.578 11.062 -27.422 10.281 QT
-26.266 9.484 -24.844 9.484 QT
-23.735 9.484 -22.922 9.859 QT
-22.094 10.234 -21.563 10.89 QT
-21.031 11.547 -20.766 12.453 QT
-20.5 13.344 -20.5 14.422 QT
-20.5 14.734 -20.735 14.734 QT
-27.75 14.734 L
-27.75 15 L
-27.75 17.015 -26.938 18.453 QT
-26.125 19.89 -24.297 19.89 QT
-23.547 19.89 -22.922 19.562 QT
-22.281 19.234 -21.828 18.64 QT
-21.36 18.047 -21.188 17.375 QT
-21.172 17.297 -21.11 17.234 QT
-21.031 17.156 -20.953 17.156 QT
-20.735 17.156 L
-20.5 17.156 -20.5 17.469 QT
-20.828 18.844 -21.969 19.719 QT
-23.11 20.594 -24.516 20.594 QT
cp
-27.719 14.14 M
-22.203 14.14 L
-22.203 13.234 -22.469 12.297 QT
-22.719 11.359 -23.313 10.75 QT
-23.891 10.125 -24.844 10.125 QT
-26.219 10.125 -26.969 11.406 QT
-27.719 12.687 -27.719 14.14 QT
cp
f
GR
GS
[1 0 0 1.00063 414.00031 504.38211] CT
0.149 GC
N
-19.104 22.219 M
-19.104 21.359 -18.479 20.703 QT
-17.854 20.062 -16.995 19.797 QT
-17.479 19.437 -17.729 18.89 QT
-17.979 18.328 -17.979 17.687 QT
-17.979 16.562 -17.26 15.687 QT
-18.37 14.594 -18.37 13.187 QT
-18.37 12.437 -18.042 11.781 QT
-17.713 11.109 -17.135 10.625 QT
-16.557 10.14 -15.854 9.89 QT
-15.151 9.64 -14.401 9.64 QT
-12.963 9.64 -11.823 10.484 QT
-11.323 9.953 -10.651 9.672 QT
-9.963 9.375 -9.229 9.375 QT
-8.713 9.375 -8.385 9.75 QT
-8.042 10.109 -8.042 10.625 QT
-8.042 10.922 -8.276 11.156 QT
-8.495 11.375 -8.792 11.375 QT
-9.104 11.375 -9.323 11.156 QT
-9.542 10.922 -9.542 10.625 QT
-9.542 10.187 -9.26 10 QT
-10.51 10 -11.401 10.875 QT
-10.963 11.312 -10.698 11.937 QT
-10.432 12.562 -10.432 13.187 QT
-10.432 14.219 -11.01 15.047 QT
-11.573 15.859 -12.495 16.312 QT
-13.417 16.765 -14.401 16.765 QT
-15.729 16.765 -16.823 16.047 QT
-17.167 16.531 -17.167 17.109 QT
-17.167 17.75 -16.745 18.234 QT
-16.323 18.703 -15.682 18.703 QT
-13.698 18.703 L
-12.26 18.703 -11.104 18.969 QT
-9.948 19.234 -9.167 20.015 QT
-8.385 20.781 -8.385 22.219 QT
-8.385 23.281 -9.276 23.984 QT
-10.167 24.687 -11.417 25 QT
-12.667 25.312 -13.729 25.312 QT
-14.807 25.312 -16.057 25 QT
-17.307 24.687 -18.213 23.984 QT
-19.104 23.281 -19.104 22.219 QT
cp
-17.745 22.219 M
-17.745 23.031 -17.088 23.578 QT
-16.417 24.125 -15.495 24.39 QT
-14.557 24.656 -13.729 24.656 QT
-12.917 24.656 -11.979 24.39 QT
-11.042 24.125 -10.401 23.578 QT
-9.745 23.031 -9.745 22.219 QT
-9.745 20.953 -10.901 20.578 QT
-12.057 20.203 -13.698 20.203 QT
-15.682 20.203 L
-16.245 20.203 -16.713 20.469 QT
-17.182 20.734 -17.463 21.219 QT
-17.745 21.703 -17.745 22.219 QT
cp
-14.401 16.125 M
-12.354 16.125 -12.354 13.187 QT
-12.354 11.937 -12.792 11.125 QT
-13.213 10.297 -14.401 10.297 QT
-15.588 10.297 -16.026 11.125 QT
-16.463 11.937 -16.463 13.187 QT
-16.463 14 -16.292 14.656 QT
-16.12 15.297 -15.682 15.719 QT
-15.229 16.125 -14.401 16.125 QT
cp
f
GR
GS
[1 0 0 1.00063 414.00031 504.38211] CT
0.149 GC
N
-7.051 20.328 M
-7.051 19.484 L
-6.223 19.484 -5.692 19.359 QT
-5.16 19.219 -5.16 18.703 QT
-5.16 12.109 L
-5.16 11.453 -5.363 11.172 QT
-5.551 10.875 -5.926 10.812 QT
-6.285 10.75 -7.051 10.75 QT
-7.051 9.906 L
-3.582 9.64 L
-3.582 12 L
-3.207 10.953 -2.488 10.297 QT
-1.754 9.64 -0.738 9.64 QT
-0.004 9.64 0.558 10.062 QT
1.121 10.484 1.121 11.187 QT
1.121 11.625 0.808 11.953 QT
0.496 12.281 0.043 12.281 QT
-0.41 12.281 -0.738 11.969 QT
-1.051 11.64 -1.051 11.187 QT
-1.051 10.531 -0.582 10.265 QT
-0.738 10.265 L
-1.707 10.265 -2.332 10.984 QT
-2.957 11.687 -3.223 12.734 QT
-3.473 13.781 -3.473 14.734 QT
-3.473 18.703 L
-3.473 19.484 -1.113 19.484 QT
-1.113 20.328 L
-7.051 20.328 L
cp
f
GR
GS
[1 0 0 1.00063 414.00031 504.38211] CT
0.149 GC
N
7.818 20.594 M
6.349 20.594 5.115 19.828 QT
3.881 19.047 3.177 17.765 QT
2.474 16.469 2.474 15.031 QT
2.474 13.609 3.115 12.344 QT
3.756 11.062 4.912 10.281 QT
6.068 9.484 7.49 9.484 QT
8.599 9.484 9.412 9.859 QT
10.24 10.234 10.771 10.89 QT
11.302 11.547 11.568 12.453 QT
11.834 13.344 11.834 14.422 QT
11.834 14.734 11.599 14.734 QT
4.584 14.734 L
4.584 15 L
4.584 17.015 5.396 18.453 QT
6.209 19.89 8.037 19.89 QT
8.787 19.89 9.412 19.562 QT
10.052 19.234 10.506 18.64 QT
10.974 18.047 11.146 17.375 QT
11.162 17.297 11.224 17.234 QT
11.302 17.156 11.381 17.156 QT
11.599 17.156 L
11.834 17.156 11.834 17.469 QT
11.506 18.844 10.365 19.719 QT
9.224 20.594 7.818 20.594 QT
cp
4.615 14.14 M
10.131 14.14 L
10.131 13.234 9.865 12.297 QT
9.615 11.359 9.021 10.75 QT
8.443 10.125 7.49 10.125 QT
6.115 10.125 5.365 11.406 QT
4.615 12.687 4.615 14.14 QT
cp
f
GR
GS
[1 0 0 1.00063 414.00031 504.38211] CT
0.149 GC
N
18.574 20.594 M
17.105 20.594 15.87 19.828 QT
14.636 19.047 13.933 17.765 QT
13.23 16.469 13.23 15.031 QT
13.23 13.609 13.87 12.344 QT
14.511 11.062 15.667 10.281 QT
16.824 9.484 18.245 9.484 QT
19.355 9.484 20.167 9.859 QT
20.995 10.234 21.527 10.89 QT
22.058 11.547 22.324 12.453 QT
22.589 13.344 22.589 14.422 QT
22.589 14.734 22.355 14.734 QT
15.339 14.734 L
15.339 15 L
15.339 17.015 16.152 18.453 QT
16.964 19.89 18.792 19.89 QT
19.542 19.89 20.167 19.562 QT
20.808 19.234 21.261 18.64 QT
21.73 18.047 21.902 17.375 QT
21.917 17.297 21.98 17.234 QT
22.058 17.156 22.136 17.156 QT
22.355 17.156 L
22.589 17.156 22.589 17.469 QT
22.261 18.844 21.12 19.719 QT
19.98 20.594 18.574 20.594 QT
cp
15.37 14.14 M
20.886 14.14 L
20.886 13.234 20.62 12.297 QT
20.37 11.359 19.777 10.75 QT
19.199 10.125 18.245 10.125 QT
16.87 10.125 16.12 11.406 QT
15.37 12.687 15.37 14.14 QT
cp
f
GR
GS
[1 0 0 1.00063 414.00031 504.38211] CT
0.149 GC
N
35.583 20.594 M
34.068 20.594 33.177 19.453 QT
32.302 18.297 32.302 16.719 QT
32.302 15.172 33.099 13.515 QT
33.911 11.844 35.271 10.75 QT
36.63 9.64 38.208 9.64 QT
38.911 9.64 39.49 10.047 QT
40.068 10.437 40.38 11.094 QT
41.74 5.687 L
41.833 5.281 41.849 5.047 QT
41.849 4.656 40.286 4.656 QT
40.036 4.656 40.036 4.344 QT
40.052 4.281 40.083 4.125 QT
40.13 3.969 40.193 3.89 QT
40.255 3.812 40.38 3.812 QT
43.646 3.547 L
43.927 3.547 43.927 3.859 QT
40.458 17.765 L
40.286 18.172 40.286 18.922 QT
40.286 19.969 40.99 19.969 QT
41.74 19.969 42.13 19 QT
42.536 18.031 42.802 16.765 QT
42.849 16.625 42.99 16.625 QT
43.286 16.625 L
43.38 16.625 43.443 16.719 QT
43.505 16.797 43.505 16.875 QT
43.068 18.562 42.568 19.578 QT
42.068 20.594 40.927 20.594 QT
40.115 20.594 39.49 20.125 QT
38.865 19.64 38.708 18.859 QT
37.161 20.594 35.583 20.594 QT
cp
35.615 19.969 M
36.49 19.969 37.302 19.312 QT
38.13 18.656 38.708 17.765 QT
38.74 17.734 38.74 17.672 QT
40.068 12.344 L
39.911 11.5 39.427 10.89 QT
38.958 10.265 38.146 10.265 QT
37.333 10.265 36.63 10.937 QT
35.927 11.594 35.443 12.515 QT
34.974 13.484 34.536 15.172 QT
34.115 16.859 34.115 17.781 QT
34.115 18.625 34.474 19.297 QT
34.833 19.969 35.615 19.969 QT
cp
f
GR
GS
[1 0 0 1.00063 0 -0.33331] CT
0.149 GC
2 setlinecap
1 LJ
2 LW
N
104 471 M
104 40 L
S
GR
GS
[1 0 0 1.00063 0 -0.33331] CT
0.149 GC
2 setlinecap
1 LJ
2 LW
N
724 471 M
724 40 L
S
GR
GS
[1 0 0 1.00063 0 -0.33331] CT
0.149 GC
2 setlinecap
1 LJ
2 LW
N
104 469.926 M
110.2 469.926 L
S
GR
GS
[1 0 0 1.00063 0 -0.33331] CT
0.149 GC
2 setlinecap
1 LJ
2 LW
N
104 328.727 M
110.2 328.727 L
S
GR
GS
[1 0 0 1.00063 0 -0.33331] CT
0.149 GC
2 setlinecap
1 LJ
2 LW
N
104 187.528 M
110.2 187.528 L
S
GR
GS
[1 0 0 1.00063 0 -0.33331] CT
0.149 GC
2 setlinecap
1 LJ
2 LW
N
104 46.33 M
110.2 46.33 L
S
GR
GS
[1 0 0 1.00063 0 -0.33331] CT
0.149 GC
2 setlinecap
1 LJ
2 LW
N
724 469.926 M
717.8 469.926 L
S
GR
GS
[1 0 0 1.00063 0 -0.33331] CT
0.149 GC
2 setlinecap
1 LJ
2 LW
N
724 328.727 M
717.8 328.727 L
S
GR
GS
[1 0 0 1.00063 0 -0.33331] CT
0.149 GC
2 setlinecap
1 LJ
2 LW
N
724 187.528 M
717.8 187.528 L
S
GR
GS
[1 0 0 1.00063 0 -0.33331] CT
0.149 GC
2 setlinecap
1 LJ
2 LW
N
724 46.33 M
717.8 46.33 L
S
GR
GS
[1 0 0 1.00063 0 -0.33331] CT
0.149 GC
2 setlinecap
1 LJ
2 LW
N
104 469.926 M
107.1 469.926 L
S
GR
GS
[1 0 0 1.00063 0 -0.33331] CT
0.149 GC
2 setlinecap
1 LJ
2 LW
N
104 441.686 M
107.1 441.686 L
S
GR
GS
[1 0 0 1.00063 0 -0.33331] CT
0.149 GC
2 setlinecap
1 LJ
2 LW
N
104 413.446 M
107.1 413.446 L
S
GR
GS
[1 0 0 1.00063 0 -0.33331] CT
0.149 GC
2 setlinecap
1 LJ
2 LW
N
104 385.207 M
107.1 385.207 L
S
GR
GS
[1 0 0 1.00063 0 -0.33331] CT
0.149 GC
2 setlinecap
1 LJ
2 LW
N
104 356.967 M
107.1 356.967 L
S
GR
GS
[1 0 0 1.00063 0 -0.33331] CT
0.149 GC
2 setlinecap
1 LJ
2 LW
N
104 328.727 M
107.1 328.727 L
S
GR
GS
[1 0 0 1.00063 0 -0.33331] CT
0.149 GC
2 setlinecap
1 LJ
2 LW
N
104 300.487 M
107.1 300.487 L
S
GR
GS
[1 0 0 1.00063 0 -0.33331] CT
0.149 GC
2 setlinecap
1 LJ
2 LW
N
104 272.248 M
107.1 272.248 L
S
GR
GS
[1 0 0 1.00063 0 -0.33331] CT
0.149 GC
2 setlinecap
1 LJ
2 LW
N
104 244.008 M
107.1 244.008 L
S
GR
GS
[1 0 0 1.00063 0 -0.33331] CT
0.149 GC
2 setlinecap
1 LJ
2 LW
N
104 215.768 M
107.1 215.768 L
S
GR
GS
[1 0 0 1.00063 0 -0.33331] CT
0.149 GC
2 setlinecap
1 LJ
2 LW
N
104 187.528 M
107.1 187.528 L
S
GR
GS
[1 0 0 1.00063 0 -0.33331] CT
0.149 GC
2 setlinecap
1 LJ
2 LW
N
104 159.289 M
107.1 159.289 L
S
GR
GS
[1 0 0 1.00063 0 -0.33331] CT
0.149 GC
2 setlinecap
1 LJ
2 LW
N
104 131.049 M
107.1 131.049 L
S
GR
GS
[1 0 0 1.00063 0 -0.33331] CT
0.149 GC
2 setlinecap
1 LJ
2 LW
N
104 102.809 M
107.1 102.809 L
S
GR
GS
[1 0 0 1.00063 0 -0.33331] CT
0.149 GC
2 setlinecap
1 LJ
2 LW
N
104 74.569 M
107.1 74.569 L
S
GR
GS
[1 0 0 1.00063 0 -0.33331] CT
0.149 GC
2 setlinecap
1 LJ
2 LW
N
104 46.33 M
107.1 46.33 L
S
GR
GS
[1 0 0 1.00063 0 -0.33331] CT
0.149 GC
2 setlinecap
1 LJ
2 LW
N
724 469.926 M
720.9 469.926 L
S
GR
GS
[1 0 0 1.00063 0 -0.33331] CT
0.149 GC
2 setlinecap
1 LJ
2 LW
N
724 441.686 M
720.9 441.686 L
S
GR
GS
[1 0 0 1.00063 0 -0.33331] CT
0.149 GC
2 setlinecap
1 LJ
2 LW
N
724 413.446 M
720.9 413.446 L
S
GR
GS
[1 0 0 1.00063 0 -0.33331] CT
0.149 GC
2 setlinecap
1 LJ
2 LW
N
724 385.207 M
720.9 385.207 L
S
GR
GS
[1 0 0 1.00063 0 -0.33331] CT
0.149 GC
2 setlinecap
1 LJ
2 LW
N
724 356.967 M
720.9 356.967 L
S
GR
GS
[1 0 0 1.00063 0 -0.33331] CT
0.149 GC
2 setlinecap
1 LJ
2 LW
N
724 328.727 M
720.9 328.727 L
S
GR
GS
[1 0 0 1.00063 0 -0.33331] CT
0.149 GC
2 setlinecap
1 LJ
2 LW
N
724 300.487 M
720.9 300.487 L
S
GR
GS
[1 0 0 1.00063 0 -0.33331] CT
0.149 GC
2 setlinecap
1 LJ
2 LW
N
724 272.248 M
720.9 272.248 L
S
GR
GS
[1 0 0 1.00063 0 -0.33331] CT
0.149 GC
2 setlinecap
1 LJ
2 LW
N
724 244.008 M
720.9 244.008 L
S
GR
GS
[1 0 0 1.00063 0 -0.33331] CT
0.149 GC
2 setlinecap
1 LJ
2 LW
N
724 215.768 M
720.9 215.768 L
S
GR
GS
[1 0 0 1.00063 0 -0.33331] CT
0.149 GC
2 setlinecap
1 LJ
2 LW
N
724 187.528 M
720.9 187.528 L
S
GR
GS
[1 0 0 1.00063 0 -0.33331] CT
0.149 GC
2 setlinecap
1 LJ
2 LW
N
724 159.289 M
720.9 159.289 L
S
GR
GS
[1 0 0 1.00063 0 -0.33331] CT
0.149 GC
2 setlinecap
1 LJ
2 LW
N
724 131.049 M
720.9 131.049 L
S
GR
GS
[1 0 0 1.00063 0 -0.33331] CT
0.149 GC
2 setlinecap
1 LJ
2 LW
N
724 102.809 M
720.9 102.809 L
S
GR
GS
[1 0 0 1.00063 0 -0.33331] CT
0.149 GC
2 setlinecap
1 LJ
2 LW
N
724 74.569 M
720.9 74.569 L
S
GR
GS
[1 0 0 1.00063 0 -0.33331] CT
0.149 GC
2 setlinecap
1 LJ
2 LW
N
724 46.33 M
720.9 46.33 L
S
GR
GS
[1 0 0 1.00063 46 481.96811] CT
0.149 GC
/Helvetica 22 F
GS
[1 0 0 1 0 0] CT
0 0 moveto 
1 -1 scale
(10) t 
GR
GR
GS
[1 0 0 1.00063 71 470.96123] CT
0.149 GC
/Helvetica 17.6 F
GS
[1 0 0 1 0 0] CT
0 0 moveto 
1 -1 scale
(-15) t 
GR
GR
GS
[1 0 0 1.00063 46 340.87993] CT
0.149 GC
/Helvetica 22 F
GS
[1 0 0 1 0 0] CT
0 0 moveto 
1 -1 scale
(10) t 
GR
GR
GS
[1 0 0 1.00063 71 329.87305] CT
0.149 GC
/Helvetica 17.6 F
GS
[1 0 0 1 0 0] CT
0 0 moveto 
1 -1 scale
(-10) t 
GR
GR
GS
[1 0 0 1.00063 56 199.79176] CT
0.149 GC
/Helvetica 22 F
GS
[1 0 0 1 0 0] CT
0 0 moveto 
1 -1 scale
(10) t 
GR
GR
GS
[1 0 0 1.00063 81 188.78488] CT
0.149 GC
/Helvetica 17.6 F
GS
[1 0 0 1 0 0] CT
0 0 moveto 
1 -1 scale
(-5) t 
GR
GR
GS
[1 0 0 1.00063 63 57.70296] CT
0.149 GC
/Helvetica 22 F
GS
[1 0 0 1 0 0] CT
0 0 moveto 
1 -1 scale
(10) t 
GR
GR
GS
[1 0 0 1.00063 88 46.69608] CT
0.149 GC
/Helvetica 17.6 F
GS
[1 0 0 1 0 0] CT
0 0 moveto 
1 -1 scale
(0) t 
GR
GR
GS
[0 -1.00063 1 0 42.6 255.32627] CT
0.149 GC
N
-42.393 -3.103 M
-42.393 -26.415 L
-42.393 -26.603 -42.252 -26.728 QT
-42.096 -26.853 -41.909 -26.853 QT
-41.721 -26.853 -41.58 -26.728 QT
-41.424 -26.603 -41.424 -26.415 QT
-41.424 -3.103 L
-41.424 -2.915 -41.58 -2.79 QT
-41.721 -2.665 -41.909 -2.665 QT
-42.096 -2.665 -42.252 -2.79 QT
-42.393 -2.915 -42.393 -3.103 QT
cp
-37.705 -3.103 M
-37.705 -26.415 L
-37.705 -26.603 -37.565 -26.728 QT
-37.409 -26.853 -37.221 -26.853 QT
-37.034 -26.853 -36.893 -26.728 QT
-36.737 -26.603 -36.737 -26.415 QT
-36.737 -3.103 L
-36.737 -2.915 -36.893 -2.79 QT
-37.034 -2.665 -37.221 -2.665 QT
-37.409 -2.665 -37.565 -2.79 QT
-37.705 -2.915 -37.705 -3.103 QT
cp
f
GR
GS
[0 -1.00063 1 0 42.6 255.32627] CT
0.149 GC
N
-33.168 -5.259 M
-33.168 -5.837 -32.762 -6.29 QT
-32.355 -6.728 -31.777 -6.728 QT
-31.387 -6.728 -31.121 -6.493 QT
-30.855 -6.243 -30.855 -5.853 QT
-30.855 -5.415 -31.105 -5.071 QT
-31.355 -4.728 -31.746 -4.571 QT
-31.09 -4.384 -29.715 -4.384 QT
-28.605 -4.384 -27.683 -5.243 QT
-26.762 -6.087 -26.48 -7.212 QT
-25.777 -10.04 L
-27.09 -8.712 -28.512 -8.712 QT
-29.543 -8.712 -30.293 -9.243 QT
-31.027 -9.775 -31.418 -10.65 QT
-31.793 -11.54 -31.793 -12.54 QT
-31.793 -13.65 -31.34 -14.868 QT
-30.887 -16.087 -30.074 -17.118 QT
-29.246 -18.165 -28.183 -18.775 QT
-27.121 -19.4 -25.933 -19.4 QT
-25.23 -19.4 -24.668 -19.009 QT
-24.105 -18.618 -23.762 -17.978 QT
-23.527 -18.915 -22.73 -18.915 QT
-22.418 -18.915 -22.215 -18.728 QT
-21.996 -18.556 -21.996 -18.243 QT
-21.996 -18.165 -22.012 -18.134 QT
-22.012 -18.103 -22.027 -18.056 QT
-24.777 -7.071 L
-24.98 -6.321 -25.496 -5.696 QT
-25.996 -5.056 -26.683 -4.65 QT
-27.355 -4.228 -28.183 -3.993 QT
-28.996 -3.759 -29.746 -3.759 QT
-31.121 -3.759 -32.152 -4.025 QT
-33.168 -4.29 -33.168 -5.259 QT
cp
-28.449 -9.337 M
-26.902 -9.337 -25.402 -11.462 QT
-24.074 -16.743 L
-24.246 -17.587 -24.746 -18.181 QT
-25.23 -18.775 -25.996 -18.775 QT
-26.793 -18.775 -27.512 -18.118 QT
-28.215 -17.462 -28.699 -16.556 QT
-29.137 -15.681 -29.558 -14.04 QT
-29.98 -12.415 -29.98 -11.462 QT
-29.98 -10.634 -29.605 -9.978 QT
-29.23 -9.337 -28.449 -9.337 QT
cp
f
GR
GS
[0 -1.00063 1 0 42.6 255.32627] CT
0.149 GC
N
-13.254 -14.275 M
-13.457 -14.275 -13.598 -14.431 QT
-13.723 -14.587 -13.723 -14.759 QT
-13.723 -14.931 -13.598 -15.087 QT
-13.457 -15.243 -13.254 -15.243 QT
0.621 -15.243 L
0.808 -15.243 0.933 -15.087 QT
1.058 -14.931 1.058 -14.759 QT
1.058 -14.587 0.933 -14.431 QT
0.808 -14.275 0.621 -14.275 QT
-13.254 -14.275 L
cp
f
GR
GS
[0 -1.00063 1 0 42.6 255.32627] CT
0.149 GC
N
10.336 -9.118 M
10.336 -9.275 10.367 -9.337 QT
12.18 -16.556 L
12.352 -17.228 12.352 -17.728 QT
12.352 -18.775 11.649 -18.775 QT
10.883 -18.775 10.508 -17.868 QT
10.149 -16.962 9.805 -15.587 QT
9.805 -15.509 9.727 -15.462 QT
9.664 -15.431 9.617 -15.431 QT
9.321 -15.431 L
9.242 -15.431 9.18 -15.509 QT
9.133 -15.603 9.133 -15.681 QT
9.383 -16.728 9.617 -17.462 QT
9.867 -18.196 10.383 -18.79 QT
10.899 -19.4 11.664 -19.4 QT
12.508 -19.4 13.133 -18.915 QT
13.774 -18.431 13.914 -17.634 QT
14.539 -18.446 15.321 -18.915 QT
16.102 -19.4 17.039 -19.4 QT
17.805 -19.4 18.383 -18.946 QT
18.977 -18.509 18.977 -17.728 QT
18.977 -17.118 18.586 -16.665 QT
18.211 -16.212 17.571 -16.212 QT
17.18 -16.212 16.914 -16.446 QT
16.649 -16.696 16.649 -17.087 QT
16.649 -17.618 17.039 -18.04 QT
17.43 -18.462 17.93 -18.462 QT
17.555 -18.775 16.992 -18.775 QT
15.946 -18.775 15.18 -18.04 QT
14.414 -17.306 13.805 -16.165 QT
12.086 -9.243 L
11.992 -8.915 11.696 -8.681 QT
11.414 -8.446 11.071 -8.446 QT
10.774 -8.446 10.555 -8.634 QT
10.336 -8.821 10.336 -9.118 QT
cp
f
GR
GS
[0 -1.00063 1 0 42.6 255.32627] CT
0.149 GC
N
23.286 -3.103 M
23.286 -26.415 L
23.286 -26.603 23.427 -26.728 QT
23.583 -26.853 23.77 -26.853 QT
23.958 -26.853 24.098 -26.728 QT
24.255 -26.603 24.255 -26.415 QT
24.255 -3.103 L
24.255 -2.915 24.098 -2.79 QT
23.958 -2.665 23.77 -2.665 QT
23.583 -2.665 23.427 -2.79 QT
23.286 -2.915 23.286 -3.103 QT
cp
27.973 -3.103 M
27.973 -26.415 L
27.973 -26.603 28.114 -26.728 QT
28.27 -26.853 28.458 -26.853 QT
28.645 -26.853 28.786 -26.728 QT
28.942 -26.603 28.942 -26.415 QT
28.942 -3.103 L
28.942 -2.915 28.786 -2.79 QT
28.645 -2.665 28.458 -2.665 QT
28.27 -2.665 28.114 -2.79 QT
27.973 -2.915 27.973 -3.103 QT
cp
f
GR
GS
[0 -1.00063 1 0 42.6 255.32627] CT
0.149 GC
N
33.277 -5.082 M
33.12 -5.082 33.12 -5.27 QT
33.12 -5.332 33.167 -5.395 QT
37.339 -10.129 L
33.167 -16.129 L
33.12 -16.176 33.12 -16.207 QT
33.12 -16.488 L
33.12 -16.551 33.167 -16.598 QT
33.23 -16.645 33.277 -16.645 QT
42.964 -16.645 L
43.433 -12.77 L
42.948 -12.77 L
42.792 -13.988 42.448 -14.645 QT
42.12 -15.317 41.573 -15.613 QT
41.027 -15.926 40.323 -15.988 QT
39.62 -16.051 38.277 -16.051 QT
35.12 -16.051 L
38.667 -10.988 L
38.714 -10.879 38.714 -10.879 QT
38.714 -10.77 38.667 -10.754 QT
34.37 -5.863 L
38.23 -5.863 L
39.573 -5.863 40.277 -5.926 QT
40.995 -5.988 41.558 -6.285 QT
42.12 -6.598 42.464 -7.27 QT
42.808 -7.957 42.948 -9.145 QT
43.433 -9.145 L
42.964 -5.082 L
33.277 -5.082 L
cp
f
GR
GS
[1 0 0 1.00063 414.0004 33.63791] CT
N
-195.717 -8.712 M
-195.717 -9.556 L
-193.233 -9.556 -193.233 -10.337 QT
-193.233 -23.618 L
-193.233 -24.384 -195.717 -24.384 QT
-195.717 -25.228 L
-186.827 -25.228 L
-185.592 -25.228 -184.342 -24.743 QT
-183.092 -24.275 -182.28 -23.337 QT
-181.452 -22.4 -181.452 -21.118 QT
-181.452 -19.65 -182.671 -18.65 QT
-183.874 -17.65 -185.499 -17.353 QT
-184.436 -17.353 -183.327 -16.759 QT
-182.217 -16.181 -181.514 -15.212 QT
-180.796 -14.243 -180.796 -13.165 QT
-180.796 -11.837 -181.592 -10.821 QT
-182.374 -9.806 -183.624 -9.259 QT
-184.874 -8.712 -186.139 -8.712 QT
-195.717 -8.712 L
cp
-191.124 -10.337 M
-191.124 -9.806 -190.827 -9.681 QT
-190.53 -9.556 -189.889 -9.556 QT
-186.827 -9.556 L
-185.874 -9.556 -185.077 -10.056 QT
-184.264 -10.556 -183.796 -11.384 QT
-183.311 -12.212 -183.311 -13.165 QT
-183.311 -14.087 -183.702 -14.962 QT
-184.092 -15.853 -184.827 -16.415 QT
-185.546 -16.978 -186.483 -16.978 QT
-191.124 -16.978 L
-191.124 -10.337 L
cp
-191.124 -17.618 M
-187.499 -17.618 L
-186.764 -17.618 -186.124 -17.884 QT
-185.483 -18.15 -184.967 -18.65 QT
-184.452 -19.15 -184.171 -19.775 QT
-183.889 -20.415 -183.889 -21.118 QT
-183.889 -21.743 -184.108 -22.321 QT
-184.311 -22.915 -184.717 -23.384 QT
-185.108 -23.853 -185.655 -24.118 QT
-186.202 -24.384 -186.827 -24.384 QT
-189.889 -24.384 L
-190.327 -24.384 -190.577 -24.337 QT
-190.811 -24.306 -190.967 -24.134 QT
-191.124 -23.978 -191.124 -23.618 QT
-191.124 -17.618 L
cp
f
GR
GS
[1 0 0 1.00063 414.0004 33.63791] CT
N
-176.794 -11.587 M
-176.794 -16.931 L
-176.794 -17.587 -176.998 -17.868 QT
-177.185 -18.165 -177.56 -18.228 QT
-177.919 -18.29 -178.685 -18.29 QT
-178.685 -19.134 L
-175.029 -19.4 L
-175.029 -11.587 L
-175.029 -10.65 -174.888 -10.118 QT
-174.748 -9.603 -174.31 -9.337 QT
-173.873 -9.071 -172.904 -9.071 QT
-171.591 -9.071 -170.826 -10.165 QT
-170.06 -11.259 -170.06 -12.634 QT
-170.06 -16.931 L
-170.06 -17.587 -170.263 -17.868 QT
-170.466 -18.165 -170.826 -18.228 QT
-171.185 -18.29 -171.951 -18.29 QT
-171.951 -19.134 L
-168.294 -19.4 L
-168.294 -10.915 L
-168.294 -10.275 -168.107 -9.978 QT
-167.919 -9.696 -167.56 -9.618 QT
-167.185 -9.556 -166.419 -9.556 QT
-166.419 -8.712 L
-169.998 -8.446 L
-169.998 -10.478 L
-170.435 -9.571 -171.248 -9.009 QT
-172.044 -8.446 -173.013 -8.446 QT
-174.748 -8.446 -175.779 -9.181 QT
-176.794 -9.915 -176.794 -11.587 QT
cp
f
GR
GS
[1 0 0 1.00063 414.0004 33.63791] CT
N
-159.944 -8.446 M
-161.397 -8.446 -162.6 -9.196 QT
-163.787 -9.962 -164.475 -11.228 QT
-165.162 -12.509 -165.162 -13.931 QT
-165.162 -15.368 -164.491 -16.665 QT
-163.803 -17.978 -162.6 -18.759 QT
-161.397 -19.556 -159.944 -19.556 QT
-158.522 -19.556 -157.366 -18.993 QT
-156.194 -18.446 -156.194 -17.181 QT
-156.194 -16.712 -156.537 -16.353 QT
-156.866 -16.009 -157.35 -16.009 QT
-157.834 -16.009 -158.178 -16.353 QT
-158.506 -16.712 -158.506 -17.181 QT
-158.506 -17.603 -158.241 -17.915 QT
-157.959 -18.228 -157.569 -18.321 QT
-158.397 -18.853 -159.912 -18.853 QT
-161.069 -18.853 -161.787 -18.071 QT
-162.491 -17.306 -162.772 -16.165 QT
-163.053 -15.04 -163.053 -13.931 QT
-163.053 -12.759 -162.709 -11.665 QT
-162.35 -10.571 -161.584 -9.853 QT
-160.803 -9.15 -159.647 -9.15 QT
-158.491 -9.15 -157.694 -9.853 QT
-156.881 -10.556 -156.6 -11.681 QT
-156.6 -11.837 -156.412 -11.837 QT
-156.116 -11.837 L
-156.037 -11.837 -155.991 -11.759 QT
-155.928 -11.696 -155.928 -11.618 QT
-155.928 -11.54 L
-156.287 -10.118 -157.381 -9.275 QT
-158.459 -8.446 -159.944 -8.446 QT
cp
f
GR
GS
[1 0 0 1.00063 414.0004 33.63791] CT
N
-155.251 -8.712 M
-155.251 -9.556 L
-154.423 -9.556 -153.892 -9.681 QT
-153.36 -9.821 -153.36 -10.337 QT
-153.36 -23.025 L
-153.36 -23.681 -153.563 -23.962 QT
-153.751 -24.259 -154.126 -24.321 QT
-154.485 -24.384 -155.251 -24.384 QT
-155.251 -25.228 L
-151.673 -25.493 L
-151.673 -14.009 L
-148.423 -16.868 L
-147.938 -17.321 -147.938 -17.712 QT
-147.938 -17.993 -148.142 -18.134 QT
-148.345 -18.29 -148.626 -18.29 QT
-148.626 -19.134 L
-144.079 -19.134 L
-144.079 -18.29 L
-145.72 -18.29 -147.36 -16.868 QT
-149.079 -15.368 L
-146.001 -10.993 L
-145.36 -10.087 -144.938 -9.821 QT
-144.501 -9.556 -143.517 -9.556 QT
-143.517 -8.712 L
-148.329 -8.712 L
-148.329 -9.556 L
-147.501 -9.556 -147.501 -10.071 QT
-147.501 -10.431 -147.938 -10.993 QT
-150.267 -14.306 L
-151.735 -13.025 L
-151.735 -10.337 L
-151.735 -9.821 -151.204 -9.681 QT
-150.673 -9.556 -149.86 -9.556 QT
-149.86 -8.712 L
-155.251 -8.712 L
cp
f
GR
GS
[1 0 0 1.00063 414.0004 33.63791] CT
N
-142.354 -8.712 M
-142.354 -9.556 L
-141.526 -9.556 -140.994 -9.681 QT
-140.463 -9.821 -140.463 -10.337 QT
-140.463 -23.025 L
-140.463 -23.681 -140.666 -23.962 QT
-140.854 -24.259 -141.229 -24.321 QT
-141.588 -24.384 -142.354 -24.384 QT
-142.354 -25.228 L
-138.776 -25.493 L
-138.776 -10.337 L
-138.776 -9.821 -138.244 -9.681 QT
-137.713 -9.556 -136.885 -9.556 QT
-136.885 -8.712 L
-142.354 -8.712 L
cp
f
GR
GS
[1 0 0 1.00063 414.0004 33.63791] CT
N
-135.631 -8.712 M
-135.631 -9.556 L
-134.803 -9.556 -134.272 -9.681 QT
-133.741 -9.821 -133.741 -10.337 QT
-133.741 -16.931 L
-133.741 -17.868 -134.116 -18.071 QT
-134.475 -18.29 -135.538 -18.29 QT
-135.538 -19.134 L
-132.053 -19.4 L
-132.053 -10.337 L
-132.053 -9.821 -131.6 -9.681 QT
-131.131 -9.556 -130.366 -9.556 QT
-130.366 -8.712 L
-135.631 -8.712 L
cp
-134.616 -23.556 M
-134.616 -24.087 -134.21 -24.493 QT
-133.803 -24.9 -133.288 -24.9 QT
-132.944 -24.9 -132.631 -24.712 QT
-132.303 -24.54 -132.131 -24.212 QT
-131.96 -23.9 -131.96 -23.556 QT
-131.96 -23.04 -132.366 -22.634 QT
-132.756 -22.228 -133.288 -22.228 QT
-133.803 -22.228 -134.21 -22.634 QT
-134.616 -23.04 -134.616 -23.556 QT
cp
f
GR
GS
[1 0 0 1.00063 414.0004 33.63791] CT
N
-128.94 -8.712 M
-128.94 -9.556 L
-128.112 -9.556 -127.581 -9.681 QT
-127.05 -9.821 -127.05 -10.337 QT
-127.05 -16.931 L
-127.05 -17.587 -127.253 -17.868 QT
-127.44 -18.165 -127.815 -18.228 QT
-128.175 -18.29 -128.94 -18.29 QT
-128.94 -19.134 L
-125.425 -19.4 L
-125.425 -17.04 L
-124.94 -18.071 -124.003 -18.728 QT
-123.05 -19.4 -121.925 -19.4 QT
-120.253 -19.4 -119.409 -18.587 QT
-118.55 -17.79 -118.55 -16.134 QT
-118.55 -10.337 L
-118.55 -9.821 -118.019 -9.681 QT
-117.487 -9.556 -116.675 -9.556 QT
-116.675 -8.712 L
-122.206 -8.712 L
-122.206 -9.556 L
-121.378 -9.556 -120.847 -9.681 QT
-120.315 -9.821 -120.315 -10.337 QT
-120.315 -16.071 L
-120.315 -17.243 -120.659 -18.009 QT
-121.003 -18.775 -122.065 -18.775 QT
-123.472 -18.775 -124.378 -17.65 QT
-125.284 -16.525 -125.284 -15.103 QT
-125.284 -10.337 L
-125.284 -9.821 -124.753 -9.681 QT
-124.222 -9.556 -123.394 -9.556 QT
-123.394 -8.712 L
-128.94 -8.712 L
cp
f
GR
GS
[1 0 0 1.00063 414.0004 33.63791] CT
N
-115.543 -6.821 M
-115.543 -7.681 -114.918 -8.337 QT
-114.293 -8.978 -113.433 -9.243 QT
-113.918 -9.603 -114.168 -10.15 QT
-114.418 -10.712 -114.418 -11.353 QT
-114.418 -12.478 -113.699 -13.353 QT
-114.808 -14.446 -114.808 -15.853 QT
-114.808 -16.603 -114.48 -17.259 QT
-114.152 -17.931 -113.574 -18.415 QT
-112.996 -18.9 -112.293 -19.15 QT
-111.59 -19.4 -110.84 -19.4 QT
-109.402 -19.4 -108.262 -18.556 QT
-107.762 -19.087 -107.09 -19.368 QT
-106.402 -19.665 -105.668 -19.665 QT
-105.152 -19.665 -104.824 -19.29 QT
-104.48 -18.931 -104.48 -18.415 QT
-104.48 -18.118 -104.715 -17.884 QT
-104.933 -17.665 -105.23 -17.665 QT
-105.543 -17.665 -105.762 -17.884 QT
-105.98 -18.118 -105.98 -18.415 QT
-105.98 -18.853 -105.699 -19.04 QT
-106.949 -19.04 -107.84 -18.165 QT
-107.402 -17.728 -107.137 -17.103 QT
-106.871 -16.478 -106.871 -15.853 QT
-106.871 -14.821 -107.449 -13.993 QT
-108.012 -13.181 -108.933 -12.728 QT
-109.855 -12.275 -110.84 -12.275 QT
-112.168 -12.275 -113.262 -12.993 QT
-113.605 -12.509 -113.605 -11.931 QT
-113.605 -11.29 -113.183 -10.806 QT
-112.762 -10.337 -112.121 -10.337 QT
-110.137 -10.337 L
-108.699 -10.337 -107.543 -10.071 QT
-106.387 -9.806 -105.605 -9.025 QT
-104.824 -8.259 -104.824 -6.821 QT
-104.824 -5.759 -105.715 -5.056 QT
-106.605 -4.353 -107.855 -4.04 QT
-109.105 -3.728 -110.168 -3.728 QT
-111.246 -3.728 -112.496 -4.04 QT
-113.746 -4.353 -114.652 -5.056 QT
-115.543 -5.759 -115.543 -6.821 QT
cp
-114.183 -6.821 M
-114.183 -6.009 -113.527 -5.462 QT
-112.855 -4.915 -111.933 -4.65 QT
-110.996 -4.384 -110.168 -4.384 QT
-109.355 -4.384 -108.418 -4.65 QT
-107.48 -4.915 -106.84 -5.462 QT
-106.183 -6.009 -106.183 -6.821 QT
-106.183 -8.087 -107.34 -8.462 QT
-108.496 -8.837 -110.137 -8.837 QT
-112.121 -8.837 L
-112.683 -8.837 -113.152 -8.571 QT
-113.621 -8.306 -113.902 -7.821 QT
-114.183 -7.337 -114.183 -6.821 QT
cp
-110.84 -12.915 M
-108.793 -12.915 -108.793 -15.853 QT
-108.793 -17.103 -109.23 -17.915 QT
-109.652 -18.743 -110.84 -18.743 QT
-112.027 -18.743 -112.465 -17.915 QT
-112.902 -17.103 -112.902 -15.853 QT
-112.902 -15.04 -112.73 -14.384 QT
-112.558 -13.743 -112.121 -13.321 QT
-111.668 -12.915 -110.84 -12.915 QT
cp
f
GR
GS
[1 0 0 1.00063 414.0004 33.63791] CT
N
-95.423 -4.025 M
-95.423 -4.868 L
-94.595 -4.868 -94.064 -5.009 QT
-93.532 -5.15 -93.532 -5.634 QT
-93.532 -17.306 L
-93.532 -17.962 -94.001 -18.118 QT
-94.47 -18.29 -95.423 -18.29 QT
-95.423 -19.134 L
-91.845 -19.4 L
-91.845 -17.9 L
-91.189 -18.634 -90.314 -19.009 QT
-89.423 -19.4 -88.423 -19.4 QT
-87.001 -19.4 -85.861 -18.618 QT
-84.704 -17.853 -84.064 -16.587 QT
-83.423 -15.337 -83.423 -13.931 QT
-83.423 -12.462 -84.142 -11.196 QT
-84.845 -9.946 -86.079 -9.196 QT
-87.314 -8.446 -88.798 -8.446 QT
-90.564 -8.446 -91.767 -9.868 QT
-91.767 -5.634 L
-91.767 -5.15 -91.236 -5.009 QT
-90.704 -4.868 -89.876 -4.868 QT
-89.876 -4.025 L
-95.423 -4.025 L
cp
-91.767 -11.056 M
-91.345 -10.196 -90.595 -9.634 QT
-89.829 -9.071 -88.939 -9.071 QT
-88.095 -9.071 -87.454 -9.525 QT
-86.814 -9.978 -86.376 -10.728 QT
-85.939 -11.493 -85.736 -12.321 QT
-85.532 -13.15 -85.532 -13.931 QT
-85.532 -14.9 -85.876 -16.025 QT
-86.22 -17.15 -86.939 -17.915 QT
-87.657 -18.696 -88.673 -18.696 QT
-89.642 -18.696 -90.47 -18.196 QT
-91.282 -17.696 -91.767 -16.837 QT
-91.767 -11.056 L
cp
f
GR
GS
[1 0 0 1.00063 414.0004 33.63791] CT
N
-81.854 -8.712 M
-81.854 -9.556 L
-81.025 -9.556 -80.494 -9.681 QT
-79.963 -9.821 -79.963 -10.337 QT
-79.963 -23.025 L
-79.963 -23.681 -80.166 -23.962 QT
-80.354 -24.259 -80.729 -24.321 QT
-81.088 -24.384 -81.854 -24.384 QT
-81.854 -25.228 L
-78.275 -25.493 L
-78.275 -10.337 L
-78.275 -9.821 -77.744 -9.681 QT
-77.213 -9.556 -76.385 -9.556 QT
-76.385 -8.712 L
-81.854 -8.712 L
cp
f
GR
GS
[1 0 0 1.00063 414.0004 33.63791] CT
N
-74.913 -11.087 M
-74.913 -12.525 -73.788 -13.431 QT
-72.647 -14.337 -71.069 -14.696 QT
-69.475 -15.071 -68.038 -15.071 QT
-68.038 -16.071 L
-68.038 -16.759 -68.35 -17.415 QT
-68.647 -18.071 -69.225 -18.493 QT
-69.803 -18.915 -70.506 -18.915 QT
-72.116 -18.915 -72.959 -18.196 QT
-72.491 -18.196 -72.194 -17.837 QT
-71.897 -17.493 -71.897 -17.04 QT
-71.897 -16.556 -72.241 -16.212 QT
-72.569 -15.868 -73.053 -15.868 QT
-73.538 -15.868 -73.881 -16.212 QT
-74.209 -16.556 -74.209 -17.04 QT
-74.209 -18.321 -73.053 -18.931 QT
-71.897 -19.556 -70.506 -19.556 QT
-69.522 -19.556 -68.538 -19.134 QT
-67.538 -18.712 -66.913 -17.931 QT
-66.272 -17.15 -66.272 -16.118 QT
-66.272 -10.665 L
-66.272 -10.196 -66.084 -9.806 QT
-65.881 -9.415 -65.459 -9.415 QT
-65.053 -9.415 -64.866 -9.806 QT
-64.663 -10.212 -64.663 -10.665 QT
-64.663 -12.212 L
-63.959 -12.212 L
-63.959 -10.665 L
-63.959 -10.134 -64.241 -9.634 QT
-64.522 -9.15 -65.006 -8.853 QT
-65.475 -8.571 -66.038 -8.571 QT
-66.741 -8.571 -67.256 -9.118 QT
-67.772 -9.665 -67.834 -10.431 QT
-68.272 -9.509 -69.147 -8.978 QT
-70.022 -8.446 -71.022 -8.446 QT
-71.944 -8.446 -72.834 -8.712 QT
-73.725 -8.978 -74.319 -9.556 QT
-74.913 -10.15 -74.913 -11.087 QT
cp
-72.959 -11.087 M
-72.959 -10.243 -72.334 -9.65 QT
-71.694 -9.071 -70.85 -9.071 QT
-70.069 -9.071 -69.428 -9.462 QT
-68.788 -9.853 -68.413 -10.525 QT
-68.038 -11.196 -68.038 -11.946 QT
-68.038 -14.462 L
-69.131 -14.462 -70.288 -14.103 QT
-71.444 -13.743 -72.209 -12.978 QT
-72.959 -12.212 -72.959 -11.087 QT
cp
f
GR
GS
[1 0 0 1.00063 414.0004 33.63791] CT
N
-61.313 -11.618 M
-61.313 -18.29 L
-63.328 -18.29 L
-63.328 -18.915 L
-61.734 -18.915 -61 -20.384 QT
-60.25 -21.868 -60.25 -23.587 QT
-59.547 -23.587 L
-59.547 -19.134 L
-56.141 -19.134 L
-56.141 -18.29 L
-59.547 -18.29 L
-59.547 -11.665 L
-59.547 -10.665 -59.219 -9.9 QT
-58.875 -9.15 -58 -9.15 QT
-57.172 -9.15 -56.813 -9.946 QT
-56.453 -10.743 -56.453 -11.665 QT
-56.453 -13.087 L
-55.75 -13.087 L
-55.75 -11.618 L
-55.75 -10.868 -56.031 -10.118 QT
-56.313 -9.384 -56.859 -8.915 QT
-57.391 -8.446 -58.172 -8.446 QT
-59.625 -8.446 -60.469 -9.306 QT
-61.313 -10.181 -61.313 -11.618 QT
cp
f
GR
GS
[1 0 0 1.00063 414.0004 33.63791] CT
N
-48.355 -8.446 M
-49.823 -8.446 -51.058 -9.212 QT
-52.292 -9.993 -52.995 -11.275 QT
-53.698 -12.571 -53.698 -14.009 QT
-53.698 -15.431 -53.058 -16.696 QT
-52.417 -17.978 -51.261 -18.759 QT
-50.105 -19.556 -48.683 -19.556 QT
-47.573 -19.556 -46.761 -19.181 QT
-45.933 -18.806 -45.401 -18.15 QT
-44.87 -17.493 -44.605 -16.587 QT
-44.339 -15.696 -44.339 -14.618 QT
-44.339 -14.306 -44.573 -14.306 QT
-51.589 -14.306 L
-51.589 -14.04 L
-51.589 -12.025 -50.776 -10.587 QT
-49.964 -9.15 -48.136 -9.15 QT
-47.386 -9.15 -46.761 -9.478 QT
-46.12 -9.806 -45.667 -10.4 QT
-45.198 -10.993 -45.026 -11.665 QT
-45.011 -11.743 -44.948 -11.806 QT
-44.87 -11.884 -44.792 -11.884 QT
-44.573 -11.884 L
-44.339 -11.884 -44.339 -11.571 QT
-44.667 -10.196 -45.808 -9.321 QT
-46.948 -8.446 -48.355 -8.446 QT
cp
-51.558 -14.9 M
-46.042 -14.9 L
-46.042 -15.806 -46.308 -16.743 QT
-46.558 -17.681 -47.151 -18.29 QT
-47.73 -18.915 -48.683 -18.915 QT
-50.058 -18.915 -50.808 -17.634 QT
-51.558 -16.353 -51.558 -14.9 QT
cp
f
GR
GS
[1 0 0 1.00063 414.0004 33.63791] CT
N
-41.583 -10.04 M
-41.583 -10.587 -41.193 -10.978 QT
-40.786 -11.368 -40.255 -11.368 QT
-39.911 -11.368 -39.599 -11.181 QT
-39.286 -11.009 -39.115 -10.696 QT
-38.927 -10.384 -38.927 -10.04 QT
-38.927 -9.509 -39.318 -9.103 QT
-39.708 -8.712 -40.255 -8.712 QT
-40.786 -8.712 -41.193 -9.103 QT
-41.583 -9.509 -41.583 -10.04 QT
cp
-41.583 -17.806 M
-41.583 -18.15 -41.411 -18.446 QT
-41.224 -18.759 -40.911 -18.946 QT
-40.599 -19.134 -40.255 -19.134 QT
-39.911 -19.134 -39.599 -18.946 QT
-39.286 -18.759 -39.115 -18.446 QT
-38.927 -18.15 -38.927 -17.806 QT
-38.927 -17.259 -39.318 -16.868 QT
-39.693 -16.478 -40.255 -16.478 QT
-40.786 -16.478 -41.193 -16.868 QT
-41.583 -17.259 -41.583 -17.806 QT
cp
f
GR
GS
[1 0 0 1.00063 414.0004 33.63791] CT
N
-20.121 -8.446 M
-21.59 -8.446 -22.824 -9.212 QT
-24.059 -9.993 -24.762 -11.275 QT
-25.465 -12.571 -25.465 -14.009 QT
-25.465 -15.431 -24.824 -16.696 QT
-24.184 -17.978 -23.027 -18.759 QT
-21.871 -19.556 -20.449 -19.556 QT
-19.34 -19.556 -18.527 -19.181 QT
-17.699 -18.806 -17.168 -18.15 QT
-16.637 -17.493 -16.371 -16.587 QT
-16.106 -15.696 -16.106 -14.618 QT
-16.106 -14.306 -16.34 -14.306 QT
-23.356 -14.306 L
-23.356 -14.04 L
-23.356 -12.025 -22.543 -10.587 QT
-21.731 -9.15 -19.902 -9.15 QT
-19.152 -9.15 -18.527 -9.478 QT
-17.887 -9.806 -17.434 -10.4 QT
-16.965 -10.993 -16.793 -11.665 QT
-16.777 -11.743 -16.715 -11.806 QT
-16.637 -11.884 -16.559 -11.884 QT
-16.34 -11.884 L
-16.106 -11.884 -16.106 -11.571 QT
-16.434 -10.196 -17.574 -9.321 QT
-18.715 -8.446 -20.121 -8.446 QT
cp
-23.324 -14.9 M
-17.809 -14.9 L
-17.809 -15.806 -18.074 -16.743 QT
-18.324 -17.681 -18.918 -18.29 QT
-19.496 -18.915 -20.449 -18.915 QT
-21.824 -18.915 -22.574 -17.634 QT
-23.324 -16.353 -23.324 -14.9 QT
cp
f
GR
GS
[1 0 0 1.00063 414.0004 33.63791] CT
N
-14.756 -8.712 M
-14.756 -9.556 L
-13.928 -9.556 -13.397 -9.681 QT
-12.866 -9.821 -12.866 -10.337 QT
-12.866 -16.931 L
-12.866 -17.587 -13.069 -17.868 QT
-13.256 -18.165 -13.631 -18.228 QT
-13.991 -18.29 -14.756 -18.29 QT
-14.756 -19.134 L
-11.287 -19.4 L
-11.287 -17.04 L
-10.912 -18.087 -10.194 -18.743 QT
-9.459 -19.4 -8.444 -19.4 QT
-7.709 -19.4 -7.147 -18.978 QT
-6.584 -18.556 -6.584 -17.853 QT
-6.584 -17.415 -6.897 -17.087 QT
-7.209 -16.759 -7.662 -16.759 QT
-8.116 -16.759 -8.444 -17.071 QT
-8.756 -17.4 -8.756 -17.853 QT
-8.756 -18.509 -8.287 -18.775 QT
-8.444 -18.775 L
-9.412 -18.775 -10.037 -18.056 QT
-10.662 -17.353 -10.928 -16.306 QT
-11.178 -15.259 -11.178 -14.306 QT
-11.178 -10.337 L
-11.178 -9.556 -8.819 -9.556 QT
-8.819 -8.712 L
-14.756 -8.712 L
cp
f
GR
GS
[1 0 0 1.00063 414.0004 33.63791] CT
N
-5.278 -8.712 M
-5.278 -9.556 L
-4.45 -9.556 -3.919 -9.681 QT
-3.387 -9.821 -3.387 -10.337 QT
-3.387 -16.931 L
-3.387 -17.587 -3.59 -17.868 QT
-3.778 -18.165 -4.153 -18.228 QT
-4.512 -18.29 -5.278 -18.29 QT
-5.278 -19.134 L
-1.809 -19.4 L
-1.809 -17.04 L
-1.434 -18.087 -0.715 -18.743 QT
0.019 -19.4 1.035 -19.4 QT
1.769 -19.4 2.331 -18.978 QT
2.894 -18.556 2.894 -17.853 QT
2.894 -17.415 2.581 -17.087 QT
2.269 -16.759 1.816 -16.759 QT
1.363 -16.759 1.035 -17.071 QT
0.722 -17.4 0.722 -17.853 QT
0.722 -18.509 1.191 -18.775 QT
1.035 -18.775 L
0.066 -18.775 -0.559 -18.056 QT
-1.184 -17.353 -1.45 -16.306 QT
-1.7 -15.259 -1.7 -14.306 QT
-1.7 -10.337 L
-1.7 -9.556 0.66 -9.556 QT
0.66 -8.712 L
-5.278 -8.712 L
cp
f
GR
GS
[1 0 0 1.00063 414.0004 33.63791] CT
N
9.622 -8.446 M
8.169 -8.446 6.919 -9.181 QT
5.685 -9.915 4.966 -11.15 QT
4.247 -12.4 4.247 -13.868 QT
4.247 -14.978 4.638 -15.993 QT
5.044 -17.025 5.779 -17.837 QT
6.513 -18.65 7.497 -19.103 QT
8.482 -19.556 9.622 -19.556 QT
11.107 -19.556 12.325 -18.759 QT
13.56 -17.978 14.263 -16.665 QT
14.966 -15.353 14.966 -13.868 QT
14.966 -12.415 14.247 -11.165 QT
13.529 -9.915 12.294 -9.181 QT
11.06 -8.446 9.622 -8.446 QT
cp
9.622 -9.15 M
11.56 -9.15 12.2 -10.556 QT
12.857 -11.962 12.857 -14.134 QT
12.857 -15.353 12.716 -16.15 QT
12.591 -16.946 12.169 -17.587 QT
11.888 -17.993 11.466 -18.29 QT
11.044 -18.603 10.575 -18.759 QT
10.122 -18.915 9.622 -18.915 QT
8.872 -18.915 8.185 -18.571 QT
7.513 -18.228 7.06 -17.587 QT
6.607 -16.915 6.482 -16.087 QT
6.357 -15.275 6.357 -14.134 QT
6.357 -12.775 6.591 -11.696 QT
6.841 -10.618 7.544 -9.884 QT
8.263 -9.15 9.622 -9.15 QT
cp
f
GR
GS
[1 0 0 1.00063 414.0004 33.63791] CT
N
16.3 -8.712 M
16.3 -9.556 L
17.129 -9.556 17.66 -9.681 QT
18.191 -9.821 18.191 -10.337 QT
18.191 -16.931 L
18.191 -17.587 17.988 -17.868 QT
17.8 -18.165 17.425 -18.228 QT
17.066 -18.29 16.3 -18.29 QT
16.3 -19.134 L
19.769 -19.4 L
19.769 -17.04 L
20.144 -18.087 20.863 -18.743 QT
21.597 -19.4 22.613 -19.4 QT
23.347 -19.4 23.91 -18.978 QT
24.472 -18.556 24.472 -17.853 QT
24.472 -17.415 24.16 -17.087 QT
23.847 -16.759 23.394 -16.759 QT
22.941 -16.759 22.613 -17.071 QT
22.3 -17.4 22.3 -17.853 QT
22.3 -18.509 22.769 -18.775 QT
22.613 -18.775 L
21.644 -18.775 21.019 -18.056 QT
20.394 -17.353 20.129 -16.306 QT
19.879 -15.259 19.879 -14.306 QT
19.879 -10.337 L
19.879 -9.556 22.238 -9.556 QT
22.238 -8.712 L
16.3 -8.712 L
cp
f
GR
GS
[1 0 0 1.00063 414.0004 33.63791] CT
N
38.564 -8.712 M
35.439 -17.509 L
35.22 -18.04 34.814 -18.165 QT
34.424 -18.29 33.658 -18.29 QT
33.658 -19.134 L
38.642 -19.134 L
38.642 -18.29 L
37.205 -18.29 37.205 -17.681 QT
37.22 -17.65 37.22 -17.618 QT
37.236 -17.587 37.236 -17.509 QT
39.564 -10.993 L
41.564 -16.665 L
41.252 -17.509 L
41.064 -18.04 40.642 -18.165 QT
40.236 -18.29 39.486 -18.29 QT
39.486 -19.134 L
44.252 -19.134 L
44.252 -18.29 L
42.83 -18.29 42.83 -17.681 QT
42.83 -17.587 42.845 -17.509 QT
45.267 -10.696 L
47.47 -16.868 L
47.517 -17.056 47.517 -17.196 QT
47.517 -17.712 47.08 -17.993 QT
46.642 -18.29 46.111 -18.29 QT
46.111 -19.134 L
50.22 -19.134 L
50.22 -18.29 L
49.502 -18.29 48.97 -17.9 QT
48.439 -17.525 48.189 -16.868 QT
45.314 -8.712 L
45.236 -8.446 44.955 -8.446 QT
44.752 -8.446 L
44.47 -8.446 44.392 -8.712 QT
41.955 -15.603 L
39.502 -8.712 L
39.392 -8.446 39.127 -8.446 QT
38.955 -8.446 L
38.658 -8.446 38.564 -8.712 QT
cp
f
GR
GS
[1 0 0 1.00063 414.0004 33.63791] CT
N
51.323 -8.712 M
51.323 -9.556 L
52.151 -9.556 52.683 -9.681 QT
53.214 -9.821 53.214 -10.337 QT
53.214 -16.931 L
53.214 -17.587 53.011 -17.868 QT
52.823 -18.165 52.448 -18.228 QT
52.089 -18.29 51.323 -18.29 QT
51.323 -19.134 L
54.792 -19.4 L
54.792 -17.04 L
55.167 -18.087 55.886 -18.743 QT
56.62 -19.4 57.636 -19.4 QT
58.37 -19.4 58.933 -18.978 QT
59.495 -18.556 59.495 -17.853 QT
59.495 -17.415 59.183 -17.087 QT
58.87 -16.759 58.417 -16.759 QT
57.964 -16.759 57.636 -17.071 QT
57.323 -17.4 57.323 -17.853 QT
57.323 -18.509 57.792 -18.775 QT
57.636 -18.775 L
56.667 -18.775 56.042 -18.056 QT
55.417 -17.353 55.151 -16.306 QT
54.901 -15.259 54.901 -14.306 QT
54.901 -10.337 L
54.901 -9.556 57.261 -9.556 QT
57.261 -8.712 L
51.323 -8.712 L
cp
f
GR
GS
[1 0 0 1.00063 414.0004 33.63791] CT
N
62.645 -11.618 M
62.645 -18.29 L
60.63 -18.29 L
60.63 -18.915 L
62.224 -18.915 62.958 -20.384 QT
63.708 -21.868 63.708 -23.587 QT
64.411 -23.587 L
64.411 -19.134 L
67.817 -19.134 L
67.817 -18.29 L
64.411 -18.29 L
64.411 -11.665 L
64.411 -10.665 64.739 -9.9 QT
65.083 -9.15 65.958 -9.15 QT
66.786 -9.15 67.145 -9.946 QT
67.505 -10.743 67.505 -11.665 QT
67.505 -13.087 L
68.208 -13.087 L
68.208 -11.618 L
68.208 -10.868 67.927 -10.118 QT
67.645 -9.384 67.099 -8.915 QT
66.567 -8.446 65.786 -8.446 QT
64.333 -8.446 63.489 -9.306 QT
62.645 -10.181 62.645 -11.618 QT
cp
f
GR
GS
[1 0 0 1.00063 414.0004 33.63791] CT
N
78.451 -8.634 M
78.451 -12.587 L
78.451 -12.775 78.67 -12.775 QT
78.967 -12.775 L
79.108 -12.775 79.154 -12.587 QT
79.826 -9.071 82.42 -9.071 QT
83.561 -9.071 84.326 -9.587 QT
85.108 -10.118 85.108 -11.196 QT
85.108 -11.978 84.498 -12.525 QT
83.904 -13.087 83.076 -13.29 QT
81.451 -13.603 L
80.639 -13.775 79.967 -14.134 QT
79.311 -14.509 78.873 -15.118 QT
78.451 -15.728 78.451 -16.525 QT
78.451 -17.587 79.014 -18.259 QT
79.576 -18.946 80.467 -19.243 QT
81.373 -19.556 82.42 -19.556 QT
83.654 -19.556 84.576 -18.9 QT
85.279 -19.493 L
85.279 -19.556 85.389 -19.556 QT
85.561 -19.556 L
85.639 -19.556 85.701 -19.493 QT
85.764 -19.431 85.764 -19.353 QT
85.764 -16.181 L
85.764 -15.962 85.561 -15.962 QT
85.279 -15.962 L
85.061 -15.962 85.061 -16.181 QT
85.061 -17.446 84.358 -18.212 QT
83.654 -18.993 82.389 -18.993 QT
81.311 -18.993 80.514 -18.587 QT
79.717 -18.181 79.717 -17.196 QT
79.717 -16.525 80.279 -16.087 QT
80.858 -15.665 81.623 -15.478 QT
83.264 -15.165 L
84.092 -14.978 84.795 -14.525 QT
85.514 -14.087 85.936 -13.4 QT
86.358 -12.712 86.358 -11.853 QT
86.358 -10.978 86.061 -10.337 QT
85.764 -9.696 85.217 -9.259 QT
84.686 -8.837 83.951 -8.65 QT
83.217 -8.446 82.42 -8.446 QT
80.904 -8.446 79.826 -9.462 QT
78.936 -8.493 L
78.936 -8.446 78.811 -8.446 QT
78.67 -8.446 L
78.451 -8.446 78.451 -8.634 QT
cp
f
GR
GS
[1 0 0 1.00063 414.0004 33.63791] CT
N
89.809 -11.587 M
89.809 -16.931 L
89.809 -17.587 89.606 -17.868 QT
89.419 -18.165 89.044 -18.228 QT
88.684 -18.29 87.919 -18.29 QT
87.919 -19.134 L
91.575 -19.4 L
91.575 -11.587 L
91.575 -10.65 91.716 -10.118 QT
91.856 -9.603 92.294 -9.337 QT
92.731 -9.071 93.7 -9.071 QT
95.012 -9.071 95.778 -10.165 QT
96.544 -11.259 96.544 -12.634 QT
96.544 -16.931 L
96.544 -17.587 96.341 -17.868 QT
96.137 -18.165 95.778 -18.228 QT
95.419 -18.29 94.653 -18.29 QT
94.653 -19.134 L
98.309 -19.4 L
98.309 -10.915 L
98.309 -10.275 98.497 -9.978 QT
98.684 -9.696 99.044 -9.618 QT
99.419 -9.556 100.184 -9.556 QT
100.184 -8.712 L
96.606 -8.446 L
96.606 -10.478 L
96.169 -9.571 95.356 -9.009 QT
94.559 -8.446 93.591 -8.446 QT
91.856 -8.446 90.825 -9.181 QT
89.809 -9.915 89.809 -11.587 QT
cp
f
GR
GS
[1 0 0 1.00063 414.0004 33.63791] CT
N
101.269 -8.712 M
101.269 -9.556 L
102.098 -9.556 102.629 -9.681 QT
103.16 -9.821 103.16 -10.337 QT
103.16 -16.931 L
103.16 -17.587 102.957 -17.868 QT
102.769 -18.165 102.394 -18.228 QT
102.035 -18.29 101.269 -18.29 QT
101.269 -19.134 L
104.738 -19.4 L
104.738 -17.04 L
105.113 -18.087 105.832 -18.743 QT
106.566 -19.4 107.582 -19.4 QT
108.316 -19.4 108.879 -18.978 QT
109.441 -18.556 109.441 -17.853 QT
109.441 -17.415 109.129 -17.087 QT
108.816 -16.759 108.363 -16.759 QT
107.91 -16.759 107.582 -17.071 QT
107.269 -17.4 107.269 -17.853 QT
107.269 -18.509 107.738 -18.775 QT
107.582 -18.775 L
106.613 -18.775 105.988 -18.056 QT
105.363 -17.353 105.098 -16.306 QT
104.848 -15.259 104.848 -14.306 QT
104.848 -10.337 L
104.848 -9.556 107.207 -9.556 QT
107.207 -8.712 L
101.269 -8.712 L
cp
f
GR
GS
[1 0 0 1.00063 414.0004 33.63791] CT
N
110.748 -8.712 M
110.748 -9.556 L
111.576 -9.556 112.107 -9.681 QT
112.638 -9.821 112.638 -10.337 QT
112.638 -16.931 L
112.638 -17.587 112.435 -17.868 QT
112.248 -18.165 111.873 -18.228 QT
111.513 -18.29 110.748 -18.29 QT
110.748 -19.134 L
114.217 -19.4 L
114.217 -17.04 L
114.592 -18.087 115.31 -18.743 QT
116.045 -19.4 117.06 -19.4 QT
117.795 -19.4 118.357 -18.978 QT
118.92 -18.556 118.92 -17.853 QT
118.92 -17.415 118.607 -17.087 QT
118.295 -16.759 117.842 -16.759 QT
117.388 -16.759 117.06 -17.071 QT
116.748 -17.4 116.748 -17.853 QT
116.748 -18.509 117.217 -18.775 QT
117.06 -18.775 L
116.092 -18.775 115.467 -18.056 QT
114.842 -17.353 114.576 -16.306 QT
114.326 -15.259 114.326 -14.306 QT
114.326 -10.337 L
114.326 -9.556 116.685 -9.556 QT
116.685 -8.712 L
110.748 -8.712 L
cp
f
GR
GS
[1 0 0 1.00063 414.0004 33.63791] CT
N
125.648 -8.446 M
124.195 -8.446 122.945 -9.181 QT
121.711 -9.915 120.992 -11.15 QT
120.273 -12.4 120.273 -13.868 QT
120.273 -14.978 120.664 -15.993 QT
121.07 -17.025 121.804 -17.837 QT
122.539 -18.65 123.523 -19.103 QT
124.507 -19.556 125.648 -19.556 QT
127.132 -19.556 128.351 -18.759 QT
129.586 -17.978 130.289 -16.665 QT
130.992 -15.353 130.992 -13.868 QT
130.992 -12.415 130.273 -11.165 QT
129.554 -9.915 128.32 -9.181 QT
127.086 -8.446 125.648 -8.446 QT
cp
125.648 -9.15 M
127.586 -9.15 128.226 -10.556 QT
128.882 -11.962 128.882 -14.134 QT
128.882 -15.353 128.742 -16.15 QT
128.617 -16.946 128.195 -17.587 QT
127.914 -17.993 127.492 -18.29 QT
127.07 -18.603 126.601 -18.759 QT
126.148 -18.915 125.648 -18.915 QT
124.898 -18.915 124.211 -18.571 QT
123.539 -18.228 123.086 -17.587 QT
122.632 -16.915 122.507 -16.087 QT
122.382 -15.275 122.382 -14.134 QT
122.382 -12.775 122.617 -11.696 QT
122.867 -10.618 123.57 -9.884 QT
124.289 -9.15 125.648 -9.15 QT
cp
f
GR
GS
[1 0 0 1.00063 414.0004 33.63791] CT
N
132.373 -6.821 M
132.373 -7.681 132.998 -8.337 QT
133.623 -8.978 134.482 -9.243 QT
133.998 -9.603 133.748 -10.15 QT
133.498 -10.712 133.498 -11.353 QT
133.498 -12.478 134.217 -13.353 QT
133.107 -14.446 133.107 -15.853 QT
133.107 -16.603 133.436 -17.259 QT
133.764 -17.931 134.342 -18.415 QT
134.92 -18.9 135.623 -19.15 QT
136.326 -19.4 137.076 -19.4 QT
138.514 -19.4 139.654 -18.556 QT
140.154 -19.087 140.826 -19.368 QT
141.514 -19.665 142.248 -19.665 QT
142.764 -19.665 143.092 -19.29 QT
143.436 -18.931 143.436 -18.415 QT
143.436 -18.118 143.201 -17.884 QT
142.982 -17.665 142.686 -17.665 QT
142.373 -17.665 142.154 -17.884 QT
141.936 -18.118 141.936 -18.415 QT
141.936 -18.853 142.217 -19.04 QT
140.967 -19.04 140.076 -18.165 QT
140.514 -17.728 140.779 -17.103 QT
141.045 -16.478 141.045 -15.853 QT
141.045 -14.821 140.467 -13.993 QT
139.904 -13.181 138.982 -12.728 QT
138.061 -12.275 137.076 -12.275 QT
135.748 -12.275 134.654 -12.993 QT
134.311 -12.509 134.311 -11.931 QT
134.311 -11.29 134.732 -10.806 QT
135.154 -10.337 135.795 -10.337 QT
137.779 -10.337 L
139.217 -10.337 140.373 -10.071 QT
141.529 -9.806 142.311 -9.025 QT
143.092 -8.259 143.092 -6.821 QT
143.092 -5.759 142.201 -5.056 QT
141.311 -4.353 140.061 -4.04 QT
138.811 -3.728 137.748 -3.728 QT
136.67 -3.728 135.42 -4.04 QT
134.17 -4.353 133.264 -5.056 QT
132.373 -5.759 132.373 -6.821 QT
cp
133.732 -6.821 M
133.732 -6.009 134.389 -5.462 QT
135.061 -4.915 135.982 -4.65 QT
136.92 -4.384 137.748 -4.384 QT
138.561 -4.384 139.498 -4.65 QT
140.436 -4.915 141.076 -5.462 QT
141.732 -6.009 141.732 -6.821 QT
141.732 -8.087 140.576 -8.462 QT
139.42 -8.837 137.779 -8.837 QT
135.795 -8.837 L
135.232 -8.837 134.764 -8.571 QT
134.295 -8.306 134.014 -7.821 QT
133.732 -7.337 133.732 -6.821 QT
cp
137.076 -12.915 M
139.123 -12.915 139.123 -15.853 QT
139.123 -17.103 138.686 -17.915 QT
138.264 -18.743 137.076 -18.743 QT
135.889 -18.743 135.451 -17.915 QT
135.014 -17.103 135.014 -15.853 QT
135.014 -15.04 135.186 -14.384 QT
135.357 -13.743 135.795 -13.321 QT
136.248 -12.915 137.076 -12.915 QT
cp
f
GR
GS
[1 0 0 1.00063 414.0004 33.63791] CT
N
144.77 -11.087 M
144.77 -12.525 145.895 -13.431 QT
147.036 -14.337 148.614 -14.696 QT
150.207 -15.071 151.645 -15.071 QT
151.645 -16.071 L
151.645 -16.759 151.332 -17.415 QT
151.036 -18.071 150.457 -18.493 QT
149.879 -18.915 149.176 -18.915 QT
147.567 -18.915 146.723 -18.196 QT
147.192 -18.196 147.489 -17.837 QT
147.786 -17.493 147.786 -17.04 QT
147.786 -16.556 147.442 -16.212 QT
147.114 -15.868 146.629 -15.868 QT
146.145 -15.868 145.801 -16.212 QT
145.473 -16.556 145.473 -17.04 QT
145.473 -18.321 146.629 -18.931 QT
147.786 -19.556 149.176 -19.556 QT
150.161 -19.556 151.145 -19.134 QT
152.145 -18.712 152.77 -17.931 QT
153.411 -17.15 153.411 -16.118 QT
153.411 -10.665 L
153.411 -10.196 153.598 -9.806 QT
153.801 -9.415 154.223 -9.415 QT
154.629 -9.415 154.817 -9.806 QT
155.02 -10.212 155.02 -10.665 QT
155.02 -12.212 L
155.723 -12.212 L
155.723 -10.665 L
155.723 -10.134 155.442 -9.634 QT
155.161 -9.15 154.676 -8.853 QT
154.207 -8.571 153.645 -8.571 QT
152.942 -8.571 152.426 -9.118 QT
151.911 -9.665 151.848 -10.431 QT
151.411 -9.509 150.536 -8.978 QT
149.661 -8.446 148.661 -8.446 QT
147.739 -8.446 146.848 -8.712 QT
145.957 -8.978 145.364 -9.556 QT
144.77 -10.15 144.77 -11.087 QT
cp
146.723 -11.087 M
146.723 -10.243 147.348 -9.65 QT
147.989 -9.071 148.832 -9.071 QT
149.614 -9.071 150.254 -9.462 QT
150.895 -9.853 151.27 -10.525 QT
151.645 -11.196 151.645 -11.946 QT
151.645 -14.462 L
150.551 -14.462 149.395 -14.103 QT
148.239 -13.743 147.473 -12.978 QT
146.723 -12.212 146.723 -11.087 QT
cp
f
GR
GS
[1 0 0 1.00063 414.0004 33.63791] CT
N
158.37 -11.618 M
158.37 -18.29 L
156.354 -18.29 L
156.354 -18.915 L
157.948 -18.915 158.683 -20.384 QT
159.433 -21.868 159.433 -23.587 QT
160.136 -23.587 L
160.136 -19.134 L
163.542 -19.134 L
163.542 -18.29 L
160.136 -18.29 L
160.136 -11.665 L
160.136 -10.665 160.464 -9.9 QT
160.808 -9.15 161.683 -9.15 QT
162.511 -9.15 162.87 -9.946 QT
163.229 -10.743 163.229 -11.665 QT
163.229 -13.087 L
163.933 -13.087 L
163.933 -11.618 L
163.933 -10.868 163.651 -10.118 QT
163.37 -9.384 162.823 -8.915 QT
162.292 -8.446 161.511 -8.446 QT
160.058 -8.446 159.214 -9.306 QT
158.37 -10.181 158.37 -11.618 QT
cp
f
GR
GS
[1 0 0 1.00063 414.0004 33.63791] CT
N
171.328 -8.446 M
169.859 -8.446 168.625 -9.212 QT
167.391 -9.993 166.687 -11.275 QT
165.984 -12.571 165.984 -14.009 QT
165.984 -15.431 166.625 -16.696 QT
167.266 -17.978 168.422 -18.759 QT
169.578 -19.556 171 -19.556 QT
172.109 -19.556 172.922 -19.181 QT
173.75 -18.806 174.281 -18.15 QT
174.812 -17.493 175.078 -16.587 QT
175.344 -15.696 175.344 -14.618 QT
175.344 -14.306 175.109 -14.306 QT
168.094 -14.306 L
168.094 -14.04 L
168.094 -12.025 168.906 -10.587 QT
169.719 -9.15 171.547 -9.15 QT
172.297 -9.15 172.922 -9.478 QT
173.562 -9.806 174.016 -10.4 QT
174.484 -10.993 174.656 -11.665 QT
174.672 -11.743 174.734 -11.806 QT
174.812 -11.884 174.891 -11.884 QT
175.109 -11.884 L
175.344 -11.884 175.344 -11.571 QT
175.016 -10.196 173.875 -9.321 QT
172.734 -8.446 171.328 -8.446 QT
cp
168.125 -14.9 M
173.641 -14.9 L
173.641 -15.806 173.375 -16.743 QT
173.125 -17.681 172.531 -18.29 QT
171.953 -18.915 171 -18.915 QT
169.625 -18.915 168.875 -17.634 QT
168.125 -16.353 168.125 -14.9 QT
cp
f
GR
GS
[1 0 0 1.00063 414.0004 33.63791] CT
N
184.478 -5.259 M
184.478 -5.837 184.885 -6.29 QT
185.291 -6.728 185.869 -6.728 QT
186.26 -6.728 186.525 -6.493 QT
186.791 -6.243 186.791 -5.853 QT
186.791 -5.415 186.541 -5.071 QT
186.291 -4.728 185.9 -4.571 QT
186.557 -4.384 187.932 -4.384 QT
189.041 -4.384 189.963 -5.243 QT
190.885 -6.087 191.166 -7.212 QT
191.869 -10.04 L
190.557 -8.712 189.135 -8.712 QT
188.103 -8.712 187.353 -9.243 QT
186.619 -9.775 186.228 -10.65 QT
185.853 -11.54 185.853 -12.54 QT
185.853 -13.65 186.307 -14.868 QT
186.76 -16.087 187.572 -17.118 QT
188.4 -18.165 189.463 -18.775 QT
190.525 -19.4 191.713 -19.4 QT
192.416 -19.4 192.978 -19.009 QT
193.541 -18.618 193.885 -17.978 QT
194.119 -18.915 194.916 -18.915 QT
195.228 -18.915 195.432 -18.728 QT
195.65 -18.556 195.65 -18.243 QT
195.65 -18.165 195.635 -18.134 QT
195.635 -18.103 195.619 -18.056 QT
192.869 -7.071 L
192.666 -6.321 192.15 -5.696 QT
191.65 -5.056 190.963 -4.65 QT
190.291 -4.228 189.463 -3.993 QT
188.65 -3.759 187.9 -3.759 QT
186.525 -3.759 185.494 -4.025 QT
184.478 -4.29 184.478 -5.259 QT
cp
189.197 -9.337 M
190.744 -9.337 192.244 -11.462 QT
193.572 -16.743 L
193.4 -17.587 192.9 -18.181 QT
192.416 -18.775 191.65 -18.775 QT
190.853 -18.775 190.135 -18.118 QT
189.432 -17.462 188.947 -16.556 QT
188.51 -15.681 188.088 -14.04 QT
187.666 -12.415 187.666 -11.462 QT
187.666 -10.634 188.041 -9.978 QT
188.416 -9.337 189.197 -9.337 QT
cp
f
GR
GS
[1 0 0 1.00063 0 -0.33331] CT
0 0.447 0.741 RC
1 LJ
3 LW
N
116.4 46.023 M
141.2 77.416 L
166 83.312 L
190.8 87.016 L
215.6 88.251 L
240.4 93.797 L
265.2 105.536 L
290 144.393 L
314.8 181.591 L
339.6 218.786 L
364.4 248.181 L
389.2 319.125 L
414 384.678 L
438.8 428.841 L
463.6 469.462 L
488.4 463.531 L
513.2 447.181 L
538 463.31 L
562.8 424.006 L
587.6 460.597 L
612.4 444.918 L
637.2 467.822 L
662 465.345 L
686.8 469.068 L
711.6 471 L
S
GR
GS
[1 0 0 1.00063 116.4 45.71847] CT
0 0.447 0.741 RC
N
0 -5.5 M
3.038 -5.5 5.5 -3.038 5.5 0 C
5.5 0 L
5.5 3.038 3.038 5.5 0 5.5 C
-3.038 5.5 -5.5 3.038 -5.5 0 C
-5.5 -3.038 -3.038 -5.5 0 -5.5 C
cp
0 -8.5 M
-4.694 -8.5 -8.5 -4.694 -8.5 0 C
-8.5 4.694 -4.694 8.5 0 8.5 C
4.694 8.5 8.5 4.694 8.5 0 C
8.5 0 L
8.5 -4.694 4.694 -8.5 0 -8.5 C
cp
f
GR
GS
[1 0 0 1.00063 141.2 77.13062] CT
0 0.447 0.741 RC
N
/f1978368806{0 -5.5 M
3.038 -5.5 5.5 -3.038 5.5 0 C
5.5 0 L
5.5 3.038 3.038 5.5 0 5.5 C
-3.038 5.5 -5.5 3.038 -5.5 0 C
-5.5 -3.038 -3.038 -5.5 0 -5.5 C
cp
0 -8.5 M
-4.694 -8.5 -8.5 -4.694 -8.5 0 C
-8.5 4.694 -4.694 8.5 0 8.5 C
4.694 8.5 8.5 4.694 8.5 0 C
8.5 0 L
8.5 -4.694 4.694 -8.5 0 -8.5 C
cp}def
f1978368806
f
GR
GS
[1 0 0 1.00063 166 83.03032] CT
0 0.447 0.741 RC
N
f1978368806
f
GR
GS
[1 0 0 1.00063 190.8 86.73752] CT
0 0.447 0.741 RC
N
f1978368806
f
GR
GS
[1 0 0 1.00063 215.60001 87.97242] CT
0 0.447 0.741 RC
N
f1978368806
f
GR
GS
[1 0 0 1.00063 240.39999 93.52212] CT
0 0.447 0.741 RC
N
f1978368806
f
GR
GS
[1 0 0 1.00063 265.19998 105.26847] CT
0 0.447 0.741 RC
N
f1978368806
f
GR
GS
[1 0 0 1.00063 290 144.1502] CT
0 0.447 0.741 RC
N
f1978368806
f
GR
GS
[1 0 0 1.00063 314.79999 181.37172] CT
0 0.447 0.741 RC
N
f1978368806
f
GR
GS
[1 0 0 1.00063 339.60001 218.58981] CT
0 0.447 0.741 RC
N
f1978368806
f
GR
GS
[1 0 0 1.00063 364.39999 248.00306] CT
0 0.447 0.741 RC
N
f1978368806
f
GR
GS
[1 0 0 1.00063 389.20001 318.99125] CT
0 0.447 0.741 RC
N
f1978368806
f
GR
GS
[1 0 0 1.00063 414 384.58477] CT
0 0.447 0.741 RC
N
f1978368806
f
GR
GS
[1 0 0 1.00063 438.80002 428.7759] CT
0 0.447 0.741 RC
N
f1978368806
f
GR
GS
[1 0 0 1.00063 463.59998 469.42246] CT
0 0.447 0.741 RC
N
f1978368806
f
GR
GS
[1 0 0 1.00063 488.39999 463.48772] CT
0 0.447 0.741 RC
N
f1978368806
f
GR
GS
[1 0 0 1.00063 513.20001 447.12736] CT
0 0.447 0.741 RC
N
f1978368806
f
GR
GS
[1 0 0 1.00063 538 463.26605] CT
0 0.447 0.741 RC
N
f1978368806
f
GR
GS
[1 0 0 1.00063 562.79999 423.93758] CT
0 0.447 0.741 RC
N
f1978368806
f
GR
GS
[1 0 0 1.00063 587.59998 460.55201] CT
0 0.447 0.741 RC
N
f1978368806
f
GR
GS
[1 0 0 1.00063 612.40002 444.86283] CT
0 0.447 0.741 RC
N
f1978368806
f
GR
GS
[1 0 0 1.00063 637.20001 467.78074] CT
0 0.447 0.741 RC
N
f1978368806
f
GR
GS
[1 0 0 1.00063 662 465.30275] CT
0 0.447 0.741 RC
N
f1978368806
f
GR
GS
[1 0 0 1.00063 686.79999 469.02783] CT
0 0.447 0.741 RC
N
f1978368806
f
GR
GS
[1 0 0 1.00063 711.60004 470.96123] CT
0 0.447 0.741 RC
N
f1978368806
f
GR
GS
[1 0 0 1.00063 0 -0.33331] CT
0.929 0.694 0.125 RC
1 LJ
3 LW
N
116.4 46.023 M
141.2 63.777 L
166 40 L
190.8 61.994 L
215.6 71.639 L
240.4 81.771 L
265.2 90.074 L
290 110.574 L
314.8 150.511 L
339.6 182.526 L
364.4 221.533 L
389.2 265.397 L
414 301.222 L
438.8 357.453 L
463.6 398.551 L
488.4 447.449 L
513.2 446.096 L
538 458.278 L
562.8 462.542 L
587.6 459.383 L
612.4 446.601 L
637.2 443.878 L
662 447.55 L
686.8 445.3 L
711.6 449.362 L
S
GR
GS
[1 0 0 1.00063 116.4 45.71847] CT
0.929 0.694 0.125 RC
N
f1978368806
f
GR
GS
[1 0 0 1.00063 141.2 63.48356] CT
0.929 0.694 0.125 RC
N
f1978368806
f
GR
GS
[1 0 0 1.00063 166 39.6917] CT
0.929 0.694 0.125 RC
N
f1978368806
f
GR
GS
[1 0 0 1.00063 190.8 61.6995] CT
0.929 0.694 0.125 RC
N
f1978368806
f
GR
GS
[1 0 0 1.00063 215.60001 71.35062] CT
0.929 0.694 0.125 RC
N
f1978368806
f
GR
GS
[1 0 0 1.00063 240.39999 81.4884] CT
0.929 0.694 0.125 RC
N
f1978368806
f
GR
GS
[1 0 0 1.00063 265.19998 89.79726] CT
0.929 0.694 0.125 RC
N
f1978368806
f
GR
GS
[1 0 0 1.00063 290 110.31011] CT
0.929 0.694 0.125 RC
N
f1978368806
f
GR
GS
[1 0 0 1.00063 314.79999 150.27149] CT
0.929 0.694 0.125 RC
N
f1978368806
f
GR
GS
[1 0 0 1.00063 339.60001 182.30704] CT
0.929 0.694 0.125 RC
N
f1978368806
f
GR
GS
[1 0 0 1.00063 364.39999 221.33779] CT
0.929 0.694 0.125 RC
N
f1978368806
f
GR
GS
[1 0 0 1.00063 389.20001 265.23011] CT
0.929 0.694 0.125 RC
N
f1978368806
f
GR
GS
[1 0 0 1.00063 414 301.07735] CT
0.929 0.694 0.125 RC
N
f1978368806
f
GR
GS
[1 0 0 1.00063 438.80002 357.34289] CT
0.929 0.694 0.125 RC
N
f1978368806
f
GR
GS
[1 0 0 1.00063 463.59998 398.46643] CT
0.929 0.694 0.125 RC
N
f1978368806
f
GR
GS
[1 0 0 1.00063 488.39999 447.39551] CT
0.929 0.694 0.125 RC
N
f1978368806
f
GR
GS
[1 0 0 1.00063 513.20001 446.04148] CT
0.929 0.694 0.125 RC
N
f1978368806
f
GR
GS
[1 0 0 1.00063 538 458.23123] CT
0.929 0.694 0.125 RC
N
f1978368806
f
GR
GS
[1 0 0 1.00063 562.79999 462.4983] CT
0.929 0.694 0.125 RC
N
f1978368806
f
GR
GS
[1 0 0 1.00063 587.59998 459.33693] CT
0.929 0.694 0.125 RC
N
f1978368806
f
GR
GS
[1 0 0 1.00063 612.40002 446.54692] CT
0.929 0.694 0.125 RC
N
f1978368806
f
GR
GS
[1 0 0 1.00063 637.20001 443.8218] CT
0.929 0.694 0.125 RC
N
f1978368806
f
GR
GS
[1 0 0 1.00063 662 447.49655] CT
0.929 0.694 0.125 RC
N
f1978368806
f
GR
GS
[1 0 0 1.00063 686.79999 445.24511] CT
0.929 0.694 0.125 RC
N
f1978368806
f
GR
GS
[1 0 0 1.00063 711.60004 449.30976] CT
0.929 0.694 0.125 RC
N
f1978368806
f
GR
GS
[1 0 0 1.00063 327.20001 356.85671] CT
N
0.531 3.639 M
0.438 3.639 0.328 3.53 QT
0.219 3.405 0.219 3.296 QT
0.219 3.124 2.047 1.452 QT
2.047 1.358 2.031 1.296 QT
2.031 1.233 2.016 1.171 QT
2.016 0.217 2.172 -0.767 QT
2.328 -1.751 2.578 -2.72 QT
2.844 -3.704 3.234 -4.767 QT
3.641 -5.829 4.047 -6.626 QT
4.766 -8.079 5.594 -9.158 QT
6.438 -10.236 7.453 -10.236 QT
8.156 -10.236 8.453 -9.751 QT
8.75 -9.283 8.75 -8.564 QT
8.75 -4.533 3.406 0.921 QT
3.313 1.858 3.313 2.264 QT
3.313 5.014 4.578 5.014 QT
5.109 5.014 5.641 4.733 QT
6.172 4.436 6.547 4.108 QT
6.938 3.78 7.609 3.124 QT
7.656 3.077 7.75 3.077 QT
7.859 3.077 7.969 3.217 QT
8.078 3.342 8.078 3.452 QT
8.078 3.53 7.984 3.608 QT
7 4.561 6.219 5.092 QT
5.438 5.608 4.531 5.608 QT
3.375 5.608 2.813 4.608 QT
2.25 3.608 2.094 2.233 QT
1.5 2.827 0.656 3.608 QT
0.641 3.639 0.531 3.639 QT
cp
3.594 -0.142 M
4.766 -1.376 5.781 -2.751 QT
6.797 -4.126 7.484 -5.642 QT
8.172 -7.173 8.172 -8.626 QT
8.172 -9.658 7.438 -9.658 QT
6.656 -9.658 5.828 -7.783 QT
5.016 -5.908 4.438 -3.72 QT
3.859 -1.548 3.594 -0.142 QT
cp
f
GR
GS
[1 0 0 1.00063 327.20001 356.85671] CT
N
16.934 2.358 M
16.746 2.358 16.621 2.217 QT
16.512 2.077 16.512 1.921 QT
16.512 1.733 16.621 1.608 QT
16.746 1.483 16.934 1.483 QT
30.746 1.483 L
30.903 1.483 31.012 1.608 QT
31.137 1.733 31.137 1.921 QT
31.137 2.077 31.012 2.217 QT
30.903 2.358 30.746 2.358 QT
16.934 2.358 L
cp
16.934 -1.923 M
16.746 -1.923 16.621 -2.048 QT
16.512 -2.173 16.512 -2.361 QT
16.512 -2.517 16.621 -2.658 QT
16.746 -2.798 16.934 -2.798 QT
30.746 -2.798 L
30.903 -2.798 31.012 -2.658 QT
31.137 -2.517 31.137 -2.361 QT
31.137 -2.173 31.012 -2.048 QT
30.903 -1.923 30.746 -1.923 QT
16.934 -1.923 L
cp
f
GR
GS
[1 0 0 1.00063 327.20001 356.85671] CT
N
40.547 5.28 M
40.547 4.499 L
43.297 4.499 43.297 3.811 QT
43.297 -7.736 L
42.156 -7.189 40.406 -7.189 QT
40.406 -7.97 L
43.109 -7.97 44.484 -9.376 QT
44.797 -9.376 L
44.875 -9.376 44.937 -9.314 QT
45.015 -9.251 45.015 -9.173 QT
45.015 3.811 L
45.015 4.499 47.765 4.499 QT
47.765 5.28 L
40.547 5.28 L
cp
f
GR
GS
[1 0 0 1.00063 0 -0.33331] CT
0 0.447 0.741 RC
1 LJ
3 LW
N
116.4 45.105 M
141.2 74.199 L
166 65.691 L
190.8 64.101 L
215.6 69.587 L
240.4 73.252 L
265.2 76.526 L
290 104.913 L
314.8 149.18 L
339.6 204.03 L
364.4 256.504 L
389.2 305.24 L
414 361.718 L
438.8 425.612 L
463.6 446.815 L
488.4 444.825 L
513.2 449.653 L
538 453.855 L
562.8 457.677 L
587.6 465.273 L
612.4 454.643 L
637.2 464.64 L
662 464.805 L
686.8 459.918 L
711.6 465.756 L
S
GR
GS
[1 0 0 1.00063 116.4 44.79978] CT
0 0.447 0.741 RC
10.0 ML
3 LW
N
-4.95 -4.95 M
4.95 4.95 L
-4.95 4.95 M
4.95 -4.95 L
S
GR
GS
[1 0 0 1.00063 141.2 73.91237] CT
0 0.447 0.741 RC
10.0 ML
3 LW
N
-4.95 -4.95 M
4.95 4.95 L
-4.95 4.95 M
4.95 -4.95 L
S
GR
GS
[1 0 0 1.00063 166 65.39837] CT
0 0.447 0.741 RC
10.0 ML
3 LW
N
-4.95 -4.95 M
4.95 4.95 L
-4.95 4.95 M
4.95 -4.95 L
S
GR
GS
[1 0 0 1.00063 190.8 63.80732] CT
0 0.447 0.741 RC
10.0 ML
3 LW
N
-4.95 -4.95 M
4.95 4.95 L
-4.95 4.95 M
4.95 -4.95 L
S
GR
GS
[1 0 0 1.00063 215.60001 69.29689] CT
0 0.447 0.741 RC
10.0 ML
3 LW
N
-4.95 -4.95 M
4.95 4.95 L
-4.95 4.95 M
4.95 -4.95 L
S
GR
GS
[1 0 0 1.00063 240.39999 72.96468] CT
0 0.447 0.741 RC
10.0 ML
3 LW
N
-4.95 -4.95 M
4.95 4.95 L
-4.95 4.95 M
4.95 -4.95 L
S
GR
GS
[1 0 0 1.00063 265.19998 76.24025] CT
0 0.447 0.741 RC
10.0 ML
3 LW
N
-4.95 -4.95 M
4.95 4.95 L
-4.95 4.95 M
4.95 -4.95 L
S
GR
GS
[1 0 0 1.00063 290 104.64501] CT
0 0.447 0.741 RC
10.0 ML
3 LW
N
-4.95 -4.95 M
4.95 4.95 L
-4.95 4.95 M
4.95 -4.95 L
S
GR
GS
[1 0 0 1.00063 314.79999 148.94012] CT
0 0.447 0.741 RC
10.0 ML
3 LW
N
-4.95 -4.95 M
4.95 4.95 L
-4.95 4.95 M
4.95 -4.95 L
S
GR
GS
[1 0 0 1.00063 339.60001 203.82382] CT
0 0.447 0.741 RC
10.0 ML
3 LW
N
-4.95 -4.95 M
4.95 4.95 L
-4.95 4.95 M
4.95 -4.95 L
S
GR
GS
[1 0 0 1.00063 364.39999 256.33088] CT
0 0.447 0.741 RC
10.0 ML
3 LW
N
-4.95 -4.95 M
4.95 4.95 L
-4.95 4.95 M
4.95 -4.95 L
S
GR
GS
[1 0 0 1.00063 389.20001 305.09777] CT
0 0.447 0.741 RC
10.0 ML
3 LW
N
-4.95 -4.95 M
4.95 4.95 L
-4.95 4.95 M
4.95 -4.95 L
S
GR
GS
[1 0 0 1.00063 414 361.61081] CT
0 0.447 0.741 RC
10.0 ML
3 LW
N
-4.95 -4.95 M
4.95 4.95 L
-4.95 4.95 M
4.95 -4.95 L
S
GR
GS
[1 0 0 1.00063 438.80002 425.5446] CT
0 0.447 0.741 RC
10.0 ML
3 LW
N
-4.95 -4.95 M
4.95 4.95 L
-4.95 4.95 M
4.95 -4.95 L
S
GR
GS
[1 0 0 1.00063 463.59998 446.76095] CT
0 0.447 0.741 RC
10.0 ML
3 LW
N
-4.95 -4.95 M
4.95 4.95 L
-4.95 4.95 M
4.95 -4.95 L
S
GR
GS
[1 0 0 1.00063 488.39999 444.77002] CT
0 0.447 0.741 RC
10.0 ML
3 LW
N
-4.95 -4.95 M
4.95 4.95 L
-4.95 4.95 M
4.95 -4.95 L
S
GR
GS
[1 0 0 1.00063 513.20001 449.6005] CT
0 0.447 0.741 RC
10.0 ML
3 LW
N
-4.95 -4.95 M
4.95 4.95 L
-4.95 4.95 M
4.95 -4.95 L
S
GR
GS
[1 0 0 1.00063 538 453.80598] CT
0 0.447 0.741 RC
10.0 ML
3 LW
N
-4.95 -4.95 M
4.95 4.95 L
-4.95 4.95 M
4.95 -4.95 L
S
GR
GS
[1 0 0 1.00063 562.79999 457.62984] CT
0 0.447 0.741 RC
10.0 ML
3 LW
N
-4.95 -4.95 M
4.95 4.95 L
-4.95 4.95 M
4.95 -4.95 L
S
GR
GS
[1 0 0 1.00063 587.59998 465.23087] CT
0 0.447 0.741 RC
10.0 ML
3 LW
N
-4.95 -4.95 M
4.95 4.95 L
-4.95 4.95 M
4.95 -4.95 L
S
GR
GS
[1 0 0 1.00063 612.40002 454.59404] CT
0 0.447 0.741 RC
10.0 ML
3 LW
N
-4.95 -4.95 M
4.95 4.95 L
-4.95 4.95 M
4.95 -4.95 L
S
GR
GS
[1 0 0 1.00063 637.20001 464.59678] CT
0 0.447 0.741 RC
10.0 ML
3 LW
N
-4.95 -4.95 M
4.95 4.95 L
-4.95 4.95 M
4.95 -4.95 L
S
GR
GS
[1 0 0 1.00063 662 464.76226] CT
0 0.447 0.741 RC
10.0 ML
3 LW
N
-4.95 -4.95 M
4.95 4.95 L
-4.95 4.95 M
4.95 -4.95 L
S
GR
GS
[1 0 0 1.00063 686.79999 459.87199] CT
0 0.447 0.741 RC
10.0 ML
3 LW
N
-4.95 -4.95 M
4.95 4.95 L
-4.95 4.95 M
4.95 -4.95 L
S
GR
GS
[1 0 0 1.00063 711.60004 465.71347] CT
0 0.447 0.741 RC
10.0 ML
3 LW
N
-4.95 -4.95 M
4.95 4.95 L
-4.95 4.95 M
4.95 -4.95 L
S
GR
GS
[1 0 0 1.00063 0 -0.33331] CT
0.929 0.694 0.125 RC
1 LJ
3 LW
N
116.4 45.105 M
141.2 49.375 L
166 69.729 L
190.8 75.661 L
215.6 80.545 L
240.4 87.09 L
265.2 89.789 L
290 112.18 L
314.8 152.987 L
339.6 184.355 L
364.4 223.226 L
389.2 265.059 L
414 307.122 L
438.8 355.782 L
463.6 390.782 L
488.4 456.926 L
513.2 459.084 L
538 463.777 L
562.8 464.31 L
587.6 458.744 L
612.4 464.611 L
637.2 454.617 L
662 460.083 L
686.8 464.936 L
711.6 461.737 L
S
GR
GS
[1 0 0 1.00063 116.4 44.79978] CT
0.929 0.694 0.125 RC
10.0 ML
3 LW
N
-4.95 -4.95 M
4.95 4.95 L
-4.95 4.95 M
4.95 -4.95 L
S
GR
GS
[1 0 0 1.00063 141.2 49.07229] CT
0.929 0.694 0.125 RC
10.0 ML
3 LW
N
-4.95 -4.95 M
4.95 4.95 L
-4.95 4.95 M
4.95 -4.95 L
S
GR
GS
[1 0 0 1.00063 166 69.43925] CT
0.929 0.694 0.125 RC
10.0 ML
3 LW
N
-4.95 -4.95 M
4.95 4.95 L
-4.95 4.95 M
4.95 -4.95 L
S
GR
GS
[1 0 0 1.00063 190.8 75.37513] CT
0.929 0.694 0.125 RC
10.0 ML
3 LW
N
-4.95 -4.95 M
4.95 4.95 L
-4.95 4.95 M
4.95 -4.95 L
S
GR
GS
[1 0 0 1.00063 215.60001 80.26211] CT
0.929 0.694 0.125 RC
10.0 ML
3 LW
N
-4.95 -4.95 M
4.95 4.95 L
-4.95 4.95 M
4.95 -4.95 L
S
GR
GS
[1 0 0 1.00063 240.39999 86.81145] CT
0.929 0.694 0.125 RC
10.0 ML
3 LW
N
-4.95 -4.95 M
4.95 4.95 L
-4.95 4.95 M
4.95 -4.95 L
S
GR
GS
[1 0 0 1.00063 265.19998 89.5118] CT
0.929 0.694 0.125 RC
10.0 ML
3 LW
N
-4.95 -4.95 M
4.95 4.95 L
-4.95 4.95 M
4.95 -4.95 L
S
GR
GS
[1 0 0 1.00063 290 111.91673] CT
0.929 0.694 0.125 RC
10.0 ML
3 LW
N
-4.95 -4.95 M
4.95 4.95 L
-4.95 4.95 M
4.95 -4.95 L
S
GR
GS
[1 0 0 1.00063 314.79999 152.74901] CT
0.929 0.694 0.125 RC
10.0 ML
3 LW
N
-4.95 -4.95 M
4.95 4.95 L
-4.95 4.95 M
4.95 -4.95 L
S
GR
GS
[1 0 0 1.00063 339.60001 184.13717] CT
0.929 0.694 0.125 RC
10.0 ML
3 LW
N
-4.95 -4.95 M
4.95 4.95 L
-4.95 4.95 M
4.95 -4.95 L
S
GR
GS
[1 0 0 1.00063 364.39999 223.03233] CT
0.929 0.694 0.125 RC
10.0 ML
3 LW
N
-4.95 -4.95 M
4.95 4.95 L
-4.95 4.95 M
4.95 -4.95 L
S
GR
GS
[1 0 0 1.00063 389.20001 264.89137] CT
0.929 0.694 0.125 RC
10.0 ML
3 LW
N
-4.95 -4.95 M
4.95 4.95 L
-4.95 4.95 M
4.95 -4.95 L
S
GR
GS
[1 0 0 1.00063 414 306.98109] CT
0.929 0.694 0.125 RC
10.0 ML
3 LW
N
-4.95 -4.95 M
4.95 4.95 L
-4.95 4.95 M
4.95 -4.95 L
S
GR
GS
[1 0 0 1.00063 438.80002 355.67146] CT
0.929 0.694 0.125 RC
10.0 ML
3 LW
N
-4.95 -4.95 M
4.95 4.95 L
-4.95 4.95 M
4.95 -4.95 L
S
GR
GS
[1 0 0 1.00063 463.59998 390.69289] CT
0.929 0.694 0.125 RC
10.0 ML
3 LW
N
-4.95 -4.95 M
4.95 4.95 L
-4.95 4.95 M
4.95 -4.95 L
S
GR
GS
[1 0 0 1.00063 488.39999 456.87806] CT
0.929 0.694 0.125 RC
10.0 ML
3 LW
N
-4.95 -4.95 M
4.95 4.95 L
-4.95 4.95 M
4.95 -4.95 L
S
GR
GS
[1 0 0 1.00063 513.20001 459.03739] CT
0.929 0.694 0.125 RC
10.0 ML
3 LW
N
-4.95 -4.95 M
4.95 4.95 L
-4.95 4.95 M
4.95 -4.95 L
S
GR
GS
[1 0 0 1.00063 538 463.73357] CT
0.929 0.694 0.125 RC
10.0 ML
3 LW
N
-4.95 -4.95 M
4.95 4.95 L
-4.95 4.95 M
4.95 -4.95 L
S
GR
GS
[1 0 0 1.00063 562.79999 464.26738] CT
0.929 0.694 0.125 RC
10.0 ML
3 LW
N
-4.95 -4.95 M
4.95 4.95 L
-4.95 4.95 M
4.95 -4.95 L
S
GR
GS
[1 0 0 1.00063 587.59998 458.69719] CT
0.929 0.694 0.125 RC
10.0 ML
3 LW
N
-4.95 -4.95 M
4.95 4.95 L
-4.95 4.95 M
4.95 -4.95 L
S
GR
GS
[1 0 0 1.00063 612.40002 464.56853] CT
0.929 0.694 0.125 RC
10.0 ML
3 LW
N
-4.95 -4.95 M
4.95 4.95 L
-4.95 4.95 M
4.95 -4.95 L
S
GR
GS
[1 0 0 1.00063 637.20001 454.56753] CT
0.929 0.694 0.125 RC
10.0 ML
3 LW
N
-4.95 -4.95 M
4.95 4.95 L
-4.95 4.95 M
4.95 -4.95 L
S
GR
GS
[1 0 0 1.00063 662 460.03692] CT
0.929 0.694 0.125 RC
10.0 ML
3 LW
N
-4.95 -4.95 M
4.95 4.95 L
-4.95 4.95 M
4.95 -4.95 L
S
GR
GS
[1 0 0 1.00063 686.79999 464.89314] CT
0.929 0.694 0.125 RC
10.0 ML
3 LW
N
-4.95 -4.95 M
4.95 4.95 L
-4.95 4.95 M
4.95 -4.95 L
S
GR
GS
[1 0 0 1.00063 711.60004 461.69274] CT
0.929 0.694 0.125 RC
10.0 ML
3 LW
N
-4.95 -4.95 M
4.95 4.95 L
-4.95 4.95 M
4.95 -4.95 L
S
GR
GS
[1 0 0 1.00063 414 243.82709] CT
N
/f-117093690{0.531 3.639 M
0.438 3.639 0.328 3.53 QT
0.219 3.405 0.219 3.296 QT
0.219 3.124 2.047 1.452 QT
2.047 1.358 2.031 1.296 QT
2.031 1.233 2.016 1.171 QT
2.016 0.217 2.172 -0.767 QT
2.328 -1.751 2.578 -2.72 QT
2.844 -3.704 3.234 -4.767 QT
3.641 -5.829 4.047 -6.626 QT
4.766 -8.079 5.594 -9.158 QT
6.438 -10.236 7.453 -10.236 QT
8.156 -10.236 8.453 -9.751 QT
8.75 -9.283 8.75 -8.564 QT
8.75 -4.533 3.406 0.921 QT
3.313 1.858 3.313 2.264 QT
3.313 5.014 4.578 5.014 QT
5.109 5.014 5.641 4.733 QT
6.172 4.436 6.547 4.108 QT
6.938 3.78 7.609 3.124 QT
7.656 3.077 7.75 3.077 QT
7.859 3.077 7.969 3.217 QT
8.078 3.342 8.078 3.452 QT
8.078 3.53 7.984 3.608 QT
7 4.561 6.219 5.092 QT
5.438 5.608 4.531 5.608 QT
3.375 5.608 2.813 4.608 QT
2.25 3.608 2.094 2.233 QT
1.5 2.827 0.656 3.608 QT
0.641 3.639 0.531 3.639 QT
cp
3.594 -0.142 M
4.766 -1.376 5.781 -2.751 QT
6.797 -4.126 7.484 -5.642 QT
8.172 -7.173 8.172 -8.626 QT
8.172 -9.658 7.438 -9.658 QT
6.656 -9.658 5.828 -7.783 QT
5.016 -5.908 4.438 -3.72 QT
3.859 -1.548 3.594 -0.142 QT
cp}def
f-117093690
f
GR
GS
[1 0 0 1.00063 414 243.82709] CT
N
/f-618120624{16.934 2.358 M
16.746 2.358 16.621 2.217 QT
16.512 2.077 16.512 1.921 QT
16.512 1.733 16.621 1.608 QT
16.746 1.483 16.934 1.483 QT
30.746 1.483 L
30.903 1.483 31.012 1.608 QT
31.137 1.733 31.137 1.921 QT
31.137 2.077 31.012 2.217 QT
30.903 2.358 30.746 2.358 QT
16.934 2.358 L
cp
16.934 -1.923 M
16.746 -1.923 16.621 -2.048 QT
16.512 -2.173 16.512 -2.361 QT
16.512 -2.517 16.621 -2.658 QT
16.746 -2.798 16.934 -2.798 QT
30.746 -2.798 L
30.903 -2.798 31.012 -2.658 QT
31.137 -2.517 31.137 -2.361 QT
31.137 -2.173 31.012 -2.048 QT
30.903 -1.923 30.746 -1.923 QT
16.934 -1.923 L
cp}def
f-618120624
f
GR
GS
[1 0 0 1.00063 414 243.82709] CT
N
/f-154556592{39.594 5.28 M
39.594 4.686 L
39.594 4.639 39.64 4.577 QT
43.062 0.796 L
43.828 -0.048 44.312 -0.611 QT
44.797 -1.189 45.265 -1.923 QT
45.734 -2.673 46 -3.439 QT
46.281 -4.204 46.281 -5.064 QT
46.281 -5.97 45.953 -6.783 QT
45.625 -7.611 44.953 -8.095 QT
44.297 -8.595 43.359 -8.595 QT
42.406 -8.595 41.64 -8.017 QT
40.89 -7.454 40.578 -6.533 QT
40.656 -6.564 40.812 -6.564 QT
41.297 -6.564 41.64 -6.22 QT
42 -5.892 42 -5.361 QT
42 -4.861 41.64 -4.501 QT
41.297 -4.158 40.812 -4.158 QT
40.297 -4.158 39.937 -4.517 QT
39.594 -4.876 39.594 -5.361 QT
39.594 -6.189 39.906 -6.908 QT
40.219 -7.642 40.797 -8.204 QT
41.39 -8.767 42.125 -9.064 QT
42.859 -9.376 43.687 -9.376 QT
44.953 -9.376 46.031 -8.845 QT
47.109 -8.314 47.75 -7.329 QT
48.39 -6.361 48.39 -5.064 QT
48.39 -4.111 47.969 -3.251 QT
47.547 -2.392 46.89 -1.689 QT
46.234 -0.986 45.203 -0.095 QT
44.187 0.796 43.875 1.108 QT
41.375 3.499 L
43.5 3.499 L
45.047 3.499 46.094 3.467 QT
47.14 3.436 47.219 3.389 QT
47.469 3.108 47.734 1.358 QT
48.39 1.358 L
47.765 5.28 L
39.594 5.28 L
cp}def
f-154556592
f
GR
GS
[1 0 0 1.00063 0 -0.33331] CT
1 GC
N
716 149 M
716 48 L
578 48 L
578 149 L
cp
f
GR
GS
[1 0 0 1.00063 614.87708 61.64893] CT
N
/f1321960797{0.469 3.283 M
0.391 3.283 0.281 3.174 QT
0.188 3.064 0.188 2.971 QT
0.188 2.814 1.844 1.314 QT
1.844 1.221 1.828 1.174 QT
1.828 1.111 1.813 1.049 QT
1.813 0.205 1.953 -0.686 QT
2.094 -1.576 2.328 -2.451 QT
2.563 -3.326 2.922 -4.279 QT
3.281 -5.248 3.641 -5.951 QT
4.281 -7.264 5.031 -8.232 QT
5.797 -9.201 6.703 -9.201 QT
7.344 -9.201 7.609 -8.764 QT
7.875 -8.342 7.875 -7.701 QT
7.875 -4.076 3.063 0.83 QT
2.984 1.674 2.984 2.033 QT
2.984 4.518 4.125 4.518 QT
4.594 4.518 5.078 4.268 QT
5.563 4.002 5.906 3.705 QT
6.25 3.393 6.859 2.814 QT
6.891 2.768 6.969 2.768 QT
7.078 2.768 7.172 2.893 QT
7.266 3.002 7.266 3.111 QT
7.266 3.174 7.188 3.236 QT
6.297 4.111 5.594 4.58 QT
4.891 5.049 4.078 5.049 QT
3.031 5.049 2.516 4.158 QT
2.016 3.252 1.891 2.018 QT
1.359 2.549 0.594 3.236 QT
0.578 3.283 0.469 3.283 QT
cp
3.234 -0.123 M
4.281 -1.248 5.203 -2.482 QT
6.125 -3.717 6.734 -5.076 QT
7.344 -6.451 7.344 -7.764 QT
7.344 -8.701 6.688 -8.701 QT
5.984 -8.701 5.25 -7.014 QT
4.516 -5.326 3.984 -3.357 QT
3.469 -1.389 3.234 -0.123 QT
cp}def
f1321960797
f
GR
GS
[1 0 0 1.00063 614.87708 61.64893] CT
N
/f-1751164295{15.234 2.127 M
15.078 2.127 14.969 2.002 QT
14.859 1.877 14.859 1.721 QT
14.859 1.564 14.969 1.455 QT
15.078 1.33 15.234 1.33 QT
27.672 1.33 L
27.812 1.33 27.922 1.455 QT
28.031 1.564 28.031 1.721 QT
28.031 1.877 27.922 2.002 QT
27.812 2.127 27.672 2.127 QT
15.234 2.127 L
cp
15.234 -1.717 M
15.078 -1.717 14.969 -1.826 QT
14.859 -1.951 14.859 -2.123 QT
14.859 -2.264 14.969 -2.389 QT
15.078 -2.514 15.234 -2.514 QT
27.672 -2.514 L
27.812 -2.514 27.922 -2.389 QT
28.031 -2.264 28.031 -2.123 QT
28.031 -1.951 27.922 -1.826 QT
27.812 -1.717 27.672 -1.717 QT
15.234 -1.717 L
cp}def
f-1751164295
f
GR
GS
[1 0 0 1.00063 614.87708 61.64893] CT
N
/f963150877{36.494 4.752 M
36.494 4.049 L
38.962 4.049 38.962 3.424 QT
38.962 -6.967 L
37.931 -6.467 36.369 -6.467 QT
36.369 -7.17 L
38.79 -7.17 40.04 -8.436 QT
40.322 -8.436 L
40.384 -8.436 40.447 -8.373 QT
40.509 -8.326 40.509 -8.264 QT
40.509 3.424 L
40.509 4.049 42.978 4.049 QT
42.978 4.752 L
36.494 4.752 L
cp}def
f963150877
f
GR
GS
[1 0 0 1.00063 614.87708 61.64893] CT
N
/f-253247732{46.519 8.314 M
46.519 8.236 46.597 8.158 QT
47.3 7.471 47.69 6.564 QT
48.097 5.674 48.097 4.674 QT
48.097 4.439 L
47.784 4.752 47.3 4.752 QT
46.847 4.752 46.519 4.439 QT
46.206 4.111 46.206 3.658 QT
46.206 3.189 46.519 2.893 QT
46.847 2.58 47.3 2.58 QT
48.003 2.58 48.3 3.236 QT
48.612 3.877 48.612 4.674 QT
48.612 5.783 48.175 6.768 QT
47.737 7.752 46.925 8.549 QT
46.847 8.596 46.8 8.596 QT
46.706 8.596 46.612 8.502 QT
46.519 8.408 46.519 8.314 QT
cp}def
f-253247732
f
GR
GS
[1 0 0 1.00063 614.87708 61.64893] CT
N
/f2056446342{58.665 2.377 M
58.665 -3.092 L
57.025 -3.092 L
57.025 -3.607 L
58.322 -3.607 58.931 -4.811 QT
59.54 -6.014 59.54 -7.436 QT
60.103 -7.436 L
60.103 -3.779 L
62.9 -3.779 L
62.9 -3.092 L
60.103 -3.092 L
60.103 2.33 L
60.103 3.158 60.384 3.783 QT
60.665 4.393 61.384 4.393 QT
62.056 4.393 62.353 3.752 QT
62.65 3.096 62.65 2.33 QT
62.65 1.158 L
63.228 1.158 L
63.228 2.377 L
63.228 2.986 62.994 3.596 QT
62.775 4.205 62.322 4.596 QT
61.884 4.971 61.244 4.971 QT
60.056 4.971 59.353 4.268 QT
58.665 3.549 58.665 2.377 QT
cp}def
f2056446342
f
GR
GS
[1 0 0 1.00063 614.87708 61.64893] CT
N
/f1609743284{69.287 4.971 M
68.069 4.971 67.053 4.346 QT
66.053 3.705 65.475 2.658 QT
64.897 1.596 64.897 0.408 QT
64.897 -0.748 65.428 -1.795 QT
65.959 -2.842 66.897 -3.482 QT
67.834 -4.123 69.006 -4.123 QT
69.912 -4.123 70.584 -3.811 QT
71.256 -3.514 71.678 -2.967 QT
72.116 -2.436 72.334 -1.701 QT
72.569 -0.967 72.569 -0.076 QT
72.569 0.174 72.366 0.174 QT
66.631 0.174 L
66.631 0.393 L
66.631 2.033 67.287 3.221 QT
67.959 4.393 69.459 4.393 QT
70.069 4.393 70.584 4.127 QT
71.1 3.846 71.475 3.377 QT
71.866 2.893 71.991 2.33 QT
72.022 2.268 72.069 2.221 QT
72.116 2.158 72.194 2.158 QT
72.366 2.158 L
72.569 2.158 72.569 2.408 QT
72.287 3.533 71.35 4.252 QT
70.428 4.971 69.287 4.971 QT
cp
66.647 -0.311 M
71.162 -0.311 L
71.162 -1.061 70.959 -1.826 QT
70.756 -2.592 70.272 -3.092 QT
69.787 -3.607 69.006 -3.607 QT
67.881 -3.607 67.256 -2.545 QT
66.647 -1.498 66.647 -0.311 QT
cp}def
f1609743284
f
GR
GS
[1 0 0 1.00063 614.87708 61.64893] CT
N
/f1798062489{73.744 4.752 M
73.744 4.049 L
74.415 4.049 74.853 3.955 QT
75.29 3.846 75.29 3.424 QT
75.29 -1.982 L
75.29 -2.514 75.119 -2.748 QT
74.962 -2.982 74.665 -3.029 QT
74.369 -3.092 73.744 -3.092 QT
73.744 -3.779 L
76.603 -3.998 L
76.603 -2.061 L
77.009 -2.92 77.775 -3.451 QT
78.556 -3.998 79.478 -3.998 QT
80.853 -3.998 81.54 -3.342 QT
82.244 -2.686 82.244 -1.326 QT
82.244 3.424 L
82.244 3.846 82.665 3.955 QT
83.103 4.049 83.79 4.049 QT
83.79 4.752 L
79.244 4.752 L
79.244 4.049 L
79.931 4.049 80.353 3.955 QT
80.79 3.846 80.79 3.424 QT
80.79 -1.264 L
80.79 -2.232 80.509 -2.857 QT
80.228 -3.482 79.369 -3.482 QT
78.212 -3.482 77.478 -2.561 QT
76.744 -1.654 76.744 -0.482 QT
76.744 3.424 L
76.744 3.846 77.165 3.955 QT
77.603 4.049 78.275 4.049 QT
78.275 4.752 L
73.744 4.752 L
cp}def
f1798062489
f
GR
GS
[1 0 0 1.00063 614.87708 61.64893] CT
N
/f102985344{84.806 4.814 M
84.806 1.58 L
84.806 1.424 84.978 1.424 QT
85.228 1.424 L
85.337 1.424 85.384 1.58 QT
85.931 4.455 88.041 4.455 QT
88.978 4.455 89.603 4.033 QT
90.244 3.596 90.244 2.705 QT
90.244 2.08 89.744 1.627 QT
89.259 1.174 88.587 1.018 QT
87.259 0.752 L
86.603 0.611 86.056 0.314 QT
85.509 0.002 85.15 -0.482 QT
84.806 -0.982 84.806 -1.654 QT
84.806 -2.514 85.259 -3.061 QT
85.728 -3.623 86.462 -3.873 QT
87.197 -4.123 88.041 -4.123 QT
89.056 -4.123 89.822 -3.576 QT
90.384 -4.076 L
90.384 -4.123 90.478 -4.123 QT
90.619 -4.123 L
90.681 -4.123 90.728 -4.061 QT
90.775 -4.014 90.775 -3.951 QT
90.775 -1.373 L
90.775 -1.186 90.619 -1.186 QT
90.384 -1.186 L
90.212 -1.186 90.212 -1.373 QT
90.212 -2.404 89.634 -3.029 QT
89.056 -3.654 88.025 -3.654 QT
87.134 -3.654 86.478 -3.326 QT
85.837 -2.998 85.837 -2.201 QT
85.837 -1.654 86.306 -1.295 QT
86.775 -0.936 87.4 -0.779 QT
88.744 -0.529 L
89.416 -0.389 89.994 -0.014 QT
90.587 0.361 90.931 0.924 QT
91.275 1.471 91.275 2.174 QT
91.275 2.893 91.025 3.424 QT
90.775 3.955 90.337 4.299 QT
89.9 4.643 89.291 4.799 QT
88.697 4.971 88.041 4.971 QT
86.806 4.971 85.931 4.143 QT
85.197 4.924 L
85.197 4.971 85.103 4.971 QT
84.978 4.971 L
84.806 4.971 84.806 4.814 QT
cp}def
f102985344
f
GR
GS
[1 0 0 1.00063 614.87708 61.64893] CT
N
/f1232705470{93.616 3.658 M
93.616 3.221 93.944 2.908 QT
94.272 2.58 94.71 2.58 QT
94.991 2.58 95.241 2.721 QT
95.507 2.861 95.647 3.127 QT
95.804 3.393 95.804 3.658 QT
95.804 4.096 95.476 4.424 QT
95.163 4.752 94.71 4.752 QT
94.272 4.752 93.944 4.424 QT
93.616 4.096 93.616 3.658 QT
cp}def
f1232705470
f
GR
GS
[1 0 0 1.00063 0 -0.33331] CT
0 0.447 0.741 RC
1 LJ
3 LW
N
581.987 61.944 M
611.887 61.944 L
S
GR
GS
[1 0 0 1.00063 596.93689 61.64893] CT
0 0.447 0.741 RC
N
f1978368806
f
GR
GS
[1 0 0 1.00063 614.87708 86.03516] CT
N
f1321960797
f
GR
GS
[1 0 0 1.00063 614.87708 86.03516] CT
N
f-1751164295
f
GR
GS
[1 0 0 1.00063 614.87708 86.03516] CT
N
/f-1042216227{35.634 4.752 M
35.634 4.221 L
35.634 4.174 35.681 4.111 QT
38.744 0.705 L
39.447 -0.045 39.884 -0.545 QT
40.322 -1.061 40.744 -1.732 QT
41.165 -2.404 41.415 -3.092 QT
41.665 -3.779 41.665 -4.561 QT
41.665 -5.373 41.353 -6.107 QT
41.056 -6.842 40.462 -7.279 QT
39.869 -7.732 39.025 -7.732 QT
38.165 -7.732 37.478 -7.217 QT
36.79 -6.701 36.509 -5.889 QT
36.587 -5.904 36.728 -5.904 QT
37.165 -5.904 37.478 -5.592 QT
37.806 -5.295 37.806 -4.826 QT
37.806 -4.373 37.478 -4.061 QT
37.165 -3.748 36.728 -3.748 QT
36.259 -3.748 35.947 -4.061 QT
35.634 -4.389 35.634 -4.826 QT
35.634 -5.576 35.915 -6.217 QT
36.197 -6.873 36.712 -7.373 QT
37.244 -7.889 37.9 -8.154 QT
38.572 -8.436 39.322 -8.436 QT
40.447 -8.436 41.415 -7.951 QT
42.4 -7.482 42.962 -6.607 QT
43.54 -5.732 43.54 -4.561 QT
43.54 -3.701 43.165 -2.92 QT
42.79 -2.154 42.197 -1.514 QT
41.603 -0.889 40.681 -0.076 QT
39.775 0.721 39.478 0.986 QT
37.244 3.143 L
39.15 3.143 L
40.54 3.143 41.478 3.127 QT
42.431 3.096 42.494 3.049 QT
42.728 2.799 42.962 1.221 QT
43.54 1.221 L
42.978 4.752 L
35.634 4.752 L
cp}def
f-1042216227
f
GR
GS
[1 0 0 1.00063 614.87708 86.03516] CT
N
f-253247732
f
GR
GS
[1 0 0 1.00063 614.87708 86.03516] CT
N
f2056446342
f
GR
GS
[1 0 0 1.00063 614.87708 86.03516] CT
N
f1609743284
f
GR
GS
[1 0 0 1.00063 614.87708 86.03516] CT
N
f1798062489
f
GR
GS
[1 0 0 1.00063 614.87708 86.03516] CT
N
f102985344
f
GR
GS
[1 0 0 1.00063 614.87708 86.03516] CT
N
f1232705470
f
GR
GS
[1 0 0 1.00063 0 -0.33331] CT
0.929 0.694 0.125 RC
1 LJ
3 LW
N
581.987 86.314 M
611.887 86.314 L
S
GR
GS
[1 0 0 1.00063 596.93689 86.03516] CT
0.929 0.694 0.125 RC
N
f1978368806
f
GR
GS
[1 0 0 1.00063 614.87708 110.42141] CT
N
f1321960797
f
GR
GS
[1 0 0 1.00063 614.87708 110.42141] CT
N
f-1751164295
f
GR
GS
[1 0 0 1.00063 614.87708 110.42141] CT
N
f963150877
f
GR
GS
[1 0 0 1.00063 614.87708 110.42141] CT
N
f-253247732
f
GR
GS
[1 0 0 1.00063 614.87708 110.42141] CT
N
/f-1202009093{57.29 4.752 M
57.29 4.049 L
57.962 4.049 58.384 3.955 QT
58.822 3.846 58.822 3.424 QT
58.822 -3.092 L
57.306 -3.092 L
57.306 -3.779 L
58.822 -3.779 L
58.822 -6.154 L
58.822 -6.795 59.087 -7.342 QT
59.353 -7.904 59.806 -8.311 QT
60.259 -8.732 60.837 -8.967 QT
61.431 -9.201 62.056 -9.201 QT
62.728 -9.201 63.259 -8.811 QT
63.79 -8.42 63.79 -7.764 QT
63.79 -7.373 63.525 -7.123 QT
63.275 -6.873 62.9 -6.873 QT
62.525 -6.873 62.259 -7.123 QT
61.994 -7.373 61.994 -7.764 QT
61.994 -8.373 62.525 -8.592 QT
62.212 -8.701 61.962 -8.701 QT
61.384 -8.701 60.962 -8.279 QT
60.556 -7.873 60.353 -7.279 QT
60.15 -6.686 60.15 -6.107 QT
60.15 -3.779 L
62.431 -3.779 L
62.431 -3.092 L
60.212 -3.092 L
60.212 3.424 L
60.212 3.83 60.79 3.939 QT
61.384 4.049 62.134 4.049 QT
62.134 4.752 L
57.29 4.752 L
cp}def
f-1202009093
f
GR
GS
[1 0 0 1.00063 614.87708 110.42141] CT
N
/f-109970322{64.841 2.393 M
64.841 -1.982 L
64.841 -2.514 64.669 -2.748 QT
64.512 -2.982 64.216 -3.029 QT
63.919 -3.092 63.294 -3.092 QT
63.294 -3.779 L
66.294 -3.998 L
66.294 2.393 L
66.294 3.174 66.403 3.611 QT
66.512 4.033 66.872 4.252 QT
67.231 4.455 68.028 4.455 QT
69.091 4.455 69.716 3.564 QT
70.341 2.674 70.341 1.549 QT
70.341 -1.982 L
70.341 -2.514 70.169 -2.748 QT
70.012 -2.982 69.716 -3.029 QT
69.434 -3.092 68.794 -3.092 QT
68.794 -3.779 L
71.794 -3.998 L
71.794 2.955 L
71.794 3.471 71.95 3.721 QT
72.106 3.955 72.403 4.002 QT
72.7 4.049 73.341 4.049 QT
73.341 4.752 L
70.403 4.971 L
70.403 3.299 L
70.044 4.049 69.372 4.518 QT
68.716 4.971 67.934 4.971 QT
66.512 4.971 65.669 4.377 QT
64.841 3.768 64.841 2.393 QT
cp}def
f-109970322
f
GR
GS
[1 0 0 1.00063 614.87708 110.42141] CT
N
/f-2086964723{74.309 4.752 M
74.309 4.049 L
74.981 4.049 75.419 3.955 QT
75.856 3.846 75.856 3.424 QT
75.856 -6.967 L
75.856 -7.498 75.7 -7.732 QT
75.544 -7.967 75.231 -8.014 QT
74.934 -8.076 74.309 -8.076 QT
74.309 -8.764 L
77.247 -8.982 L
77.247 3.424 L
77.247 3.846 77.684 3.955 QT
78.122 4.049 78.778 4.049 QT
78.778 4.752 L
74.309 4.752 L
cp}def
f-2086964723
f
GR
GS
[1 0 0 1.00063 614.87708 110.42141] CT
N
/f646145173{79.809 4.752 M
79.809 4.049 L
80.481 4.049 80.919 3.955 QT
81.356 3.846 81.356 3.424 QT
81.356 -6.967 L
81.356 -7.498 81.2 -7.732 QT
81.044 -7.967 80.731 -8.014 QT
80.434 -8.076 79.809 -8.076 QT
79.809 -8.764 L
82.747 -8.982 L
82.747 3.424 L
82.747 3.846 83.184 3.955 QT
83.622 4.049 84.278 4.049 QT
84.278 4.752 L
79.809 4.752 L
cp}def
f646145173
f
GR
GS
[1 0 0 1.00063 0 -0.33331] CT
0 0.447 0.741 RC
1 LJ
3 LW
N
581.987 110.686 M
611.887 110.686 L
S
GR
GS
[1 0 0 1.00063 596.93689 110.42141] CT
0 0.447 0.741 RC
10.0 ML
3 LW
N
-4.95 -4.95 M
4.95 4.95 L
-4.95 4.95 M
4.95 -4.95 L
S
GR
GS
[1 0 0 1.00063 614.87708 134.80763] CT
N
f1321960797
f
GR
GS
[1 0 0 1.00063 614.87708 134.80763] CT
N
f-1751164295
f
GR
GS
[1 0 0 1.00063 614.87708 134.80763] CT
N
f-1042216227
f
GR
GS
[1 0 0 1.00063 614.87708 134.80763] CT
N
f-253247732
f
GR
GS
[1 0 0 1.00063 614.87708 134.80763] CT
N
f-1202009093
f
GR
GS
[1 0 0 1.00063 614.87708 134.80763] CT
N
f-109970322
f
GR
GS
[1 0 0 1.00063 614.87708 134.80763] CT
N
f-2086964723
f
GR
GS
[1 0 0 1.00063 614.87708 134.80763] CT
N
f646145173
f
GR
GS
[1 0 0 1.00063 0 -0.33331] CT
0.929 0.694 0.125 RC
1 LJ
3 LW
N
581.987 135.056 M
611.887 135.056 L
S
GR
GS
[1 0 0 1.00063 596.93689 134.80763] CT
0.929 0.694 0.125 RC
10.0 ML
3 LW
N
-4.95 -4.95 M
4.95 4.95 L
-4.95 4.95 M
4.95 -4.95 L
S
GR
GS
[1 0 0 1.00063 0 -0.33331] CT
0.149 GC
10.0 ML
2 LW
N
578 149 M
578 48 L
716 48 L
716 149 L
cp
S
GR
%%Trailer
%%Pages: 1
%%EOF
