ChIP_file	ATAC_file	OL_file	ChIP_peakCount	OL_peakCount	OL_on_ChIP_fraction
ChIP_H3K27ac_E125_FB_rep1	ATAC_E125_FB	ChIP_H3K27ac_E125_FB_rep1_OL_ATAC_E125_FB	   38449	   37050	.96
ChIP_H3K27ac_E125_WP_rep1	ATAC_E125_WP	ChIP_H3K27ac_E125_WP_rep1_OL_ATAC_E125_WP	   56155	   49243	.87
ChIP_H3K27ac_E85_PT_rep1rep2	ATAC_E95_PT	ChIP_H3K27ac_E85_PT_rep1rep2_OL_ATAC_E95_PT	   53057	   41436	.78
ChIP_H3K27ac_HH35_FB_rep1	ATAC_HH35_FB	ChIP_H3K27ac_HH35_FB_rep1_OL_ATAC_HH35_FB	    7002	    6226	.88
ChIP_H3K27ac_HH35_DS_rep1rep2	ATAC_HH35_DS	ChIP_H3K27ac_HH35_DS_rep1rep2_OL_ATAC_HH35_DS	   10032	    8870	.88
ChIP_H3K27ac_HH18_PT_rep1rep2	ATAC_HH19_PT	ChIP_H3K27ac_HH18_PT_rep1rep2_OL_ATAC_HH19_PT	   42726	   38272	.89
