sample_name	filename
placeholder	placeholder
190218_AR_JH_J2_neg.mzML	190218_AR_JH_J2_neg.mzML
190218_AR_JH_A_neg.mzML	190218_AR_JH_A_neg.mzML
190218_AR_JH_C_neg.mzML	190218_AR_JH_C_neg.mzML
190218_AR_JH_G_neg.mzML	190218_AR_JH_G_neg.mzML
190218_AR_JH_I_neg.mzML	190218_AR_JH_I_neg.mzML
190218_AR_JH_O_neg.mzML	190218_AR_JH_O_neg.mzML
190218_AR_JH_PR_neg.mzML	190218_AR_JH_PR_neg.mzML
190218_AR_JH_PO_neg.mzML	190218_AR_JH_PO_neg.mzML
190218_AR_JH_SC__neg.mzML	190218_AR_JH_SC__neg.mzML
190218_AR_JH_SM_neg.mzML	190218_AR_JH_SM_neg.mzML
190218_AR_JH_SO_neg.mzML	190218_AR_JH_SO_neg.mzML
190218_AR_JH_Blank_1_neg.mzML	190218_AR_JH_Blank_1_neg.mzML
